-0.300000000000000  0.196037392654353  0.191370919554357 
-0.299250000000000  0.196381948013880  0.191702042449163 
-0.298500000000000  0.196727445515598  0.192034068969135 
-0.297750000000000  0.197073887276946  0.192367001287506 
-0.297000000000001  0.197421275403318  0.192700841569062 
-0.296250000000001  0.197769611987726  0.193035591969867 
-0.295500000000001  0.198118899110448  0.193371254636969 
-0.294750000000001  0.198469138838670  0.193707831708115 
-0.294000000000000  0.198820333226128  0.194045325311455 
-0.293250000000000  0.199172484312743  0.194383737565241 
-0.292500000000000  0.199525594124247  0.194723070577525 
-0.291750000000001  0.199879664671807  0.195063326445847 
-0.291000000000001  0.200234697951641  0.195404507256928 
-0.290250000000001  0.200590695944628  0.195746615086343 
-0.289500000000001  0.200947660615917  0.196089651998201 
-0.288750000000001  0.201305593914522  0.196433620044819 
-0.288000000000001  0.201664497772917  0.196778521266385 
-0.287250000000001  0.202024374106626  0.197124357690621 
-0.286500000000002  0.202385224813797  0.197471131332436 
-0.285750000000002  0.202747051774783  0.197818844193583 
-0.285000000000002  0.203109856851708  0.198167498262296 
-0.284250000000002  0.203473641888033  0.198517095512942 
-0.283500000000002  0.203838408708101  0.198867637905642 
-0.282750000000002  0.204204159116699  0.199219127385910 
-0.282000000000002  0.204570894898592  0.199571565884272 
-0.281250000000003  0.204938617818061  0.199924955315887 
-0.280500000000003  0.205307329618437  0.200279297580160 
-0.279750000000003  0.205677032021612  0.200634594560340 
-0.279000000000003  0.206047726727564  0.200990848123132 
-0.278250000000003  0.206419415413865  0.201348060118285 
-0.277500000000003  0.206792099735175  0.201706232378183 
-0.276750000000002  0.207165781322744  0.202065366717427 
-0.276000000000003  0.207540461783894  0.202425464932413 
-0.275250000000003  0.207916142701500  0.202786528800898 
-0.274500000000003  0.208292825633464  0.203148560081571 
-0.273750000000003  0.208670512112177  0.203511560513606 
-0.273000000000003  0.209049203643977  0.203875531816214 
-0.272250000000003  0.209428901708599  0.204240475688187 
-0.271500000000003  0.209809607758618  0.204606393807442 
-0.270750000000004  0.210191323218881  0.204973287830544 
-0.270000000000004  0.210574049485935  0.205341159392243 
-0.269250000000004  0.210957787927442  0.205710010104974 
-0.268500000000004  0.211342539881596  0.206079841558390 
-0.267750000000004  0.211728306656517  0.206450655318849 
-0.267000000000004  0.212115089529650  0.206822452928923 
-0.266250000000005  0.212502889747153  0.207195235906880 
-0.265500000000005  0.212891708523264  0.207569005746174 
-0.264750000000005  0.213281547039685  0.207943763914919 
-0.264000000000005  0.213672406444926  0.208319511855352 
-0.263250000000005  0.214064287853673  0.208696250983308 
-0.262500000000005  0.214457192346116  0.209073982687656 
-0.261750000000005  0.214851120967295  0.209452708329761 
-0.261000000000005  0.215246074726419  0.209832429242916 
-0.260250000000005  0.215642054596187  0.210213146731772 
-0.259500000000005  0.216039061512086  0.210594862071763 
-0.258750000000005  0.216437096371705  0.210977576508525 
-0.258000000000005  0.216836160034007  0.211361291257295 
-0.257250000000005  0.217236253318627  0.211746007502320 
-0.256500000000005  0.217637377005123  0.212131726396244 
-0.255750000000006  0.218039531832254  0.212518449059488 
-0.255000000000006  0.218442718497223  0.212906176579634 
-0.254250000000006  0.218846937654918  0.213294910010784 
-0.253500000000006  0.219252189917151  0.213684650372919 
-0.252750000000006  0.219658475851874  0.214075398651255 
-0.252000000000006  0.220065795982395  0.214467155795578 
-0.251250000000006  0.220474150786580  0.214859922719580 
-0.250500000000007  0.220883540696048  0.215253700300179 
-0.249750000000007  0.221293966095350  0.215648489376844 
-0.249000000000007  0.221705427321142  0.216044290750888 
-0.248250000000007  0.222117924661351  0.216441105184778 
-0.247500000000007  0.222531458354324  0.216838933401412 
-0.246750000000007  0.222946028587969  0.217237776083407 
-0.246000000000007  0.223361635498889  0.217637633872368 
-0.245250000000008  0.223778279171498  0.218038507368143 
-0.244500000000007  0.224195959637140  0.218440397128082 
-0.243750000000007  0.224614676873173  0.218843303666273 
-0.243000000000007  0.225034430802075  0.219247227452778 
-0.242250000000007  0.225455221290510  0.219652168912858 
-0.241500000000007  0.225877048148396  0.220058128426180 
-0.240750000000007  0.226299911127966  0.220465106326027 
-0.240000000000008  0.226723809922809  0.220873102898489 
-0.239250000000008  0.227148744166901  0.221282118381648 
-0.238500000000008  0.227574713433636  0.221692152964751 
-0.237750000000008  0.228001717234827  0.222103206787375 
-0.237000000000008  0.228429755019712  0.222515279938583 
-0.236250000000008  0.228858826173942  0.222928372456064 
-0.235500000000008  0.229288930018555  0.223342484325269 
-0.234750000000009  0.229720065808949  0.223757615478532 
-0.234000000000009  0.230152232733824  0.224173765794191 
-0.233250000000009  0.230585429914135  0.224590935095678 
-0.232500000000009  0.231019656402021  0.225009123150624 
-0.231750000000009  0.231454911179717  0.225428329669929 
-0.231000000000009  0.231891193158470  0.225848554306843 
-0.230250000000009  0.232328501177432  0.226269796656018 
-0.229500000000010  0.232766834002541  0.226692056252564 
-0.228750000000010  0.233206190325396  0.227115332571086 
-0.228000000000010  0.233646568762115  0.227539625024706 
-0.227250000000009  0.234087967852185  0.227964932964091 
-0.226500000000009  0.234530386057297  0.228391255676453 
-0.225750000000009  0.234973821760166  0.228818592384536 
-0.225000000000009  0.235418273263354  0.229246942245619 
-0.224250000000010  0.235863738788058  0.229676304350467 
-0.223500000000010  0.236310216472902  0.230106677722316 
-0.222750000000010  0.236757704372719  0.230538061315800 
-0.222000000000010  0.237206200457304  0.230970454015906 
-0.221250000000010  0.237655702610171  0.231403854636896 
-0.220500000000010  0.238106208627296  0.231838261921226 
-0.219750000000010  0.238557716215836  0.232273674538446 
-0.219000000000011  0.239010222992851  0.232710091084103 
-0.218250000000011  0.239463726484004  0.233147510078614 
-0.217500000000011  0.239918224122251  0.233585929966142 
-0.216750000000011  0.240373713246523  0.234025349113452 
-0.216000000000011  0.240830191100388  0.234465765808764 
-0.215250000000011  0.241287654830712  0.234907178260583 
-0.214500000000011  0.241746101486294  0.235349584596530 
-0.213750000000012  0.242205528016503  0.235792982862151 
-0.213000000000012  0.242665931269889  0.236237371019716 
-0.212250000000012  0.243127307992802  0.236682746947020 
-0.211500000000012  0.243589654827973  0.237129108436148 
-0.210750000000012  0.244052968313104  0.237576453192250 
-0.210000000000012  0.244517244879437  0.238024778832292 
-0.209250000000011  0.244982480850317  0.238474082883806 
-0.208500000000012  0.245448672439733  0.238924362783614 
-0.207750000000012  0.245915815750860  0.239375615876552 
-0.207000000000012  0.246383906774582  0.239827839414184 
-0.206250000000012  0.246852941388000  0.240281030553489 
-0.205500000000012  0.247322915352943  0.240735186355552 
-0.204750000000012  0.247793824314450  0.241190303784246 
-0.204000000000012  0.248265663799256  0.241646379704880 
-0.203250000000013  0.248738429214251  0.242103410882861 
-0.202500000000013  0.249212115844955  0.242561393982338 
-0.201750000000013  0.249686718853943  0.243020325564815 
-0.201000000000013  0.250162233279296  0.243480202087787 
-0.200250000000013  0.250638654033020  0.243941019903332 
-0.199500000000013  0.251115975899468  0.244402775256719 
-0.198750000000014  0.251594193533735  0.244865464284981 
-0.198000000000014  0.252073301460063  0.245329083015500 
-0.197250000000014  0.252553294070218  0.245793627364559 
-0.196500000000014  0.253034165621873  0.246259093135900 
-0.195750000000014  0.253515910236964  0.246725476019264 
-0.195000000000014  0.253998521900063  0.247192771588923 
-0.194250000000014  0.254481994456705  0.247660975302197 
-0.193500000000014  0.254966321611745  0.248130082497969 
-0.192750000000014  0.255451496927681  0.248600088395178 
-0.192000000000014  0.255937513822973  0.249070988091316 
-0.191250000000014  0.256424365570357  0.249542776560899 
-0.190500000000014  0.256912045295164  0.250015448653949 
-0.189750000000014  0.257400545973597  0.250488999094440 
-0.189000000000014  0.257889860431040  0.250963422478762 
-0.188250000000015  0.258379981340333  0.251438713274151 
-0.187500000000015  0.258870901220053  0.251914865817132 
-0.186750000000015  0.259362612432783  0.252391874311934 
-0.186000000000015  0.259855107183376  0.252869732828906 
-0.185250000000015  0.260348377517220  0.253348435302934 
-0.184500000000015  0.260842415318481  0.253827975531818 
-0.183750000000015  0.261337212308363  0.254308347174682 
-0.183000000000016  0.261832760043346  0.254789543750343 
-0.182250000000016  0.262329049913426  0.255271558635694 
-0.181500000000016  0.262826073140354  0.255754385064064 
-0.180750000000016  0.263323820775866  0.256238016123578 
-0.180000000000016  0.263822283699912  0.256722444755517 
-0.179250000000016  0.264321452618885  0.257207663752656 
-0.178500000000016  0.264821318063842  0.257693665757608 
-0.177750000000017  0.265321870388735  0.258180443261159 
-0.177000000000016  0.265823099768623  0.258667988600593 
-0.176250000000016  0.266324996197901  0.259156293958019 
-0.175500000000016  0.266827549488517  0.259645351358687 
-0.174750000000016  0.267330749268190  0.260135152669300 
-0.174000000000016  0.267834584978647  0.260625689596327 
-0.173250000000016  0.268339045873822  0.261116953684304 
-0.172500000000017  0.268844121018113  0.261608936314144 
-0.171750000000017  0.269349799284578  0.262101628701418 
-0.171000000000017  0.269856069353191  0.262595021894676 
-0.170250000000017  0.270362919709065  0.263089106773717 
-0.169500000000017  0.270870338640693  0.263583874047896 
-0.168750000000017  0.271378314238201  0.264079314254407 
-0.168000000000017  0.271886834391582  0.264575417756575 
-0.167250000000018  0.272395886788972  0.265072174742144 
-0.166500000000018  0.272905458914905  0.265569575221571 
-0.165750000000018  0.273415538048581  0.266067609026305 
-0.165000000000018  0.273926111262153  0.266566265807085 
-0.164250000000018  0.274437165419016  0.267065535032231 
-0.163500000000018  0.274948687172102  0.267565405985938 
-0.162750000000018  0.275460662962201  0.268065867766571 
-0.162000000000019  0.275973079016273  0.268566909284966 
-0.161250000000019  0.276485921345787  0.269068519262736 
-0.160500000000019  0.276999175745074  0.269570686230574 
-0.159750000000018  0.277512827789682  0.270073398526573 
-0.159000000000018  0.278026862834760  0.270576644294541 
-0.158250000000018  0.278541266013446  0.271080411482325 
-0.157500000000018  0.279056022235279  0.271584687840149 
-0.156750000000019  0.279571116184638  0.272089460918947 
-0.156000000000019  0.280086532319170  0.272594718068718 
-0.155250000000019  0.280602254868271  0.273100446436880 
-0.154500000000019  0.281118267831570  0.273606632966637 
-0.153750000000019  0.281634554977435  0.274113264395356 
-0.153000000000019  0.282151099841510  0.274620327252964 
-0.152250000000019  0.282667885725267  0.275127807860339 
-0.151500000000020  0.283184895694583  0.275635692327732 
-0.150750000000020  0.283702112578363  0.276143966553194 
-0.150000000000020  0.284219518967148  0.276652616221010 
-0.149250000000020  0.284737097211796  0.277161626800174 
-0.148500000000020  0.285254829422165  0.277670983542850 
-0.147750000000020  0.285772697465836  0.278180671482861 
-0.147000000000020  0.286290682966863  0.278690675434221 
-0.146250000000021  0.286808767304560  0.279200979989631 
-0.145500000000021  0.287326931612321  0.279711569519059 
-0.144750000000021  0.287845156776472  0.280222428168284 
-0.144000000000021  0.288363423435163  0.280733539857507 
-0.143250000000021  0.288881711977293  0.281244888279955 
-0.142500000000020  0.289400002541485  0.281756456900522 
-0.141750000000020  0.289918275015083  0.282268228954427 
-0.141000000000021  0.290436509033202  0.282780187445910 
-0.140250000000021  0.290954683977828  0.283292315146947 
-0.139500000000021  0.291472778976950  0.283804594595991 
-0.138750000000021  0.291990772903732  0.284317008096743 
-0.138000000000021  0.292508644375741  0.284829537716960 
-0.137250000000021  0.293026371754245  0.285342165287289 
-0.136500000000022  0.293543933143506  0.285854872400130 
-0.135750000000022  0.294061306390180  0.286367640408543 
-0.135000000000022  0.294578469082732  0.286880450425177 
-0.134250000000022  0.295095398550927  0.287393283321244 
-0.133500000000022  0.295612071865360  0.287906119725530 
-0.132750000000022  0.296128465837053  0.288418940023441 
-0.132000000000022  0.296644557017105  0.288931724356079 
-0.131250000000023  0.297160321696416  0.289444452619394 
-0.130500000000023  0.297675735905435  0.289957104463331 
-0.129750000000023  0.298190775414017  0.290469659291052 
-0.129000000000023  0.298705415731313  0.290982096258189 
-0.128250000000023  0.299219632105737  0.291494394272164 
-0.127500000000023  0.299733399524991  0.292006531991511 
-0.126750000000023  0.300246692716176  0.292518487825306 
-0.126000000000023  0.300759486145949  0.293030239932593 
-0.125250000000023  0.301271754020781  0.293541766221906 
-0.124500000000023  0.301783470287257  0.294053044350809 
-0.123750000000023  0.302294608632469  0.294564051725501 
-0.123000000000023  0.302805142484484  0.295074765500489 
-0.122250000000023  0.303315045012882  0.295585162578304 
-0.121500000000023  0.303824289129387  0.296095219609280 
-0.120750000000024  0.304332847488558  0.296604912991390 
-0.120000000000024  0.304840692488585  0.297114218870153 
-0.119250000000024  0.305347796272144  0.297623113138574 
-0.118500000000024  0.305854130727364  0.298131571437197 
-0.117750000000024  0.306359667488861  0.298639569154176 
-0.117000000000024  0.306864377938857  0.299147081425440 
-0.116250000000024  0.307368233208418  0.299654083134918 
-0.115500000000025  0.307871204178747  0.300160548914828 
-0.114750000000025  0.308373261482593  0.300666453146055 
-0.114000000000025  0.308874375505736  0.301171769958576 
-0.113250000000025  0.309374516388593  0.301676473231982 
-0.112500000000025  0.309873654027897  0.302180536596065 
-0.111750000000025  0.310371758078475  0.302683933431474 
-0.111000000000025  0.310868797955155  0.303186636870469 
-0.110250000000025  0.311364742834729  0.303688619797737 
-0.109500000000025  0.311859561658054  0.304189854851306 
-0.108750000000025  0.312353223132243  0.304690314423504 
-0.108000000000025  0.312845695732959  0.305189970662066 
-0.107250000000025  0.313336947706815  0.305688795471264 
-0.106500000000025  0.313826947073893  0.306186760513154 
-0.105750000000025  0.314315661630354  0.306683837208912 
-0.105000000000026  0.314803058951170  0.307179996740247 
-0.104250000000026  0.315289106392959  0.307675210050919 
-0.103500000000026  0.315773771096946  0.308169447848335 
-0.102750000000026  0.316257019992014  0.308662680605250 
-0.102000000000026  0.316738819797884  0.309154878561549 
-0.101250000000026  0.317219137028416  0.309646011726148 
-0.100500000000026  0.317697937995007  0.310136049878963 
-0.0997500000000269  0.318175188810122  0.310624962573005 
-0.0990000000000268  0.318650855390932  0.311112719136556 
-0.0982500000000268  0.319124903463073  0.311599288675459 
-0.0975000000000268  0.319597298564538  0.312084640075490 
-0.0967500000000268  0.320068006049657  0.312568742004866 
-0.0960000000000267  0.320536991093229  0.313051562916819 
-0.0952500000000267  0.321004218694764  0.313533071052312 
-0.0945000000000276  0.321469653682833  0.314013234442830 
-0.0937500000000275  0.321933260719566  0.314492020913303 
-0.0930000000000275  0.322395004305246  0.314969398085121 
-0.0922500000000275  0.322854848783036  0.315445333379265 
-0.0915000000000274  0.323312758343853  0.315919794019554 
-0.0907500000000274  0.323768697031304  0.316392747035982 
-0.0900000000000274  0.324222628746823  0.316864159268206 
-0.0892500000000283  0.324674517254860  0.317333997369095 
-0.0885000000000282  0.325124326188247  0.317802227808447 
-0.0877500000000282  0.325572019053649  0.318268816876761 
-0.0870000000000282  0.326017559237163  0.318733730689189 
-0.0862500000000281  0.326460910010028  0.319196935189545 
-0.0855000000000281  0.326902034534463  0.319658396154469 
-0.0847500000000281  0.327340895869608  0.320118079197685 
-0.0840000000000289  0.327777456977633  0.320575949774385 
-0.0832500000000289  0.328211680729904  0.321031973185727 
-0.0825000000000289  0.328643529913324  0.321486114583457 
-0.0817500000000289  0.329072967236762  0.321938338974638 
-0.0810000000000288  0.329499955337613  0.322388611226494 
-0.0802500000000288  0.329924456788482  0.322836896071398 
-0.0795000000000288  0.330346434103952  0.323283158111936 
-0.0787500000000296  0.330765849747520  0.323727361826128 
-0.0780000000000296  0.331182666138603  0.324169471572742 
-0.0772500000000296  0.331596845659676  0.324609451596737 
-0.0765000000000295  0.332008350663513  0.325047266034804 
-0.0757500000000295  0.332417143480563  0.325482878921061 
-0.0750000000000295  0.332823186426386  0.325916254192821 
-0.0742500000000303  0.333226441809260  0.326347355696514 
-0.0735000000000303  0.333626871937827  0.326776147193689 
-0.0727500000000303  0.334024439128902  0.327202592367160 
-0.0720000000000303  0.334419105715325  0.327626654827241 
-0.0712500000000302  0.334810834053975  0.328048298118125 
-0.0705000000000302  0.335199586533828  0.328467485724337 
-0.0697500000000302  0.335585325584136  0.328884181077319 
-0.0690000000000310  0.335968013682693  0.329298347562145 
-0.0682500000000310  0.336347613364191  0.329709948524284 
-0.0675000000000310  0.336724087228668  0.330118947276543 
-0.0667500000000310  0.337097397950022  0.330525307106073 
-0.0660000000000309  0.337467508284642  0.330928991281467 
-0.0652500000000309  0.337834381080073  0.331329963060013 
-0.0645000000000309  0.338197979283801  0.331728185694992 
-0.0637500000000317  0.338558265952078  0.332123622443124 
-0.0630000000000317  0.338915204258834  0.332516236572075 
-0.0622500000000317  0.339268757504651  0.332905991368067 
-0.0615000000000316  0.339618889125798  0.333292850143608 
-0.0607500000000316  0.339965562703327  0.333676776245281 
-0.0600000000000316  0.340308741972225  0.334057733061644 
-0.0592500000000316  0.340648390830621  0.334435684031199 
-0.0585000000000324  0.340984473349039  0.334810592650467 
-0.0577500000000324  0.341316953779688  0.335182422482123 
-0.0570000000000324  0.341645796565815  0.335551137163243 
-0.0562500000000323  0.341970966351072  0.335916700413584 
-0.0555000000000323  0.342292427988916  0.336279076043971 
-0.0547500000000323  0.342610146552059  0.336638227964755 
-0.0540000000000322  0.342924087341926  0.336994120194315 
-0.0532500000000331  0.343234215898129  0.337346716867654 
-0.0525000000000331  0.343540498007970  0.337695982245039 
-0.0517500000000330  0.343842899715945  0.338041880720709 
-0.0510000000000330  0.344141387333249  0.338384376831630 
-0.0502500000000330  0.344435927447313  0.338723435266313 
-0.0495000000000330  0.344726486931299  0.339059020873670 
-0.0487500000000329  0.345013032953607  0.339391098671933 
-0.0480000000000338  0.345295532987366  0.339719633857585 
-0.0472500000000338  0.345573954819919  0.340044591814358 
-0.0465000000000337  0.345848266562265  0.340365938122255 
-0.0457500000000337  0.346118436658487  0.340683638566590 
-0.0450000000000337  0.346384433895152  0.340997659147079 
-0.0442500000000337  0.346646227410657  0.341307966086915 
-0.0435000000000336  0.346903786704556  0.341614525841918 
-0.0427500000000345  0.347157081646810  0.341917305109635 
-0.0420000000000345  0.347406082487015  0.342216270838491 
-0.0412500000000344  0.347650759863559  0.342511390236945 
-0.0405000000000344  0.347891084812701  0.342802630782609 
-0.0397500000000344  0.348127028777615  0.343089960231418 
-0.0390000000000343  0.348358563617330  0.343373346626746 
-0.0382500000000343  0.348585661615615  0.343652758308531 
-0.0375000000000352  0.348808295489759  0.343928163922379 
-0.0367500000000351  0.349026438399277  0.344199532428641 
-0.0360000000000351  0.349240063954532  0.344466833111475 
-0.0352500000000351  0.349449146225219  0.344730035587866 
-0.0345000000000351  0.349653659748791  0.344989109816605 
-0.0337500000000350  0.349853579538745  0.345244026107250 
-0.0330000000000350  0.350048881092810  0.345494755129004 
-0.0322500000000359  0.350239540401005  0.345741267919584 
-0.0315000000000358  0.350425533953577  0.345983535894003 
-0.0307500000000358  0.350606838748803  0.346221530853306 
-0.0300000000000358  0.350783432300685  0.346455224993235 
-0.0292500000000357  0.350955292646464  0.346684590912825 
-0.0285000000000357  0.351122398354018  0.346909601622932 
-0.0277500000000357  0.351284728529095  0.347130230554658 
-0.0270000000000366  0.351442262822427  0.347346451567723 
-0.0262500000000365  0.351594981436641  0.347558238958734 
-0.0255000000000365  0.351742865133020  0.347765567469333 
-0.0247500000000365  0.351885895238125  0.347968412294288 
-0.0240000000000364  0.352024053650214  0.348166749089454 
-0.0232500000000364  0.352157322845493  0.348360553979628 
-0.0225000000000364  0.352285685884196  0.348549803566298 
-0.0217500000000372  0.352409126416482  0.348734474935254 
-0.0210000000000372  0.352527628688114  0.348914545664097 
-0.0202500000000372  0.352641177546008  0.349089993829617 
-0.0195000000000372  0.352749758443505  0.349260798015017 
-0.0187500000000371  0.352853357445529  0.349426937317024 
-0.0180000000000371  0.352951961233478  0.349588391352842 
-0.0172500000000371  0.353045557109934  0.349745140266978 
-0.0165000000000379  0.353134133003167  0.349897164737882 
-0.0157500000000379  0.353217677471428  0.350044445984471 
-0.0150000000000379  0.353296179707009  0.350186965772472 
-0.0142500000000378  0.353369629540107  0.350324706420604 
-0.0135000000000378  0.353438017442452  0.350457650806596 
-0.0127500000000378  0.353501334530724  0.350585782373031 
-0.0120000000000386  0.353559572569736  0.350709085133018 
-0.0112500000000386  0.353612723975381  0.350827543675684 
-0.0105000000000386  0.353660781817377  0.350941143171476 
-0.00975000000003856  0.353703739821752  0.351049869377288 
-0.00900000000003853  0.353741592373096  0.351153708641387 
-0.00825000000003850  0.353774334516620  0.351252647908167 
-0.00750000000003848  0.353801961959918  0.351346674722677 
-0.00675000000003934  0.353824471074524  0.351435777234975 
-0.00600000000003931  0.353841858897235  0.351519944204254 
-0.00525000000003928  0.353854123131185  0.351599165002810 
-0.00450000000003925  0.353861262146657  0.351673429619726 
-0.00375000000003922  0.353863274981712  0.351742728664435 
-0.00300000000003919  0.353860161342506  0.351807053370002 
-0.00225000000003917  0.353851921603422  0.351866395596216 
-0.00150000000004002  0.353838556806920  0.351920747832477 
-0.000750000000039996  0.353820068663165  0.351970103200436 
-3.99680288865056e-14  0.353796459549428  0.352014455456437 
 0.000749999999960060  0.353767732509203  0.352053798993726 
 0.00149999999996009  0.353733891251129  0.352088128844447 
 0.00224999999996012  0.353694940147634  0.352117440681392 
 0.00299999999996015  0.353650884233371  0.352141730819542 
 0.00374999999995929  0.353601729203403  0.352160996217376 
 0.00449999999995931  0.353547481411149  0.352175234477941 
 0.00524999999995934  0.353488147866088  0.352184443849723 
 0.00599999999995937  0.353423736231263  0.352188623227238 
 0.00674999999995940  0.353354254820508  0.352187772151443 
 0.00749999999995943  0.353279712595481  0.352181890809885 
 0.00824999999995946  0.353200119162445  0.352170980036622 
 0.00899999999995860  0.353115484768844  0.352155041311938 
 0.00974999999995863  0.353025820299647  0.352134076761794 
 0.0104999999999587  0.352931137273459  0.352108089157061 
 0.0112499999999587  0.352831447838438  0.352077081912544 
 0.0119999999999587  0.352726764767987  0.352041059085742 
 0.0127499999999587  0.352617101456223  0.352000025375402 
 0.0134999999999588  0.352502471913258  0.351953986119846 
 0.0142499999999579  0.352382890760245  0.351902947295055 
 0.0149999999999579  0.352258373224273  0.351846915512562 
 0.0157499999999580  0.352128935132995  0.351785898017068 
 0.0164999999999580  0.351994592909120  0.351719902683908 
 0.0172499999999580  0.351855363564681  0.351648938016217 
 0.0179999999999580  0.351711264695133  0.351573013141958 
 0.0187499999999581  0.351562314473240  0.351492137810660 
 0.0194999999999572  0.351408531642831  0.351406322390009 
 0.0202499999999572  0.351249935512330  0.351315577862173 
 0.0209999999999573  0.351086545948148  0.351219915819956 
 0.0217499999999573  0.350918383367889  0.351119348462736 
 0.0224999999999573  0.350745468733409  0.351013888592177 
 0.0232499999999574  0.350567823543716  0.350903549607779 
 0.0239999999999574  0.350385469827691  0.350788345502205 
 0.0247499999999565  0.350198430136713  0.350668290856420 
 0.0254999999999566  0.350006727537074  0.350543400834637 
 0.0262499999999566  0.349810385602326  0.350413691179086 
 0.0269999999999566  0.349609428405423  0.350279178204585 
 0.0277499999999566  0.349403880510799  0.350139878792937 
 0.0284999999999567  0.349193766966278  0.349995810387157 
 0.0292499999999567  0.348979113294877  0.349846990985514 
 0.0299999999999558  0.348759945486508  0.349693439135409 
 0.0307499999999559  0.348536289989549  0.349535173927090 
 0.0314999999999559  0.348308173702345  0.349372214987211 
 0.0322499999999559  0.348075623964561  0.349204582472227 
 0.0329999999999560  0.347838668548487  0.349032297061628 
 0.0337499999999560  0.347597335650221  0.348855379951036 
 0.0344999999999560  0.347351653880820  0.348673852845189 
 0.0352499999999552  0.347101652257289  0.348487737950700 
 0.0359999999999552  0.346847360193596  0.348297057968792 
 0.0367499999999552  0.346588807491527  0.348101836087802 
 0.0374999999999552  0.346326024331553  0.347902095975635 
 0.0382499999999553  0.346059041263600  0.347697861772055 
 0.0389999999999553  0.345787889197758  0.347489158080861 
 0.0397499999999553  0.345512599394997  0.347276009961988 
 0.0404999999999545  0.345233203457773  0.347058442923461 
 0.0412499999999545  0.344949733320642  0.346836482913262 
 0.0419999999999545  0.344662221240832  0.346610156311105 
 0.0427499999999545  0.344370699788784  0.346379489920114 
 0.0434999999999546  0.344075201838673  0.346144510958423 
 0.0442499999999546  0.343775760558914  0.345905247050673 
 0.0449999999999546  0.343472409402651  0.345661726219457 
 0.0457499999999538  0.343165182098247  0.345413976876679 
 0.0464999999999538  0.342854112639773  0.345162027814846 
 0.0472499999999538  0.342539235277472  0.344905908198300 
 0.0479999999999539  0.342220584508277  0.344645647554394 
 0.0487499999999539  0.341898195066302  0.344381275764619 
 0.0494999999999539  0.341572101913356  0.344112823055664 
 0.0502499999999539  0.341242340229493  0.343840319990462 
 0.0509999999999531  0.340908945403584  0.343563797459176 
 0.0517499999999531  0.340571953023883  0.343283286670167 
 0.0524999999999531  0.340231398868683  0.342998819140916 
 0.0532499999999532  0.339887318896959  0.342710426688928 
 0.0539999999999532  0.339539749239087  0.342418141422648 
 0.0547499999999532  0.339188726187583  0.342121995732291 
 0.0554999999999524  0.338834286187913  0.341822022280759 
 0.0562499999999524  0.338476465829333  0.341518253994451 
 0.0569999999999524  0.338115301835809  0.341210724054159 
 0.0577499999999525  0.337750831056975  0.340899465885905 
 0.0584999999999525  0.337383090459162  0.340584513151819 
 0.0592499999999525  0.337012117116513  0.340265899741029 
 0.0599999999999525  0.336637948202136  0.339943659760546 
 0.0607499999999517  0.336260620979346  0.339617827526193 
 0.0614999999999517  0.335880172792989  0.339288437553534 
 0.0622499999999517  0.335496641060833  0.338955524548869 
 0.0629999999999518  0.335110063265057  0.338619123400220 
 0.0637499999999518  0.334720476943795  0.338279269168371 
 0.0644999999999518  0.334327919682811  0.337935997077969 
 0.0652499999999518  0.333932429107227  0.337589342508627 
 0.0659999999999510  0.333534042873356  0.337239340986106 
 0.0667499999999510  0.333132798660640  0.336886028173539 
 0.0674999999999510  0.332728734163667  0.336529439862712 
 0.0682499999999511  0.332321887084310  0.336169611965392 
 0.0689999999999511  0.331912295123942  0.335806580504731 
 0.0697499999999511  0.331499995975767  0.335440381606731 
 0.0704999999999512  0.331085027317274  0.335071051491753 
 0.0712499999999503  0.330667426802756  0.334698626466147 
 0.0719999999999503  0.330247232055989  0.334323142913893 
 0.0727499999999504  0.329824480662967  0.333944637288377 
 0.0734999999999504  0.329399210164800  0.333563146104197 
 0.0742499999999504  0.328971458050690  0.333178705929087 
 0.0749999999999504  0.328541261751041  0.332791353375897 
 0.0757499999999505  0.328108658630671  0.332401125094685 
 0.0764999999999496  0.327673685982150  0.332008057764875 
 0.0772499999999496  0.327236381019254  0.331612188087512 
 0.0779999999999497  0.326796780870540  0.331213552777633 
 0.0787499999999497  0.326354922573028  0.330812188556695 
 0.0794999999999497  0.325910843066026  0.330408132145121 
 0.0802499999999498  0.325464579185052  0.330001420254950 
 0.0809999999999498  0.325016167655896  0.329592089582586 
 0.0817499999999489  0.324565645088788  0.329180176801623 
 0.0824999999999489  0.324113047972708  0.328765718555811 
 0.0832499999999490  0.323658412669797  0.328348751452107 
 0.0839999999999490  0.323201775409915  0.327929312053839 
 0.0847499999999490  0.322743172285291  0.327507436873973 
 0.0854999999999491  0.322282639245330  0.327083162368493 
 0.0862499999999491  0.321820212091518  0.326656524929894 
 0.0869999999999482  0.321355926472467  0.326227560880779 
 0.0877499999999483  0.320889817879064  0.325796306467571 
 0.0884999999999483  0.320421921639771  0.325362797854355 
 0.0892499999999483  0.319952272916010  0.324927071116790 
 0.0899999999999483  0.319480906697710  0.324489162236200 
 0.0907499999999484  0.319007857798949  0.324049107093721 
 0.0914999999999484  0.318533160853730  0.323606941464596 
 0.0922499999999475  0.318056850311859  0.323162701012574 
 0.0929999999999476  0.317578960434974  0.322716421284441 
 0.0937499999999476  0.317099525292673  0.322268137704645 
 0.0944999999999476  0.316618578758758  0.321817885570059 
 0.0952499999999477  0.316136154507619  0.321365700044856 
 0.0959999999999477  0.315652286010699  0.320911616155482 
 0.0967499999999477  0.315167006533117  0.320455668785782 
 0.0974999999999469  0.314680349130383  0.319997892672215 
 0.0982499999999469  0.314192346645221  0.319538322399196 
 0.0989999999999469  0.313703031704535  0.319076992394564 
 0.0997499999999469  0.313212436716448  0.318613936925146 
 0.100499999999947  0.312720593867492  0.318149190092451 
 0.101249999999947  0.312227535119886  0.317682785828492 
 0.101999999999947  0.311733292208923  0.317214757891698 
 0.102749999999946  0.311237896640482  0.316745139862957 
 0.103499999999946  0.310741379688621  0.316273965141771 
 0.104249999999946  0.310243772393299  0.315801266942526 
 0.104999999999946  0.309745105558203  0.315327078290876 
 0.105749999999946  0.309245409748659  0.314851432020237 
 0.106499999999946  0.308744715289653  0.314374360768392 
 0.107249999999946  0.308243052263967  0.313895896974212 
 0.107999999999945  0.307740450510402  0.313416072874489 
 0.108749999999946  0.307236939622095  0.312934920500867 
 0.109499999999946  0.306732548944936  0.312452471676897 
 0.110249999999946  0.306227307576094  0.311968758015191 
 0.110999999999946  0.305721244362617  0.311483810914676 
 0.111749999999946  0.305214387900131  0.310997661557979 
 0.112499999999946  0.304706766531643  0.310510340908882 
 0.113249999999945  0.304198408346403  0.310021879709908 
 0.113999999999945  0.303689341178896  0.309532308479996 
 0.114749999999945  0.303179592607879  0.309041657512284 
 0.115499999999945  0.302669189955531  0.308549956871988 
 0.116249999999945  0.302158160286675  0.308057236394379 
 0.116999999999945  0.301646530408091  0.307563525682862 
 0.117749999999944  0.301134326867889  0.307068854107149 
 0.118499999999944  0.300621575954982  0.306573250801524 
 0.119249999999944  0.300108303698635  0.306076744663211 
 0.119999999999944  0.299594535868074  0.305579364350828 
 0.120749999999944  0.299080297972190  0.305081138282926 
 0.121499999999944  0.298565615259292  0.304582094636636 
 0.122249999999944  0.298050512716961  0.304082261346380 
 0.122999999999943  0.297535015071945  0.303581666102695 
 0.123749999999943  0.297019146790141  0.303080336351129 
 0.124499999999943  0.296502932076630  0.302578299291206 
 0.125249999999943  0.295986394875806  0.302075581875520 
 0.125999999999943  0.295469558871524  0.301572210808857 
 0.126749999999944  0.294952447487347  0.301068212547431 
 0.127499999999944  0.294435083886838  0.300563613298186 
 0.128249999999943  0.293917490973921  0.300058439018185 
 0.128999999999943  0.293399691393281  0.299552715414061 
 0.129749999999943  0.292881707530848  0.299046467941551 
 0.130499999999943  0.292363561514313  0.298539721805102 
 0.131249999999943  0.291845275213704  0.298032501957557 
 0.131999999999943  0.291326870242023  0.297524833099883 
 0.132749999999943  0.290808367955920  0.297016739681004 
 0.133499999999942  0.290289789456436  0.296508245897683 
 0.134249999999942  0.289771155589756  0.295999375694454 
 0.134999999999942  0.289252486948064  0.295490152763659 
 0.135749999999942  0.288733803870396  0.294980600545507 
 0.136499999999942  0.288215126443556  0.294470742228218 
 0.137249999999942  0.287696474503073  0.293960600748223 
 0.137999999999942  0.287177867634204  0.293450198790410 
 0.138749999999941  0.286659325172964  0.292939558788453 
 0.139499999999941  0.286140866207215  0.292428702925170 
 0.140249999999941  0.285622509577766  0.291917653132954 
 0.140999999999941  0.285104273879531  0.291406431094243 
 0.141749999999941  0.284586177462717  0.290895058242058 
 0.142499999999941  0.284068238434037  0.290383555760572 
 0.143249999999941  0.283550474657969  0.289871944585753 
 0.143999999999941  0.283032903758033  0.289360245406027 
 0.144749999999941  0.282515543118103  0.288848478663005 
 0.145499999999941  0.281998409883761  0.288336664552250 
 0.146249999999941  0.281481520963657  0.287824823024101 
 0.146999999999941  0.280964893030903  0.287312973784506 
 0.147749999999941  0.280448542524514  0.286801136295936 
 0.148499999999941  0.279932485650836  0.286289329778311 
 0.149249999999940  0.279416738385034  0.285777573209977 
 0.149999999999940  0.278901316472570  0.285265885328722 
 0.150749999999940  0.278386235430732  0.284754284632818 
 0.151499999999940  0.277871510550162  0.284242789382110 
 0.152249999999940  0.277357156896423  0.283731417599133 
 0.152999999999940  0.276843189311558  0.283220187070263 
 0.153749999999940  0.276329622415695  0.282709115346896 
 0.154499999999939  0.275816470608649  0.282198219746671 
 0.155249999999939  0.275303748071551  0.281687517354694 
 0.155999999999939  0.274791468768490  0.281177025024836 
 0.156749999999939  0.274279646448153  0.280666759381002 
 0.157499999999939  0.273768294645518  0.280156736818485 
 0.158249999999939  0.273257426683507  0.279646973505289 
 0.158999999999939  0.272747055674689  0.279137485383523 
 0.159749999999939  0.272237194522992  0.278628288170789 
 0.160499999999939  0.271727855925398  0.278119397361604 
 0.161249999999939  0.271219052373671  0.277610828228840 
 0.161999999999939  0.270710796156093  0.277102595825190 
 0.162749999999939  0.270203099359192  0.276594714984639 
 0.163499999999939  0.269695973869493  0.276087200323974 
 0.164249999999939  0.269189431375269  0.275580066244291 
 0.164999999999938  0.268683483368292  0.275073326932531 
 0.165749999999938  0.268178141145602  0.274566996363036 
 0.166499999999938  0.267673415811270  0.274061088299103 
 0.167249999999938  0.267169318278168  0.273555616294563 
 0.167999999999938  0.266665859269741  0.273050593695380 
 0.168749999999938  0.266163049321786  0.272546033641246 
 0.169499999999938  0.265660898784226  0.272041949067201 
 0.170249999999937  0.265159417822891  0.271538352705255 
 0.170999999999937  0.264658616421293  0.271035257086024 
 0.171749999999937  0.264158504382419  0.270532674540388 
 0.172499999999937  0.263659091330489  0.270030617201121 
 0.173249999999937  0.263160386712760  0.269529097004579 
 0.173999999999937  0.262662399801282  0.269028125692353 
 0.174749999999937  0.262165139694692  0.268527714812950 
 0.175499999999936  0.261668615319972  0.268027875723474 
 0.176249999999937  0.261172835434230  0.267528619591314 
 0.176999999999937  0.260677808626466  0.267029957395835 
 0.177749999999937  0.260183543319341  0.266531899930079 
 0.178499999999937  0.259690047770922  0.266034457802457 
 0.179249999999937  0.259197330076462  0.265537641438456 
 0.179999999999937  0.258705398170128  0.265041461082339 
 0.180749999999936  0.258214259826768  0.264545926798860 
 0.181499999999936  0.257723922663637  0.264051048474963 
 0.182249999999936  0.257234394142140  0.263556835821495 
 0.182999999999936  0.256745681569563  0.263063298374916 
 0.183749999999936  0.256257792100788  0.262570445499000 
 0.184499999999936  0.255770732740017  0.262078286386552 
 0.185249999999935  0.255284510342477  0.261586830061109 
 0.185999999999935  0.254799131616120  0.261096085378645 
 0.186749999999935  0.254314603123325  0.260606061029276 
 0.187499999999935  0.253830931282575  0.260116765538954 
 0.188249999999935  0.253348122370140  0.259628207271173 
 0.188999999999935  0.252866182521746  0.259140394428658 
 0.189749999999935  0.252385117734238  0.258653335055050 
 0.190499999999934  0.251904933867225  0.258167037036603 
 0.191249999999934  0.251425636644730  0.257681508103855 
 0.191999999999934  0.250947231656825  0.257196755833311 
 0.192749999999934  0.250469724361245  0.256712787649111 
 0.193499999999935  0.249993120085018  0.256229610824698 
 0.194249999999935  0.249517424026057  0.255747232484475 
 0.194999999999935  0.249042641254758  0.255265659605462 
 0.195749999999934  0.248568776715587  0.254784899018946 
 0.196499999999934  0.248095835228651  0.254304957412106 
 0.197249999999934  0.247623821491267  0.253825841329673 
 0.197999999999934  0.247152740079507  0.253347557175531 
 0.198749999999934  0.246682595449747  0.252870111214354 
 0.199499999999934  0.246213391940192  0.252393509573205 
 0.200249999999934  0.245745133772405  0.251917758243150 
 0.200999999999933  0.245277825052806  0.251442863080841 
 0.201749999999933  0.244811469774176  0.250968829810113 
 0.202499999999933  0.244346071817141  0.250495664023555 
 0.203249999999933  0.243881634951651  0.250023371184084 
 0.203999999999933  0.243418162838437  0.249551956626502 
 0.204749999999933  0.242955659030465  0.249081425559045 
 0.205499999999933  0.242494126974382  0.248611783064930 
 0.206249999999932  0.242033570011937  0.248143034103884 
 0.206999999999932  0.241573991381397  0.247675183513663 
 0.207749999999932  0.241115394218961  0.247208236011567 
 0.208499999999932  0.240657781560145  0.246742196195947 
 0.209249999999932  0.240201156341162  0.246277068547687 
 0.209999999999932  0.239745521400296  0.245812857431693 
 0.210749999999932  0.239290879479256  0.245349567098366 
 0.211499999999932  0.238837233224521  0.244887201685055 
 0.212249999999932  0.238384585188674  0.244425765217514 
 0.212999999999932  0.237932937831717  0.243965261611341 
 0.213749999999932  0.237482293522392  0.243505694673404 
 0.214499999999932  0.237032654539462  0.243047068103261 
 0.215249999999932  0.236584023073004  0.242589385494565 
 0.215999999999932  0.236136401225682  0.242132650336467 
 0.216749999999931  0.235689791014002  0.241676866014986 
 0.217499999999931  0.235244194369563  0.241222035814399 
 0.218249999999931  0.234799613140290  0.240768162918596 
 0.218999999999931  0.234356049091661  0.240315250412428 
 0.219749999999931  0.233913503907915  0.239863301283052 
 0.220499999999931  0.233471979193255  0.239412318421257 
 0.221249999999931  0.233031476473032  0.238962304622782 
 0.221999999999930  0.232591997194920  0.238513262589620 
 0.222749999999930  0.232153542730078  0.238065194931314 
 0.223499999999930  0.231716114374313  0.237618104166238 
 0.224249999999930  0.231279713349196  0.237171992722868 
 0.224999999999930  0.230844340803216  0.236726862941041 
 0.225749999999930  0.230409997812874  0.236282717073204 
 0.226499999999930  0.229976685383797  0.235839557285652 
 0.227249999999930  0.229544404451832  0.235397385659747 
 0.227999999999930  0.229113155884117  0.234956204193136 
 0.228749999999930  0.228682940480155  0.234516014800952 
 0.229499999999930  0.228253758972870  0.234076819317001 
 0.230249999999930  0.227825612029657  0.233638619494946 
 0.230999999999930  0.227398500253403  0.233201417009465 
 0.231749999999930  0.226972424183523  0.232765213457417 
 0.232499999999929  0.226547384296962  0.232330010358979 
 0.233249999999929  0.226123381009195  0.231895809158776 
 0.233999999999929  0.225700414675221  0.231462611227012 
 0.234749999999929  0.225278485590531  0.231030417860567 
 0.235499999999929  0.224857593992082  0.230599230284108 
 0.236249999999929  0.224437740059246  0.230169049651163 
 0.236999999999929  0.224018923914753  0.229739877045204 
 0.237749999999928  0.223601145625631  0.229311713480713 
 0.238499999999928  0.223184405204113  0.228884559904226 
 0.239249999999928  0.222768702608565  0.228458417195382 
 0.239999999999928  0.222354037744374  0.228033286167952 
 0.240749999999928  0.221940410464839  0.227609167570854 
 0.241499999999928  0.221527820572055  0.227186062089172 
 0.242249999999928  0.221116267817775  0.226763970345138 
 0.242999999999927  0.220705751904271  0.226342892899129 
 0.243749999999928  0.220296272485180  0.225922830250642 
 0.244499999999928  0.219887829166339  0.225503782839253 
 0.245249999999928  0.219480421506617  0.225085751045572 
 0.245999999999928  0.219074049018726  0.224668735192194 
 0.246749999999928  0.218668711170029  0.224252735544619 
 0.247499999999927  0.218264407383340  0.223837752312181 
 0.248249999999927  0.217861137037703  0.223423785648956 
 0.248999999999927  0.217458899469176  0.223010835654668 
 0.249749999999927  0.217057693971596  0.222598902375571 
 0.250499999999927  0.216657519797328  0.222187985805333 
 0.251249999999927  0.216258376158031  0.221778085885909 
 0.251999999999927  0.215860262225374  0.221369202508392 
 0.252749999999926  0.215463177131783  0.220961335513871 
 0.253499999999926  0.215067119971147  0.220554484694261 
 0.254249999999926  0.214672089799536  0.220148649793140 
 0.254999999999926  0.214278085635901  0.219743830506561 
 0.255749999999926  0.213885106462763  0.219340026483870 
 0.256499999999926  0.213493151226896  0.218937237328495 
 0.257249999999926  0.213102218840003  0.218535462598742 
 0.257999999999925  0.212712308179379  0.218134701808575 
 0.258749999999925  0.212323418088568  0.217734954428383 
 0.259499999999925  0.211935547378011  0.217336219885744 
 0.260249999999925  0.211548694825684  0.216938497566174 
 0.260999999999926  0.211162859177728  0.216541786813874 
 0.261749999999926  0.210778039149071  0.216146086932455 
 0.262499999999926  0.210394233424045  0.215751397185666 
 0.263249999999925  0.210011440656984  0.215357716798111 
 0.263999999999925  0.209629659472830  0.214965044955951 
 0.264749999999925  0.209248888467713  0.214573380807599 
 0.265499999999925  0.208869126209540  0.214182723464413 
 0.266249999999925  0.208490371238564  0.213793072001370 
 0.266999999999925  0.208112622067950  0.213404425457738 
 0.267749999999925  0.207735877184328  0.213016782837738 
 0.268499999999924  0.207360135048354  0.212630143111196 
 0.269249999999924  0.206985394095238  0.212244505214187 
 0.269999999999924  0.206611652735292  0.211859868049670 
 0.270749999999924  0.206238909354445  0.211476230488123 
 0.271499999999924  0.205867162314771  0.211093591368149 
 0.272249999999924  0.205496409954999  0.210711949497099 
 0.272999999999924  0.205126650591018  0.210331303651671 
 0.273749999999923  0.204757882516375  0.209951652578504 
 0.274499999999923  0.204390104002764  0.209572994994764 
 0.275249999999923  0.204023313300518  0.209195329588729 
 0.275999999999923  0.203657508639072  0.208818655020355 
 0.276749999999923  0.203292688227450  0.208442969921843 
 0.277499999999923  0.202928850254714  0.208068272898191 
 0.278249999999924  0.202565992890431  0.207694562527747 
 0.278999999999923  0.202204114285116  0.207321837362749 
 0.279749999999923  0.201843212570684  0.206950095929859 
 0.280499999999923  0.201483285860876  0.206579336730687 
 0.281249999999923  0.201124332251704  0.206209558242313 
 0.281999999999923  0.200766349821861  0.205840758917796 
 0.282749999999923  0.200409336633152  0.205472937186684 
 0.283499999999923  0.200053290730896  0.205106091455506 
 0.284249999999922  0.199698210144341  0.204740220108267 
 0.284999999999922  0.199344092887059  0.204375321506930 
 0.285749999999922  0.198990936957338  0.204011393991896 
 0.286499999999922  0.198638740338578  0.203648435882469 
 0.287249999999922  0.198287500999668  0.203286445477327 
 0.287999999999922  0.197937216895364  0.202925421054976 
 0.288749999999922  0.197587885966659  0.202565360874198 
 0.289499999999921  0.197239506141152  0.202206263174501 
 0.290249999999921  0.196892075333403  0.201848126176552 
 0.290999999999921  0.196545591445293  0.201490948082613 
 0.291749999999921  0.196200052366370  0.201134727076964 
 0.292499999999921  0.195855455974193  0.200779461326325 
 0.293249999999921  0.195511800134670  0.200425148980264 
 0.293999999999921  0.195169082702395  0.200071788171612 
 0.294749999999921  0.194827301520973  0.199719377016857 
 0.295499999999921  0.194486454423344  0.199367913616546 
 0.296249999999921  0.194146539232099  0.199017396055669 
 0.296999999999921  0.193807553759801  0.198667822404049 
 0.297749999999921  0.193469495809281  0.198319190716714 
 0.298499999999921  0.193132363173954  0.197971499034277 
 0.299249999999921  0.192796153638111  0.197624745383295 
 0.300000000000000  0.192460864977178  0.197278927776603 
