-3.00000000000000  0.802005713133552  117.614476818996  8.02005713133552  117.614476818996  1.60401142626710 -152.505606255275  16.0401142626710  27.4943937447250 
-2.97000000000000  0.874363843829839  123.903224207864  8.74363843829839  123.903224207864  1.74872768765968 -146.216858866407  17.4872768765968  33.7831411335927 
-2.94000000000000  0.952296658207835  130.138501611577  9.52296658207835  130.138501611577  1.90459331641567 -139.981581462695  19.0459331641567  40.0184185373052 
-2.91000000000000  1.03613463412066  136.320345602892  10.3613463412066  136.320345602892  2.07226926824132 -133.799737471380  20.7226926824132  46.2002625286202 
-2.88000000000000  1.12621823434950  142.448799869428  11.2621823434950  142.448799869428  2.25243646869901 -127.671283204843  22.5243646869901  52.3287167951567 
-2.85000000000000  1.22289727921196  148.523914657990  12.2289727921196  148.523914657990  2.44579455842391 -121.596168416282  24.4579455842391  58.4038315837183 
-2.82000000000000  1.32653021249014  154.545746222340  13.2653021249014  154.545746222340  2.65306042498028 -115.574336851931  26.5306042498028  64.4256631480688 
-2.79000000000000  1.43748325647359  160.514356276645  14.3748325647359  160.514356276645  2.87496651294718 -109.605726797627  28.7496651294718  70.3942732023734 
-2.76000000000000  1.55612945242115  166.429811456591  15.5612945242115  166.429811456591  3.11225890484231 -103.690271617681  31.1225890484231  76.3097283823193 
-2.73000000000000  1.68284758332806  172.292182790000  16.8284758332806  172.292182790000  3.36569516665612 -97.8279002842711  33.6569516665612  82.1720997157289 
-2.70000000000000  1.81802097653924  178.101545178559  18.1802097653924  178.101545178559  3.63604195307848 -92.0185378957128  36.3604195307848  87.9814621042872 
-2.67000000000000  1.96203618447589 -176.142023107900  19.6203618447589 -176.142023107900  3.92407236895179 -86.2621061821715  39.2407236895179  93.7378938178285 
-2.64000000000000  2.11528154253836 -170.438440923277  21.1528154253836 -170.438440923277  4.23056308507672 -80.5585239975482  42.3056308507672  99.4414760024518 
-2.61000000000000  2.27814560411119 -164.787624722146  22.7814560411119 -164.787624722146  4.55629120822238 -74.9077077964170  45.5629120822238  105.092292203583 
-2.58000000000000  2.45101545352244 -159.189489020782  24.5101545352244 -159.189489020782  4.90203090704488 -69.3095720950536  49.0203090704488  110.690427904946 
-2.55000000000000  2.63427489879442 -153.643946841450  26.3427489879442 -153.643946841450  5.26854979758884 -63.7640299157211  52.6854979758884  116.235970084279 
-2.52000000000000  2.82830254706139 -148.150910139239  28.2830254706139 -148.150910139239  5.65660509412278 -58.2709932135104  56.5660509412278  121.729006786490 
-2.49000000000000  3.03346976661553 -142.710290210869  30.3346976661553 -142.710290210869  6.06693953323106 -52.8303732851406  60.6693953323106  127.169626714859 
-2.46000000000000  3.25013854066786 -137.321998084963  32.5013854066786 -137.321998084963  6.50027708133572 -47.4420811592347  65.0027708133572  132.557918840765 
-2.43000000000000  3.47865921906840 -131.985944893401  34.7865921906840 -131.985944893401  6.95731843813680 -42.1060279676724  69.5731843813680  137.893972032328 
-2.40000000000000  3.71936817541073 -126.702042223440  37.1936817541073 -126.702042223440  7.43873635082146 -36.8221252977118  74.3873635082146  143.177874702288 
-2.37000000000000  3.97258537814028 -121.470202450372  39.7258537814028 -121.470202450372  7.94517075628056 -31.5902855246437  79.4517075628056  148.409714475356 
-2.34000000000000  4.23861188548408 -116.290339050538  42.3861188548408 -116.290339050538  8.47722377096815 -26.4104221248098  84.7722377096815  153.589577875190 
-2.31000000000000  4.51772727521033 -111.162366894608  45.1772727521033 -111.162366894608  9.03545455042066 -21.2824499688792  90.3545455042066  158.717550031121 
-2.28000000000000  4.81018702139907 -106.086202521056  48.1018702139907 -106.086202521056  9.62037404279814 -16.2062855953277  96.2037404279814  163.793714404672 
-2.25000000000000  5.11621983154751 -101.061764389846  51.1621983154751 -101.061764389846  10.2324396630950 -11.1818474641173  102.324396630950  168.818152535883 
-2.22000000000000  5.43602495843509 -96.0889731163417  54.3602495843509 -96.0889731163417  10.8720499168702 -6.20905619061298  108.720499168702  173.790943809387 
-2.19000000000000  5.76976950221990 -91.1677516855461  57.6976950221990 -91.1677516855461  11.5395390044398 -1.28783475981744  115.395390044398  178.712165240183 
-2.16000000000000  6.11758571921973 -86.2980256467674  61.1758571921973 -86.2980256467674  12.2351714384395  3.58189127896128  122.351714384395 -176.418108721039 
-2.13000000000000  6.47956835473405 -81.4797232888692  64.7956835473405 -81.4797232888692  12.9591367094681  8.40019363685949  129.591367094681 -171.599806363141 
-2.10000000000000  6.85577201807659 -76.7127757962873  68.5577201807659 -76.7127757962873  13.7115440361532  13.1671411294414  137.115440361532 -166.832858870559 
-2.07000000000000  7.24620861870036 -71.9971173860236  72.4620861870036 -71.9971173860236  14.4924172374007  17.8827995397050  144.924172374007 -162.117200460295 
-2.04000000000000  7.65084488289589 -67.3326854258630  76.5084488289589 -67.3326854258630  15.3016897657918  22.5472314998656  153.016897657918 -157.452768500134 
-2.01000000000000  8.06959997102000 -62.7194205340853  80.6959997102000 -62.7194205340853  16.1391999420400  27.1604963916434  161.391999420400 -152.839503608357 
-1.98000000000000  8.50234321555477 -58.1572666609758  85.0234321555477 -58.1572666609758  17.0046864311095  31.7226502647528  170.046864311095 -148.277349735247 
-1.95000000000000  8.94889200049682 -53.6461711524697  89.4889200049681 -53.6461711524697  17.8977840009936  36.2337457732589  178.977840009936 -143.766254226741 
-1.92000000000000  9.40900980262618 -49.1860847962925  94.0900980262618 -49.1860847962925  18.8180196052524  40.6938321294361  188.180196052524 -139.306167870564 
-1.89000000000000  9.88240441509519 -44.7769618509962  98.8240441509519 -44.7769618509962  19.7648088301904  45.1029550747324  197.648088301904 -134.897044925268 
-1.86000000000000  10.3687263735032 -40.4187600583197  103.687263735032 -40.4187600583197  20.7374527470064  49.4611568674090  207.374527470064 -130.538843132591 
-1.83000000000000  10.8675676041799 -36.1114406393375  108.675676041799 -36.1114406393375  21.7351352083598  53.7684762863912  217.351352083598 -126.231523713609 
-1.80000000000000  11.3784603137809 -31.8549682748972  113.784603137809 -31.8549682748972  22.7569206275618  58.0249486508315  227.569206275618 -121.975051349169 
-1.77000000000000  11.9008761385050 -27.6493110708784  119.008761385050 -27.6493110708784  23.8017522770100  62.2306058548503  238.017522770100 -117.769394145150 
-1.74000000000000  12.4342255702697 -23.4944405088487  124.342255702697 -23.4944405088487  24.8684511405394  66.3854764168800  248.684511405394 -113.614523583120 
-1.71000000000000  12.9778576760287 -19.3903313827239  129.778576760287 -19.3903313827239  25.9557153520574  70.4895855430048  259.557153520574 -109.510414456995 
-1.68000000000000  13.5310601250893 -15.3369617220827  135.310601250893 -15.3369617220828  27.0621202501786  74.5429552036459  270.621202501786 -105.457044796354 
-1.65000000000000  14.0930595377851 -11.3343127028207  140.930595377851 -11.3343127028207  28.1861190755703  78.5456042229080  281.861190755703 -101.454395777092 
-1.62000000000000  14.6630221671895 -7.38236854586970  146.630221671895 -7.38236854586970  29.3260443343790  82.4975483798590  293.260443343790 -97.5024516201410 
-1.59000000000000  15.2400549237225 -3.48111640474391  152.400549237225 -3.48111640474392  30.4801098474450  86.3988005209848  304.801098474450 -93.6011994790152 
-1.56000000000000  15.8232067505178  0.369453757287203  158.232067505178  0.369453757287201  31.6464135010356  90.2493706830159  316.464135010356 -89.7506293169841 
-1.53000000000000  16.4114703552825  4.16934929956570  164.114703552825  4.16934929956569  32.8229407105649  94.0492662252944  328.229407105649 -85.9507337747057 
-1.50000000000000  17.0037843021179  7.91857504508168  170.037843021179  7.91857504508168  34.0075686042358  97.7984919708103  340.075686042358 -82.2015080291897 
-1.47000000000000  17.5990354643831  11.6171334292806  175.990354643831  11.6171334292806  35.1980709287662  101.497050355009  351.980709287662 -78.5029496449907 
-1.44000000000000  18.1960618371895  15.2650246557113  181.960618371895  15.2650246557113  36.3921236743791  105.144941581440  363.921236743791 -74.8550584185601 
-1.41000000000000  18.7936557055327  18.8622468575586  187.936557055327  18.8622468575586  37.5873114110654  108.742163783287  375.873114110654 -71.2578362167127 
-1.38000000000000  19.3905671614129  22.4087962640847  193.905671614129  22.4087962640847  38.7811343228258  112.288713189813  387.811343228258 -67.7112868101866 
-1.35000000000000  19.9855079605889  25.9046673709776  199.855079605889  25.9046673709776  39.9710159211778  115.784584296706  399.710159211778 -64.2154157032937 
-1.32000000000000  20.5771557068681  29.3498531135991  205.771557068681  29.3498531135991  41.1543114137363  119.229770039328  411.543114137363 -60.7702299606722 
-1.29000000000000  21.1641583490891  32.7443450421058  211.641583490891  32.7443450421058  42.3283166981781  122.624261967834  423.283166981781 -57.3757380321656 
-1.26000000000000  21.7451389732131  36.0881334974170  217.451389732131  36.0881334974170  43.4902779464263  125.968050423146  434.902779464263 -54.0319495768543 
-1.23000000000000  22.3187008692459  39.3812077869999  223.187008692459  39.3812077869999  44.6374017384919  129.261124712729  446.374017384919 -50.7388752872714 
-1.20000000000000  22.8834328500700  42.6235563594468  228.834328500699  42.6235563594468  45.7668657001399  132.503473285175  457.668657001399 -47.4965267148246 
-1.17000000000000  23.4379147967240  45.8151669768309  234.379147967240  45.8151669768309  46.8758295934481  135.695083902560  468.758295934481 -44.3049160974404 
-1.14000000000000  23.9807234022312  48.9560268838423  239.807234022312  48.9560268838423  47.9614468044624  138.835943809571  479.614468044624 -41.1640561904291 
-1.11000000000000  24.5104380837843  52.0461229727242  245.104380837843  52.0461229727242  49.0208761675686  141.926039898453  490.208761675686 -38.0739601015472 
-1.08000000000000  25.0256470309747  55.0854419430611  250.256470309747  55.0854419430611  50.0512940619495  144.965358868790  500.512940619495 -35.0346411312102 
-1.05000000000000  25.5249533558176  58.0739704554995  255.249533558176  58.0739704554995  51.0499067116352  147.953887381228  510.499067116352 -32.0461126187719 
-1.02000000000000  26.0069813086153  61.0116952785188  260.069813086153  61.0116952785188  52.0139626172306  150.891612204247  520.139626172305 -29.1083877957525 
-0.990000000000000  26.4703825222301  63.8986034274192  264.703825222301  63.8986034274193  52.9407650444602  153.778520353148  529.407650444602 -26.2214796468521 
-0.960000000000000  26.9138422461344  66.7346822947344  269.138422461344  66.7346822947344  53.8276844922689  156.614599220463  538.276844922689 -23.3854007795369 
-0.930000000000000  27.3360855306866  69.5199197713370  273.360855306866  69.5199197713370  54.6721710613732  159.399836697066  546.721710613732 -20.6001633029343 
-0.900000000000000  27.7358833214715  72.2543043575599  277.358833214715  72.2543043575599  55.4717666429430  162.134221283289  554.717666429430 -17.8657787167114 
-0.870000000000000  28.1120584232515  74.9378252637218  281.120584232515  74.9378252637218  56.2241168465029  164.817742189450  562.241168465029 -15.1822578105496 
-0.840000000000000  28.4634912931210  77.5704724995111  284.634912931210  77.5704724995111  56.9269825862419  167.450389425240  569.269825862419 -12.5496105747602 
-0.810000000000000  28.7891256228473  80.1522369517569  287.891256228473  80.1522369517569  57.5782512456946  170.032153877486  575.782512456946 -9.96784612251444 
-0.780000000000000  29.0879736711254  82.6831104501874  290.879736711254  82.6831104501874  58.1759473422508  172.563027375916  581.759473422508 -7.43697262408396 
-0.750000000000000  29.3591213075743  85.1630858208589  293.591213075743  85.1630858208589  58.7182426151486  175.043002746588  587.182426151486 -4.95699725341243 
-0.720000000000000  29.6017327317600  87.5921569270178  296.017327317600  87.5921569270178  59.2034654635200  177.472073852746  592.034654635200 -2.52792614725352 
-0.690000000000000  29.8150548323375  89.9703186972427  298.150548323374  89.9703186972427  59.6301096646749  179.850235622971  596.301096646749 -0.149764377028611 
-0.660000000000000  29.9984211535543  92.2975671408023  299.984211535543  92.2975671408023  59.9968423071086 -177.822515933469  599.968423071086  2.17748406653097 
-0.630000000000000  30.1512554388403  94.5738993502514  301.512554388403  94.5738993502514  60.3025108776807 -175.546183724020  603.025108776807  4.45381627598000 
-0.600000000000000  30.2730747239992  96.7993134913790  302.730747239992  96.7993134913790  60.5461494479983 -173.320769582892  605.461494479983  6.67923041710764 
-0.570000000000000  30.3634919556016  98.9738087807142  303.634919556016  98.9738087807142  60.7269839112031 -171.146274293557  607.269839112031  8.85372570644284 
-0.540000000000000  30.4222181135314  101.097385450886  304.222181135314  101.097385450886  60.8444362270627 -169.022697623385  608.444362270627  10.9773023766147 
-0.510000000000000  30.4490638202189  103.170044704229  304.490638202189  103.170044704229  60.8981276404377 -166.950038370042  608.981276404377  13.0499616299575 
-0.480000000000000  30.4439404228880  105.191788655116  304.439404228880  105.191788655116  60.8878808457759 -164.928294419155  608.878808457759  15.0717055808447 
-0.450000000000000  30.4068605390998  107.162620261597  304.068605390998  107.162620261597  60.8137210781996 -162.957462812674  608.137210781996  17.0425371873256 
-0.420000000000000  30.3379380599621  109.082543247006  303.379380599621  109.082543247006  60.6758761199241 -161.037539827266  606.758761199242  18.9624601727345 
-0.390000000000000  30.2373876095485  110.951562012299  302.373876095485  110.951562012299  60.4747752190969 -159.168521061972  604.747752190969  20.8314789380280 
-0.360000000000000  30.1055234632901  112.769681539971  301.055234632901  112.769681539971  60.2110469265803 -157.350401534300  602.110469265803  22.6495984656997 
-0.330000000000000  29.9427579323235  114.536907290476  299.427579323235  114.536907290476  59.8855158646470 -155.583175783795  598.855158646471  24.4168242162046 
-0.300000000000000  29.7495992249532  116.253245092184  297.495992249532  116.253245092184  59.4991984499064 -153.866837982087  594.991984499064  26.1331620179129 
-0.270000000000000  29.5266488004773  117.918701025964  295.266488004773  117.918701025964  59.0532976009546 -152.201382048307  590.532976009546  27.7986179516926 
-0.240000000000000  29.2745982345778  119.533281305571  292.745982345778  119.533281305571  58.5491964691556 -150.586801768700  585.491964691556  29.4131982312998 
-0.210000000000000  28.9942256192560  121.096992155098  289.942256192560  121.096992155098  57.9884512385120 -149.023090919173  579.884512385120  30.9769090808268 
-0.180000000000000  28.6863915238570  122.609839684801  286.863915238570  122.609839684801  57.3727830477140 -147.510243389470  573.727830477140  32.4897566105301 
-0.150000000000000  28.3520345470327  124.071829766694  283.520345470327  124.071829766694  56.7040690940654 -146.048253307577  567.040690940654  33.9517466924226 
-0.120000000000000  27.9921664925089  125.482967911341  279.921664925089  125.482967911341  55.9843329850177 -144.637115162930  559.843329850177  35.3628848370698 
-0.0900000000000001  27.6078672042142  126.843259147356  276.078672042142  126.843259147356  55.2157344084285 -143.276823926916  552.157344084285  36.7231760730845 
-0.0600000000000001  27.2002790986715  128.152707905124  272.002790986715  128.152707905124  54.4005581973430 -141.967375169147  544.005581973431  38.0326248308528 
-0.0300000000000001  26.7706014345174  129.411317906333  267.706014345174  129.411317906333  53.5412028690348 -140.708765167938  535.412028690348  39.2912348320621 
-1.11022302462516e-16  26.3200843605926  130.619092060895  263.200843605926  130.619092060895  52.6401687211853 -139.500991013377  526.401687211853  40.4990089866234 
 0.0299999999999999  25.8500227852121  131.776032372868  258.500227852121  131.776032372868  51.7000455704242 -138.344050701403  517.000455704242  41.6559492985969 
 0.0599999999999999  25.3617501099761  132.882139857004  253.617501099761  132.882139857004  50.7235002199522 -137.237943217267  507.235002199522  42.7620567827327 
 0.0899999999999999  24.8566318718209  133.937414467498  248.566318718209  133.937414467498  49.7132637436417 -136.182668606774  497.132637436417  43.8173313932264 
 0.120000000000000  24.3360593369249  134.941855040544  243.360593369249  134.941855040544  48.6721186738499 -135.178228033728  486.721186738499  44.8217719662725 
 0.150000000000000  23.8014430896009  135.895459252226  238.014430896009  135.895459252226  47.6028861792019 -134.224623822045  476.028861792019  45.7753761779548 
 0.180000000000000  23.2542066584189  136.798223593240  232.542066584189  136.798223593240  46.5084133168377 -133.321859481032  465.084133168377  46.6781405189683 
 0.210000000000000  22.6957802205477  137.650143361864  226.957802205477  137.650143361864  45.3915604410954 -132.469939712408  453.915604410954  47.5300602875925 
 0.240000000000000  22.1275944236869  138.451212676528  221.275944236869  138.451212676528  44.2551888473738 -131.668870397744  442.551888473738  48.3311296022564 
 0.270000000000000  21.5510743630151  139.201424509201  215.510743630151  139.201424509201  43.1021487260302 -130.918658565070  431.021487260302  49.0813414349297 
 0.300000000000000  20.9676337483416  139.900770740725  209.676337483416  139.900770740725  41.9352674966831 -130.219312333546  419.352674966831  49.7806876664537 
 0.330000000000000  20.3786692941364  140.549242239057  203.786692941364  140.549242239057  40.7573385882728 -129.570840835214  407.573385882728  50.4291591647860 
 0.360000000000000  19.7855553623778  141.146828961244  197.855553623778  141.146828961244  39.5711107247557 -128.973254113027  395.711107247557  51.0267458869727 
 0.390000000000000  19.1896388852218  141.693520079750  191.896388852218  141.693520079750  38.3792777704437 -128.426562994521  383.792777704437  51.5734370054787 
 0.420000000000000  18.5922345914154  142.189304133582  185.922345914154  142.189304133582  37.1844691828308 -127.930778940689  371.844691828308  52.0692210593107 
 0.450000000000000  17.9946205571741  142.634169204411  179.946205571741  142.634169204411  35.9892411143483 -127.485913869861  359.892411143483  52.5140861301394 
 0.480000000000000  17.3980340989703  143.028103117663  173.980340989703  143.028103117663  34.7960681979406 -127.091979956608  347.960681979406  52.9080200433920 
 0.510000000000000  16.8036680223680  143.371093668287  168.036680223680  143.371093668287  33.6073360447360 -126.748989405985  336.073360447360  53.2510105940153 
 0.540000000000000  16.2126672377344  143.663128870605  162.126672377344  143.663128870605  32.4253344754688 -126.456954203666  324.253344754688  53.5430457963335 
 0.570000000000000  15.6261257503872  143.904197231386  156.261257503872  143.904197231386  31.2522515007745 -126.215885842885  312.522515007745  53.7841141571151 
 0.600000000000000  15.0450840295442  144.094288044914  150.450840295442  144.094288044914  30.0901680590883 -126.025795029357  300.901680590883  53.9742049706427 
 0.630000000000000  14.4705267573485  144.233391708509  144.705267573486  144.233391708509  28.9410535146971 -125.886691365763  289.410535146971  54.1133086342375 
 0.660000000000000  13.9033809562905  144.321500056599  139.033809562906  144.321500056599  27.8067619125811 -125.798583017673  278.067619125811  54.2014169823273 
 0.690000000000000  13.3445144905450  144.358606711041  133.445144905450  144.358606711041  26.6890289810899 -125.761476363231  266.890289810899  54.2385236367694 
 0.720000000000000  12.7947349341319  144.344707445014  127.947349341319  144.344707445014  25.5894698682638 -125.775375629257  255.894698682638  54.2246243707430 
 0.750000000000000  12.2547887963913  144.279800557387  122.547887963913  144.279800557387  24.5095775927827 -125.840282516884  245.095775927827  54.1597174831160 
 0.780000000000000  11.7253610930616  144.163887254029  117.253610930616  144.163887254029  23.4507221861232 -125.956195820242  234.507221861232  54.0438041797581 
 0.810000000000000  11.2070752492783  143.996972032108  112.070752492783  143.996972032108  22.4141504985567 -126.123111042164  224.141504985567  53.8768889578363 
 0.840000000000000  10.7004933190691  143.779063062936  107.004933190691  143.779063062936  21.4009866381382 -126.341020011335  214.009866381382  53.6589799886647 
 0.870000000000000  10.2061165044146  143.510172568485  102.061165044146  143.510172568485  20.4122330088292 -126.609910505786  204.122330088293  53.3900894942135 
 0.900000000000000  9.72438595568458  143.190317186167  97.2438595568458  143.190317186167  19.4487719113692 -126.929765888104  194.487719113692  53.0702341118960 
 0.930000000000000  9.25568383422282  142.819518316024  92.5568383422282  142.819518316024  18.5113676684456 -127.300564758248  185.113676684456  52.6994352417522 
 0.960000000000000  8.80033461705958  142.397802443908  88.0033461705958  142.397802443908  17.6006692341192 -127.722280630363  176.006692341192  52.2777193696367 
 0.990000000000000  8.35860662314880  141.925201433765  83.5860662314880  141.925201433765  16.7172132462976 -128.194881640506  167.172132462976  51.8051183594939 
 1.02000000000000  7.93071374016352  141.401752781530  79.3071374016352  141.401752781530  15.8614274803270 -128.718330292741  158.614274803270  51.2816697072589 
 1.05000000000000  7.51681733071563  140.827499822647  75.1681733071563  140.827499822647  15.0336346614313 -129.292583251625  150.336346614313  50.7074167483754 
 1.08000000000000  7.11702829688705  140.202491884618  71.1702829688705  140.202491884618  14.2340565937741 -129.917591189653  142.340565937741  50.0824088103471 
 1.11000000000000  6.73140928215042  139.526784375433  67.3140928215042  139.526784375433  13.4628185643009 -130.593298698839  134.628185643008  49.4067013011613 
 1.14000000000000  6.35997699010560  138.800438798094  63.5997699010560  138.800438798094  12.7199539802112 -131.319644276178  127.199539802112  48.6803557238224 
 1.17000000000000  6.00270459994534  138.023522680896  60.0270459994534  138.023522680896  12.0054091998907 -132.096560393376  120.054091998907  47.9034396066243 
 1.20000000000000  5.65952425917529  137.196109412436  56.5952425917529  137.196109412436  11.3190485183506 -132.923973661835  113.190485183506  47.0760263381646 
 1.23000000000000  5.33032963483150  136.318277969739  53.3032963483150  136.318277969739  10.6606592696630 -133.801805104532  106.606592696630  46.1981948954678 
 1.26000000000000  5.01497850524989  135.390112527211  50.1497850524989  135.390112527210  10.0299570104998 -134.729970547061  100.299570104998  45.2700294529392 
 1.29000000000000  4.71329537532799  134.411701933493  47.1329537532799  134.411701933493  9.42659075065597 -135.708381140778  94.2659075065597  44.2916188592221 
 1.32000000000000  4.42507409916880  133.383139042647  44.2507409916880  133.383139042647  8.85014819833761 -136.736944031624  88.5014819833761  43.2630559683761 
 1.35000000000000  4.15008049499280  132.304519885424  41.5008049499280  132.304519885424  8.30016098998560 -137.815563188847  83.0016098998560  42.1844368111530 
 1.38000000000000  3.88805493823629  131.175942665787  38.8805493823629  131.175942665787  7.77610987647257 -138.944140408485  77.7610987647257  41.0558595915152 
 1.41000000000000  3.63871491981039  129.997506567206  36.3871491981038  129.997506567206  7.27742983962077 -140.122576507065  72.7742983962077  39.8774234929347 
 1.44000000000000  3.40175755756338  128.769310352722  34.0175755756338  128.769310352722  6.80351511512676 -141.350772721549  68.0351511512676  38.6492272784506 
 1.47000000000000  3.17686205006139  127.491450742216  31.7686205006139  127.491450742216  6.35372410012278 -142.628632332055  63.5372410012278  37.3713676679448 
 1.50000000000000  2.96369206286959  126.164020549935  29.6369206286959  126.164020549935  5.92738412573918 -143.956062524336  59.2738412573917  36.0439374756637 
 1.53000000000000  2.76189803857033  124.787106564940  27.6189803857033  124.787106564940  5.52379607714067 -145.332976509332  55.2379607714067  34.6670234906683 
 1.56000000000000  2.57111942279037  123.360787156941  25.7111942279037  123.360787156941  5.14223884558074 -146.759295917331  51.4223884558073  33.2407040826693 
 1.59000000000000  2.39098679951960  121.885129589897  23.9098679951960  121.885129589897  4.78197359903919 -148.234953484375  47.8197359903919  31.7650465156252 
 1.62000000000000  2.22112392998521  120.360187025845  22.2112392998521  120.360187025845  4.44224785997043 -149.759896048427  44.4224785997043  30.2401039515733 
 1.65000000000000  2.06114969029277  118.785995201729  20.6114969029277  118.785995201728  4.12229938058555 -151.334087872543  41.2229938058555  28.6659121274571 
 1.68000000000000  1.91067990395636  117.162568762504  19.1067990395636  117.162568762504  3.82135980791272 -152.957514311768  38.2135980791272  27.0424856882323 
 1.71000000000000  1.76932906631142  115.489897234583  17.6932906631142  115.489897234583  3.53865813262283 -154.630185839688  35.3865813262283  25.3698141603116 
 1.74000000000000  1.63671195863311  113.767940624731  16.3671195863311  113.767940624731  3.27342391726622 -156.352142449541  32.7342391726622  23.6478575504594 
 1.77000000000000  1.51244515056892  111.996624630848  15.1244515056892  111.996624630847  3.02489030113784 -158.123458443424  30.2489030113784  21.8765415565761 
 1.80000000000000  1.39614839023488  110.175835452716  13.9614839023488  110.175835452716  2.79229678046976 -159.944247621556  27.9229678046976  20.0557523784443 
 1.83000000000000  1.28744588201994  108.305414192670  12.8744588201994  108.305414192670  2.57489176403988 -161.814668881601  25.7489176403988  18.1853311183989 
 1.86000000000000  1.18596745279098  106.385150838287  11.8596745279098  106.385150838287  2.37193490558196 -163.734932235985  23.7193490558196  16.2650677640152 
 1.89000000000000  1.09134960779200  104.414777821484  10.9134960779200  104.414777821484  2.18269921558401 -165.705305252788  21.8269921558400  14.2946947472123 
 1.92000000000000  1.00323647808503  102.393963150813  10.0323647808503  102.393963150812  2.00647295617007 -167.726119923459  20.0647295617007  12.2738800765411 
 1.95000000000000  0.921280661886423  100.322303116009  9.21280661886423  100.322303116009  1.84256132377285 -169.797779958263  18.4256132377284  10.2022200417372 
 1.98000000000000  0.845143962612132  98.1993145659316  8.45143962612132  98.1993145659315  1.69028792522427 -171.920768508340  16.9028792522426  8.07923149166020 
 2.01000000000000  0.774498026858398  96.0244267625642  7.74498026858398  96.0244267625641  1.54899605371680 -174.095656311707  15.4899605371680  5.90434368829284 
 2.04000000000000  0.709024885911559  93.7969728144618  7.09024885911558  93.7969728144617  1.41804977182312 -176.323110259810  14.1804977182312  3.67688974019041 
 2.07000000000000  0.648417404703223  91.5161806925739  6.48417404703222  91.5161806925738  1.29683480940645 -178.603902381698  12.9683480940645  1.39609761830246 
 2.10000000000000  0.592379642405696  89.1811638292126  5.92379642405695  89.1811638292125  1.18475928481139  179.061080754941  11.8475928481139 -0.938919245058820 
 2.13000000000000  0.540627129098757  86.7909112965939  5.40627129098756  86.7909112965938  1.08125425819751  176.670828222322  10.8125425819751 -3.32917177767754 
 2.16000000000000  0.492887063134317  84.3442775541918  4.92887063134316  84.3442775541916  0.985774126268634  174.224194479920  9.85774126268633 -5.77580552007970 
 2.19000000000000  0.448898433981444  81.8399717434019  4.48898433981443  81.8399717434018  0.897796867962888  171.719888669131  8.97796867962887 -8.28011133086953 
 2.22000000000000  0.408412075452901  79.2765464929351  4.08412075452900  79.2765464929350  0.816824150905801  169.156463418664  8.16824150905800 -10.8435365813364 
 2.25000000000000  0.371190654297282  76.6523861780656  3.71190654297282  76.6523861780655  0.742381308594565  166.532303103794  7.42381308594564 -13.4676968962058 
 2.28000000000000  0.337008599190254  73.9656945504292  3.37008599190253  73.9656945504291  0.674017198380507  163.845611476158  6.74017198380507 -16.1543885238422 
 2.31000000000000  0.305651975176038  71.2144816215004  3.05651975176037  71.2144816215003  0.611303950352075  161.094398547229  6.11303950352075 -18.9056014527710 
 2.34000000000000  0.276918308598401  68.3965496411548  2.76918308598400  68.3965496411547  0.553836617196802  158.276466566883  5.53836617196801 -21.7235334331166 
 2.37000000000000  0.250616367520580  65.5094779617875  2.50616367520579  65.5094779617874  0.501232735041160  155.389394887516  5.01232735041159 -24.6106051124839 
 2.40000000000000  0.226565902567760  62.5506065172193  2.26565902567759  62.5506065172192  0.453131805135520  152.430523442948  4.53131805135520 -27.5694765570521 
 2.43000000000000  0.204597353035587  59.5170175730518  2.04597353035587  59.5170175730517  0.409194706071175  149.396934498780  4.09194706071174 -30.6030655012197 
 2.46000000000000  0.184551522995097  56.4055153201589  1.84551522995096  56.4055153201589  0.369103045990193  146.285432245888  3.69103045990192 -33.7145677541125 
 2.49000000000000  0.166279231989765  53.2126027847170  1.66279231989765  53.2126027847169  0.332558463979530  143.092519710446  3.32558463979530 -36.9074802895545 
 2.52000000000000  0.149640944765406  49.9344554157645  1.49640944765406  49.9344554157644  0.299281889530813  139.814372341493  2.99281889530812 -40.1856276585070 
 2.55000000000000  0.134506384299157  46.5668905843138  1.34506384299156  46.5668905843137  0.269012768598313  136.446807510042  2.69012768598312 -43.5531924899575 
 2.58000000000000  0.120754132201135  43.1053320865918  1.20754132201135  43.1053320865916  0.241508264402270  132.985249012320  2.41508264402269 -47.0147509876795 
 2.61000000000000  0.108271220352110  39.5447685892721  1.08271220352110  39.5447685892719  0.216542440704221  129.424685515001  2.16542440704220 -50.5753144849993 
 2.64000000000000  0.0969527174139325  35.8797047895777  0.969527174139323  35.8797047895776  0.193905434827865  125.759621715306  1.93905434827864 -54.2403782846937 
 2.67000000000000  0.0867013136074777  32.1041038940856  0.867013136074772  32.1041038940855  0.173402627214955  121.984020819814  1.73402627214955 -58.0159791801857 
 2.70000000000000  0.0774269068965328  28.2113198584617  0.774269068965324  28.2113198584617  0.154853813793066  118.091236784190  1.54853813793065 -61.9087632158097 
 2.73000000000000  0.0690461934466864  24.1940176965480  0.690461934466861  24.1940176965480  0.138092386893373  114.073934622277  1.38092386893372 -65.9260653777233 
 2.76000000000000  0.0614822649469180  20.0440800958019  0.614822649469176  20.0440800958017  0.122964529893836  109.923997021530  1.22964529893836 -70.0760029784696 
 2.79000000000000  0.0546642150891292  15.7524986245451  0.546642150891290  15.7524986245449  0.109328430178258  105.632415550274  1.09328430178258 -74.3675844497263 
 2.82000000000000  0.0485267571976877  11.3092480783344  0.485267571976875  11.3092480783342  0.0970535143953756  101.189165004063  0.970535143953754 -78.8108349959370 
 2.85000000000000  0.0430098546863888  6.70314313749724  0.430098546863885  6.70314313749708  0.0860197093727773  96.5830600632257  0.860197093727771 -83.4169399367740 
 2.88000000000000  0.0380583656915775  1.92167773031342  0.380583656915774  1.92167773031325  0.0761167313831549  91.8015946560422  0.761167313831545 -88.1984053439579 
 2.91000000000000  0.0336217028822489 -3.04915032151120  0.336217028822487 -3.04915032151142  0.0672434057644977  86.8307666042173  0.672434057644975 -93.1692333957827 
 2.94000000000000  0.0296535090713714 -8.22502311084442  0.296535090713712 -8.22502311084451  0.0593070181427427  81.6548938148843  0.593070181427425 -98.3451061851158 
 2.97000000000000  0.0261113488326371 -13.6234826509849  0.261113488326370 -13.6234826509850  0.0522226976652744  76.2564342747439  0.522226976652742 -103.743565725256 
 3.00000000000000  0.0229564158416051 -19.2640854094108  0.229564158416050 -19.2640854094110  0.0459128316832105  70.6158315163178  0.459128316832102 -109.384168483682 
