 0.00000000000000  0.00000000000000 -0.000112385516451608 
 0.00000000000000  10.0000000000000 -0.000493018350297575 
 0.00000000000000  20.0000000000000 -0.000858671071049072 
 0.00000000000000  30.0000000000000 -0.00119823350581527 
 0.00000000000000  40.0000000000000 -0.00150138822184268 
 0.00000000000000  50.0000000000000 -0.00175892401648850 
 0.00000000000000  60.0000000000000 -0.00196301579495182 
 0.00000000000000  70.0000000000000 -0.00210746233181945 
 0.00000000000000  80.0000000000000 -0.00218787469216213 
 0.00000000000000  90.0000000000000 -0.00220180958710149 
 0.00000000000000  100.000000000000 -0.00214884361190618 
 0.00000000000000  110.000000000000 -0.00203058611093043 
 0.00000000000000  120.000000000000 -0.00185063027850021 
 0.00000000000000  130.000000000000 -0.00161444398152187 
 0.00000000000000  140.000000000000 -0.00132920362111306 
 0.00000000000000  150.000000000000 -0.00100357608128622 
 0.00000000000000  160.000000000000 -0.000647455390063494 
 0.00000000000000  170.000000000000 -0.000271662094441925 
 0.00000000000000  180.000000000000  0.000112385516451608 
 0.00000000000000  190.000000000000  0.000493018350297575 
 0.00000000000000  200.000000000000  0.000858671071049072 
 0.00000000000000  210.000000000000  0.00119823350581527 
 0.00000000000000  220.000000000000  0.00150138822184268 
 0.00000000000000  230.000000000000  0.00175892401648850 
 0.00000000000000  240.000000000000  0.00196301579495182 
 0.00000000000000  250.000000000000  0.00210746233181945 
 0.00000000000000  260.000000000000  0.00218787469216213 
 0.00000000000000  270.000000000000  0.00220180958710149 
 0.00000000000000  280.000000000000  0.00214884361190618 
 0.00000000000000  290.000000000000  0.00203058611093043 
 0.00000000000000  300.000000000000  0.00185063027850021 
 0.00000000000000  310.000000000000  0.00161444398152187 
 0.00000000000000  320.000000000000  0.00132920362111306 
 0.00000000000000  330.000000000000  0.00100357608128622 
 0.00000000000000  340.000000000000  0.000647455390063493 
 0.00000000000000  350.000000000000  0.000271662094441925 
 0.00000000000000  360.000000000000 -0.000112385516451608 

 10.0000000000000  0.00000000000000 -3.10783304256169e-05 
 10.0000000000000  10.0000000000000 -0.000134150948708768 
 10.0000000000000  20.0000000000000 -0.000233147458299059 
 10.0000000000000  30.0000000000000 -0.000325059900347239 
 10.0000000000000  40.0000000000000 -0.000407095561811615 
 10.0000000000000  50.0000000000000 -0.000476761830630639 
 10.0000000000000  60.0000000000000 -0.000531941932479078 
 10.0000000000000  70.0000000000000 -0.000570959247884746 
 10.0000000000000  80.0000000000000 -0.000592628255462756 
 10.0000000000000  90.0000000000000 -0.000596290553382897 
 10.0000000000000  100.000000000000 -0.000581834864576078 
 10.0000000000000  110.000000000000 -0.000549700417831763 
 10.0000000000000  120.000000000000 -0.000500863602053461 
 10.0000000000000  130.000000000000 -0.000436808299175978 
 10.0000000000000  140.000000000000 -0.000359480797163697 
 10.0000000000000  150.000000000000 -0.000271230653035658 
 10.0000000000000  160.000000000000 -0.000174739302764463 
 10.0000000000000  170.000000000000 -7.29385872011235e-05 
 10.0000000000000  180.000000000000  3.10783304256169e-05 
 10.0000000000000  190.000000000000  0.000134150948708768 
 10.0000000000000  200.000000000000  0.000233147458299059 
 10.0000000000000  210.000000000000  0.000325059900347239 
 10.0000000000000  220.000000000000  0.000407095561811616 
 10.0000000000000  230.000000000000  0.000476761830630641 
 10.0000000000000  240.000000000000  0.000531941932479076 
 10.0000000000000  250.000000000000  0.000570959247884743 
 10.0000000000000  260.000000000000  0.000592628255462758 
 10.0000000000000  270.000000000000  0.000596290553382899 
 10.0000000000000  280.000000000000  0.000581834864576076 
 10.0000000000000  290.000000000000  0.000549700417831760 
 10.0000000000000  300.000000000000  0.000500863602053463 
 10.0000000000000  310.000000000000  0.000436808299175980 
 10.0000000000000  320.000000000000  0.000359480797163699 
 10.0000000000000  330.000000000000  0.000271230653035657 
 10.0000000000000  340.000000000000  0.000174739302764462 
 10.0000000000000  350.000000000000  7.29385872011235e-05 
 10.0000000000000  360.000000000000 -3.10783304256169e-05 

 20.0000000000000  0.00000000000000  5.11731549439633e-05 
 20.0000000000000  10.0000000000000  0.000228792561572899 
 20.0000000000000  20.0000000000000  0.000399460221993065 
 20.0000000000000  30.0000000000000  0.000557990485704597 
 20.0000000000000  40.0000000000000  0.000699566490864805 
 20.0000000000000  50.0000000000000  0.000819886522197811 
 20.0000000000000  60.0000000000000  0.000915294716436434 
 20.0000000000000  70.0000000000000  0.000982892143877612 
 20.0000000000000  80.0000000000000  0.00102062489089449 
 20.0000000000000  90.0000000000000  0.00102734646706266 
 20.0000000000000  100.000000000000  0.00100285264069152 
 20.0000000000000  110.000000000000  0.000947887644300890 
 20.0000000000000  120.000000000000  0.000864121561492470 
 20.0000000000000  130.000000000000  0.000754099582304713 
 20.0000000000000  140.000000000000  0.000621164668901426 
 20.0000000000000  150.000000000000  0.000469355981358057 
 20.0000000000000  160.000000000000  0.000303286149826713 
 20.0000000000000  170.000000000000  0.000128001122103079 
 20.0000000000000  180.000000000000 -5.11731549439638e-05 
 20.0000000000000  190.000000000000 -0.000228792561572899 
 20.0000000000000  200.000000000000 -0.000399460221993065 
 20.0000000000000  210.000000000000 -0.000557990485704597 
 20.0000000000000  220.000000000000 -0.000699566490864804 
 20.0000000000000  230.000000000000 -0.000819886522197811 
 20.0000000000000  240.000000000000 -0.000915294716436434 
 20.0000000000000  250.000000000000 -0.000982892143877612 
 20.0000000000000  260.000000000000 -0.00102062489089449 
 20.0000000000000  270.000000000000 -0.00102734646706266 
 20.0000000000000  280.000000000000 -0.00100285264069152 
 20.0000000000000  290.000000000000 -0.000947887644300890 
 20.0000000000000  300.000000000000 -0.000864121561492471 
 20.0000000000000  310.000000000000 -0.000754099582304709 
 20.0000000000000  320.000000000000 -0.000621164668901425 
 20.0000000000000  330.000000000000 -0.000469355981358058 
 20.0000000000000  340.000000000000 -0.000303286149826713 
 20.0000000000000  350.000000000000 -0.000128001122103080 
 20.0000000000000  360.000000000000  5.11731549439642e-05 

 30.0000000000000  0.00000000000000  0.000131869769895437 
 30.0000000000000  10.0000000000000  0.000584784325645797 
 30.0000000000000  20.0000000000000  0.00101993050557656 
 30.0000000000000  30.0000000000000  0.00142408661320511 
 30.0000000000000  40.0000000000000  0.00178497256971402 
 30.0000000000000  50.0000000000000  0.00209162303793188 
 30.0000000000000  60.0000000000000  0.00233472059855450 
 30.0000000000000  70.0000000000000  0.00250687885521567 
 30.0000000000000  80.0000000000000  0.00260286686640302 
 30.0000000000000  90.0000000000000  0.00261976808496890 
 30.0000000000000  100.000000000000  0.00255706897593962 
 30.0000000000000  110.000000000000  0.00241667462001575 
 30.0000000000000  120.000000000000  0.00220285082865906 
 30.0000000000000  130.000000000000  0.00192209452956987 
 30.0000000000000  140.000000000000  0.00158293636082647 
 30.0000000000000  150.000000000000  0.00119568147176380 
 30.0000000000000  160.000000000000  0.000772096406225600 
 30.0000000000000  170.000000000000  0.000325051582083872 
 30.0000000000000  180.000000000000 -0.000131869769895437 
 30.0000000000000  190.000000000000 -0.000584784325645797 
 30.0000000000000  200.000000000000 -0.00101993050557655 
 30.0000000000000  210.000000000000 -0.00142408661320511 
 30.0000000000000  220.000000000000 -0.00178497256971402 
 30.0000000000000  230.000000000000 -0.00209162303793188 
 30.0000000000000  240.000000000000 -0.00233472059855450 
 30.0000000000000  250.000000000000 -0.00250687885521567 
 30.0000000000000  260.000000000000 -0.00260286686640303 
 30.0000000000000  270.000000000000 -0.00261976808496891 
 30.0000000000000  280.000000000000 -0.00255706897593962 
 30.0000000000000  290.000000000000 -0.00241667462001575 
 30.0000000000000  300.000000000000 -0.00220285082865906 
 30.0000000000000  310.000000000000 -0.00192209452956988 
 30.0000000000000  320.000000000000 -0.00158293636082647 
 30.0000000000000  330.000000000000 -0.00119568147176380 
 30.0000000000000  340.000000000000 -0.000772096406225600 
 30.0000000000000  350.000000000000 -0.000325051582083872 
 30.0000000000000  360.000000000000  0.000131869769895436 

 40.0000000000000  0.00000000000000  0.000208559588617961 
 40.0000000000000  10.0000000000000  0.000923007713899093 
 40.0000000000000  20.0000000000000  0.00160941071685784 
 40.0000000000000  30.0000000000000  0.00224691258958598 
 40.0000000000000  40.0000000000000  0.00281614316027218 
 40.0000000000000  50.0000000000000  0.00329980664607071 
 40.0000000000000  60.0000000000000  0.00368320717671112 
 40.0000000000000  70.0000000000000  0.00395469532107991 
 40.0000000000000  80.0000000000000  0.00410602204929009 
 40.0000000000000  90.0000000000000  0.00413258937527999 
 40.0000000000000  100.000000000000  0.00403359006429314 
 40.0000000000000  110.000000000000  0.00381203216029780 
 40.0000000000000  120.000000000000  0.00347464758809315 
 40.0000000000000  130.000000000000  0.00303168760718082 
 40.0000000000000  140.000000000000  0.00249661133243225 
 40.0000000000000  150.000000000000  0.00188567678569401 
 40.0000000000000  160.000000000000  0.00121744690402096 
 40.0000000000000  170.000000000000  0.000512225514227083 
 40.0000000000000  180.000000000000 -0.000208559588617961 
 40.0000000000000  190.000000000000 -0.000923007713899093 
 40.0000000000000  200.000000000000 -0.00160941071685784 
 40.0000000000000  210.000000000000 -0.00224691258958598 
 40.0000000000000  220.000000000000 -0.00281614316027218 
 40.0000000000000  230.000000000000 -0.00329980664607071 
 40.0000000000000  240.000000000000 -0.00368320717671111 
 40.0000000000000  250.000000000000 -0.00395469532107991 
 40.0000000000000  260.000000000000 -0.00410602204929009 
 40.0000000000000  270.000000000000 -0.00413258937527999 
 40.0000000000000  280.000000000000 -0.00403359006429314 
 40.0000000000000  290.000000000000 -0.00381203216029779 
 40.0000000000000  300.000000000000 -0.00347464758809315 
 40.0000000000000  310.000000000000 -0.00303168760718082 
 40.0000000000000  320.000000000000 -0.00249661133243225 
 40.0000000000000  330.000000000000 -0.00188567678569401 
 40.0000000000000  340.000000000000 -0.00121744690402095 
 40.0000000000000  350.000000000000 -0.000512225514227084 
 40.0000000000000  360.000000000000  0.000208559588617960 

 50.0000000000000  0.00000000000000  0.000278912429776573 
 50.0000000000000  10.0000000000000  0.00123318597983001 
 50.0000000000000  20.0000000000000  0.00214998979790852 
 50.0000000000000  30.0000000000000  0.00300146726392491 
 50.0000000000000  40.0000000000000  0.00376174666594267 
 50.0000000000000  50.0000000000000  0.00440772729905142 
 50.0000000000000  60.0000000000000  0.00491978136859612 
 50.0000000000000  70.0000000000000  0.00528235037078553 
 50.0000000000000  80.0000000000000  0.00548441782995688 
 50.0000000000000  90.0000000000000  0.00551984402861432 
 50.0000000000000  100.000000000000  0.00538755255963816 
 50.0000000000000  110.000000000000  0.00509156303237054 
 50.0000000000000  120.000000000000  0.00464086893881955 
 50.0000000000000  130.000000000000  0.00404916439095552 
 50.0000000000000  140.000000000000  0.00333442803204836 
 50.0000000000000  150.000000000000  0.00251837676468940 
 50.0000000000000  160.000000000000  0.00162580589369549 
 50.0000000000000  170.000000000000  0.000683835733319123 
 50.0000000000000  180.000000000000 -0.000278912429776572 
 50.0000000000000  190.000000000000 -0.00123318597983000 
 50.0000000000000  200.000000000000 -0.00214998979790852 
 50.0000000000000  210.000000000000 -0.00300146726392491 
 50.0000000000000  220.000000000000 -0.00376174666594267 
 50.0000000000000  230.000000000000 -0.00440772729905142 
 50.0000000000000  240.000000000000 -0.00491978136859613 
 50.0000000000000  250.000000000000 -0.00528235037078553 
 50.0000000000000  260.000000000000 -0.00548441782995688 
 50.0000000000000  270.000000000000 -0.00551984402861432 
 50.0000000000000  280.000000000000 -0.00538755255963816 
 50.0000000000000  290.000000000000 -0.00509156303237054 
 50.0000000000000  300.000000000000 -0.00464086893881955 
 50.0000000000000  310.000000000000 -0.00404916439095552 
 50.0000000000000  320.000000000000 -0.00333442803204836 
 50.0000000000000  330.000000000000 -0.00251837676468941 
 50.0000000000000  340.000000000000 -0.00162580589369549 
 50.0000000000000  350.000000000000 -0.000683835733319121 
 50.0000000000000  360.000000000000  0.000278912429776571 

 60.0000000000000  0.00000000000000  0.000340790657892922 
 60.0000000000000  10.0000000000000  0.00150589451378600 
 60.0000000000000  20.0000000000000  0.00262524252689708 
 60.0000000000000  30.0000000000000  0.00366482387426521 
 60.0000000000000  40.0000000000000  0.00459305140270415 
 60.0000000000000  50.0000000000000  0.00538172138846808 
 60.0000000000000  60.0000000000000  0.00600687049312583 
 60.0000000000000  70.0000000000000  0.00644950387747309 
 60.0000000000000  80.0000000000000  0.00669617235010976 
 60.0000000000000  90.0000000000000  0.00673938101431505 
 60.0000000000000  100.000000000000  0.00657781699669172 
 60.0000000000000  110.000000000000  0.00621638933815992 
 60.0000000000000  120.000000000000  0.00566607983523291 
 60.0000000000000  130.000000000000  0.00494360936368709 
 60.0000000000000  140.000000000000  0.00407092982321268 
 60.0000000000000  150.000000000000  0.00307455714004984 
 60.0000000000000  160.000000000000  0.00198476559398757 
 60.0000000000000  170.000000000000  0.000834667949691837 
 60.0000000000000  180.000000000000 -0.000340790657892919 
 60.0000000000000  190.000000000000 -0.00150589451378600 
 60.0000000000000  200.000000000000 -0.00262524252689708 
 60.0000000000000  210.000000000000 -0.00366482387426521 
 60.0000000000000  220.000000000000 -0.00459305140270415 
 60.0000000000000  230.000000000000 -0.00538172138846808 
 60.0000000000000  240.000000000000 -0.00600687049312583 
 60.0000000000000  250.000000000000 -0.00644950387747309 
 60.0000000000000  260.000000000000 -0.00669617235010976 
 60.0000000000000  270.000000000000 -0.00673938101431505 
 60.0000000000000  280.000000000000 -0.00657781699669172 
 60.0000000000000  290.000000000000 -0.00621638933815992 
 60.0000000000000  300.000000000000 -0.00566607983523291 
 60.0000000000000  310.000000000000 -0.00494360936368709 
 60.0000000000000  320.000000000000 -0.00407092982321268 
 60.0000000000000  330.000000000000 -0.00307455714004984 
 60.0000000000000  340.000000000000 -0.00198476559398757 
 60.0000000000000  350.000000000000 -0.000834667949691837 
 60.0000000000000  360.000000000000  0.000340790657892924 

 70.0000000000000  0.00000000000000  0.000392314134317589 
 70.0000000000000  10.0000000000000  0.00173284720496000 
 70.0000000000000  20.0000000000000  0.00302072859014269 
 70.0000000000000  30.0000000000000  0.00421682666567632 
 70.0000000000000  40.0000000000000  0.00528479859679062 
 70.0000000000000  50.0000000000000  0.00619219459677856 
 70.0000000000000  60.0000000000000  0.00691144389734505 
 70.0000000000000  70.0000000000000  0.00742069247245007 
 70.0000000000000  80.0000000000000  0.00770446706183127 
 70.0000000000000  90.0000000000000  0.00775414531818717 
 70.0000000000000  100.000000000000  0.00756821779283681 
 70.0000000000000  110.000000000000  0.00715233379955409 
 70.0000000000000  120.000000000000  0.00651912976302746 
 70.0000000000000  130.000000000000  0.00568784526749007 
 70.0000000000000  140.000000000000  0.00468373847168858 
 70.0000000000000  150.000000000000  0.00353731865251085 
 70.0000000000000  160.000000000000  0.00228341919604619 
 70.0000000000000  170.000000000000  0.000960139202775529 
 70.0000000000000  180.000000000000 -0.000392314134317590 
 70.0000000000000  190.000000000000 -0.00173284720495999 
 70.0000000000000  200.000000000000 -0.00302072859014269 
 70.0000000000000  210.000000000000 -0.00421682666567631 
 70.0000000000000  220.000000000000 -0.00528479859679062 
 70.0000000000000  230.000000000000 -0.00619219459677857 
 70.0000000000000  240.000000000000 -0.00691144389734505 
 70.0000000000000  250.000000000000 -0.00742069247245007 
 70.0000000000000  260.000000000000 -0.00770446706183126 
 70.0000000000000  270.000000000000 -0.00775414531818717 
 70.0000000000000  280.000000000000 -0.00756821779283681 
 70.0000000000000  290.000000000000 -0.00715233379955409 
 70.0000000000000  300.000000000000 -0.00651912976302746 
 70.0000000000000  310.000000000000 -0.00568784526749007 
 70.0000000000000  320.000000000000 -0.00468373847168858 
 70.0000000000000  330.000000000000 -0.00353731865251085 
 70.0000000000000  340.000000000000 -0.00228341919604619 
 70.0000000000000  350.000000000000 -0.000960139202775527 
 70.0000000000000  360.000000000000  0.000392314134317590 

 80.0000000000000  0.00000000000000  0.000431917344291547 
 80.0000000000000  10.0000000000000  0.00190714821067428 
 80.0000000000000  20.0000000000000  0.00332443134373923 
 80.0000000000000  30.0000000000000  0.00464070331266810 
 80.0000000000000  40.0000000000000  0.00581596985975073 
 80.0000000000000  50.0000000000000  0.00681452110566759 
 80.0000000000000  60.0000000000000  0.00760601657610280 
 80.0000000000000  70.0000000000000  0.00816640708170322 
 80.0000000000000  80.0000000000000  0.00847866544052747 
 80.0000000000000  90.0000000000000  0.00853330384035302 
 80.0000000000000  100.000000000000  0.00832866212104954 
 80.0000000000000  110.000000000000  0.00787095821770435 
 80.0000000000000  120.000000000000  0.00717409923181125 
 80.0000000000000  130.000000000000  0.00625925887102895 
 80.0000000000000  140.000000000000  0.00515423409678824 
 80.0000000000000  150.000000000000  0.00389260052768492 
 80.0000000000000  160.000000000000  0.00251269226129881 
 80.0000000000000  170.000000000000  0.00105643711203676 
 80.0000000000000  180.000000000000 -0.000431917344291546 
 80.0000000000000  190.000000000000 -0.00190714821067428 
 80.0000000000000  200.000000000000 -0.00332443134373923 
 80.0000000000000  210.000000000000 -0.00464070331266810 
 80.0000000000000  220.000000000000 -0.00581596985975073 
 80.0000000000000  230.000000000000 -0.00681452110566759 
 80.0000000000000  240.000000000000 -0.00760601657610280 
 80.0000000000000  250.000000000000 -0.00816640708170322 
 80.0000000000000  260.000000000000 -0.00847866544052747 
 80.0000000000000  270.000000000000 -0.00853330384035302 
 80.0000000000000  280.000000000000 -0.00832866212104954 
 80.0000000000000  290.000000000000 -0.00787095821770435 
 80.0000000000000  300.000000000000 -0.00717409923181125 
 80.0000000000000  310.000000000000 -0.00625925887102895 
 80.0000000000000  320.000000000000 -0.00515423409678824 
 80.0000000000000  330.000000000000 -0.00389260052768492 
 80.0000000000000  340.000000000000 -0.00251269226129881 
 80.0000000000000  350.000000000000 -0.00105643711203676 
 80.0000000000000  360.000000000000  0.000431917344291545 

 90.0000000000000  0.00000000000000  0.000458396964319927 
 90.0000000000000  10.0000000000000  0.00202350148307078 
 90.0000000000000  20.0000000000000  0.00352712293319969 
 90.0000000000000  30.0000000000000  0.00492357453781365 
 90.0000000000000  40.0000000000000  0.00617042582154507 
 90.0000000000000  50.0000000000000  0.00722979183907496 
 90.0000000000000  60.0000000000000  0.00806948429002576 
 90.0000000000000  70.0000000000000  0.00866398954418020 
 90.0000000000000  80.0000000000000  0.00899524386022498 
 90.0000000000000  90.0000000000000  0.00905318224338984 
 90.0000000000000  100.000000000000  0.00883604426522056 
 90.0000000000000  110.000000000000  0.00835042755330670 
 90.0000000000000  120.000000000000  0.00761108732570583 
 90.0000000000000  130.000000000000  0.00664048806110942 
 90.0000000000000  140.000000000000  0.00546812092702529 
 90.0000000000000  150.000000000000  0.00412960770557620 
 90.0000000000000  160.000000000000  0.00266561844367550 
 90.0000000000000  170.000000000000  0.00112063571423173 
 90.0000000000000  180.000000000000 -0.000458396964319926 
 90.0000000000000  190.000000000000 -0.00202350148307078 
 90.0000000000000  200.000000000000 -0.00352712293319969 
 90.0000000000000  210.000000000000 -0.00492357453781365 
 90.0000000000000  220.000000000000 -0.00617042582154507 
 90.0000000000000  230.000000000000 -0.00722979183907496 
 90.0000000000000  240.000000000000 -0.00806948429002576 
 90.0000000000000  250.000000000000 -0.00866398954418020 
 90.0000000000000  260.000000000000 -0.00899524386022498 
 90.0000000000000  270.000000000000 -0.00905318224338984 
 90.0000000000000  280.000000000000 -0.00883604426522056 
 90.0000000000000  290.000000000000 -0.00835042755330670 
 90.0000000000000  300.000000000000 -0.00761108732570583 
 90.0000000000000  310.000000000000 -0.00664048806110942 
 90.0000000000000  320.000000000000 -0.00546812092702529 
 90.0000000000000  330.000000000000 -0.00412960770557620 
 90.0000000000000  340.000000000000 -0.00266561844367549 
 90.0000000000000  350.000000000000 -0.00112063571423173 
 90.0000000000000  360.000000000000  0.000458396964319925 

 100.000000000000  0.00000000000000  0.000470948424547504 
 100.000000000000  10.0000000000000  0.00207837168684534 
 100.000000000000  20.0000000000000  0.00362264467714520 
 100.000000000000  30.0000000000000  0.00505684544207666 
 100.000000000000  40.0000000000000  0.00633739651713788 
 100.000000000000  50.0000000000000  0.00742538900590324 
 100.000000000000  60.0000000000000  0.00828776480715237 
 100.000000000000  70.0000000000000  0.00889832106854752 
 100.000000000000  80.0000000000000  0.00923850634704257 
 100.000000000000  90.0000000000000  0.00929798428509252 
 100.000000000000  100.000000000000  0.00907494767564700 
 100.000000000000  110.000000000000  0.00857617337322205 
 100.000000000000  120.000000000000  0.00781681638260486 
 100.000000000000  130.000000000000  0.00681994938170218 
 100.000000000000  140.000000000000  0.00561586166989738 
 100.000000000000  150.000000000000  0.00424113884301586 
 100.000000000000  160.000000000000  0.00273755115850912 
 100.000000000000  170.000000000000  0.00115078436731881 
 100.000000000000  180.000000000000 -0.000470948424547502 
 100.000000000000  190.000000000000 -0.00207837168684534 
 100.000000000000  200.000000000000 -0.00362264467714520 
 100.000000000000  210.000000000000 -0.00505684544207666 
 100.000000000000  220.000000000000 -0.00633739651713788 
 100.000000000000  230.000000000000 -0.00742538900590324 
 100.000000000000  240.000000000000 -0.00828776480715237 
 100.000000000000  250.000000000000 -0.00889832106854752 
 100.000000000000  260.000000000000 -0.00923850634704257 
 100.000000000000  270.000000000000 -0.00929798428509252 
 100.000000000000  280.000000000000 -0.00907494767564700 
 100.000000000000  290.000000000000 -0.00857617337322205 
 100.000000000000  300.000000000000 -0.00781681638260486 
 100.000000000000  310.000000000000 -0.00681994938170218 
 100.000000000000  320.000000000000 -0.00561586166989737 
 100.000000000000  330.000000000000 -0.00424113884301586 
 100.000000000000  340.000000000000 -0.00273755115850912 
 100.000000000000  350.000000000000 -0.00115078436731881 
 100.000000000000  360.000000000000  0.000470948424547501 

 110.000000000000  0.00000000000000  0.000469190355206606 
 110.000000000000  10.0000000000000  0.00207009161862192 
 110.000000000000  20.0000000000000  0.00360809419572231 
 110.000000000000  30.0000000000000  0.00503646665646943 
 110.000000000000  40.0000000000000  0.00631180862643483 
 110.000000000000  50.0000000000000  0.00739536948521528 
 110.000000000000  60.0000000000000  0.00825422578442499 
 110.000000000000  70.0000000000000  0.00886228161001474 
 110.000000000000  80.0000000000000  0.00920106149341506 
 110.000000000000  90.0000000000000  0.00926027177929973 
 110.000000000000  100.000000000000  0.00903811339309400 
 110.000000000000  110.000000000000  0.00854133650494517 
 110.000000000000  120.000000000000  0.00778503542921839 
 110.000000000000  130.000000000000  0.00679218999139282 
 110.000000000000  140.000000000000  0.00559296729769275 
 110.000000000000  150.000000000000  0.00422380512283030 
 110.000000000000  160.000000000000  0.00272630476665917 
 110.000000000000  170.000000000000  0.00114596701972989 
 110.000000000000  180.000000000000 -0.000469190355206606 
 110.000000000000  190.000000000000 -0.00207009161862192 
 110.000000000000  200.000000000000 -0.00360809419572231 
 110.000000000000  210.000000000000 -0.00503646665646943 
 110.000000000000  220.000000000000 -0.00631180862643483 
 110.000000000000  230.000000000000 -0.00739536948521528 
 110.000000000000  240.000000000000 -0.00825422578442499 
 110.000000000000  250.000000000000 -0.00886228161001474 
 110.000000000000  260.000000000000 -0.00920106149341506 
 110.000000000000  270.000000000000 -0.00926027177929973 
 110.000000000000  280.000000000000 -0.00903811339309400 
 110.000000000000  290.000000000000 -0.00854133650494517 
 110.000000000000  300.000000000000 -0.00778503542921839 
 110.000000000000  310.000000000000 -0.00679218999139282 
 110.000000000000  320.000000000000 -0.00559296729769275 
 110.000000000000  330.000000000000 -0.00422380512283030 
 110.000000000000  340.000000000000 -0.00272630476665918 
 110.000000000000  350.000000000000 -0.00114596701972989 
 110.000000000000  360.000000000000  0.000469190355206603 

 120.000000000000  0.00000000000000  0.000453176174344530 
 120.000000000000  10.0000000000000  0.00199891286408357 
 120.000000000000  20.0000000000000  0.00348391359794615 
 120.000000000000  30.0000000000000  0.00486305738008048 
 120.000000000000  40.0000000000000  0.00609443962454683 
 120.000000000000  50.0000000000000  0.00714064540495659 
 120.000000000000  60.0000000000000  0.00796988628807765 
 120.000000000000  70.0000000000000  0.00855696620929254 
 120.000000000000  80.0000000000000  0.00888404704227190 
 120.000000000000  90.0000000000000  0.00894119060141654 
 120.000000000000  100.000000000000  0.00872666060859790 
 120.000000000000  110.000000000000  0.00824697544909035 
 120.000000000000  120.000000000000  0.00751671011373312 
 120.000000000000  130.000000000000  0.00655805334520896 
 120.000000000000  140.000000000000  0.00540013344432575 
 120.000000000000  150.000000000000  0.00407813322133606 
 120.000000000000  160.000000000000  0.00263222098405107 
 120.000000000000  170.000000000000  0.00110633004413376 
 120.000000000000  180.000000000000 -0.000453176174344530 
 120.000000000000  190.000000000000 -0.00199891286408357 
 120.000000000000  200.000000000000 -0.00348391359794615 
 120.000000000000  210.000000000000 -0.00486305738008048 
 120.000000000000  220.000000000000 -0.00609443962454683 
 120.000000000000  230.000000000000 -0.00714064540495659 
 120.000000000000  240.000000000000 -0.00796988628807765 
 120.000000000000  250.000000000000 -0.00855696620929254 
 120.000000000000  260.000000000000 -0.00888404704227190 
 120.000000000000  270.000000000000 -0.00894119060141654 
 120.000000000000  280.000000000000 -0.00872666060859790 
 120.000000000000  290.000000000000 -0.00824697544909035 
 120.000000000000  300.000000000000 -0.00751671011373312 
 120.000000000000  310.000000000000 -0.00655805334520896 
 120.000000000000  320.000000000000 -0.00540013344432575 
 120.000000000000  330.000000000000 -0.00407813322133606 
 120.000000000000  340.000000000000 -0.00263222098405107 
 120.000000000000  350.000000000000 -0.00110633004413377 
 120.000000000000  360.000000000000  0.000453176174344524 

 130.000000000000  0.00000000000000  0.000423392464743205 
 130.000000000000  10.0000000000000  0.00186699815366876 
 130.000000000000  20.0000000000000  0.00325387604844175 
 130.000000000000  30.0000000000000  0.00454188656602355 
 130.000000000000  40.0000000000000  0.00569189415860223 
 130.000000000000  50.0000000000000  0.00666895642740920 
 130.000000000000  60.0000000000000  0.00744338582982413 
 130.000000000000  70.0000000000000  0.00799165172033481 
 130.000000000000  80.0000000000000  0.00829709531729402 
 130.000000000000  90.0000000000000  0.00835043587157006 
 130.000000000000  100.000000000000  0.00815005265741289 
 130.000000000000  110.000000000000  0.00770203421738586 
 130.000000000000  120.000000000000  0.00701999336508092 
 130.000000000000  130.000000000000  0.00612465356666605 
 130.000000000000  140.000000000000  0.00504321926885228 
 130.000000000000  150.000000000000  0.00380854930554651 
 130.000000000000  160.000000000000  0.00245815849881065 
 130.000000000000  170.000000000000  0.00103307778997665 
 130.000000000000  180.000000000000 -0.000423392464743205 
 130.000000000000  190.000000000000 -0.00186699815366876 
 130.000000000000  200.000000000000 -0.00325387604844174 
 130.000000000000  210.000000000000 -0.00454188656602355 
 130.000000000000  220.000000000000 -0.00569189415860223 
 130.000000000000  230.000000000000 -0.00666895642740920 
 130.000000000000  240.000000000000 -0.00744338582982413 
 130.000000000000  250.000000000000 -0.00799165172033481 
 130.000000000000  260.000000000000 -0.00829709531729402 
 130.000000000000  270.000000000000 -0.00835043587157006 
 130.000000000000  280.000000000000 -0.00815005265741289 
 130.000000000000  290.000000000000 -0.00770203421738585 
 130.000000000000  300.000000000000 -0.00701999336508092 
 130.000000000000  310.000000000000 -0.00612465356666605 
 130.000000000000  320.000000000000 -0.00504321926885228 
 130.000000000000  330.000000000000 -0.00380854930554651 
 130.000000000000  340.000000000000 -0.00245815849881065 
 130.000000000000  350.000000000000 -0.00103307778997665 
 130.000000000000  360.000000000000  0.000423392464743207 

 140.000000000000  0.00000000000000  0.000380744189347583 
 140.000000000000  10.0000000000000  0.00167835564910138 
 140.000000000000  20.0000000000000  0.00292497112174617 
 140.000000000000  30.0000000000000  0.00408271282696350 
 140.000000000000  40.0000000000000  0.00511640336888592 
 140.000000000000  50.0000000000000  0.00599463458346978 
 140.000000000000  60.0000000000000  0.00669072185966636 
 140.000000000000  70.0000000000000  0.00718351493782561 
 140.000000000000  80.0000000000000  0.00745804054963298 
 140.000000000000  90.0000000000000  0.00750595737329036 
 140.000000000000  100.000000000000  0.00732580948035802 
 140.000000000000  110.000000000000  0.00692307057340346 
 140.000000000000  120.000000000000  0.00630997767031878 
 140.000000000000  130.000000000000  0.00550515928872423 
 140.000000000000  140.000000000000  0.00453306942788682 
 140.000000000000  150.000000000000  0.00342324454632686 
 140.000000000000  160.000000000000  0.00220940611147209 
 140.000000000000  170.000000000000  0.000928435989933684 
 140.000000000000  180.000000000000 -0.000380744189347582 
 140.000000000000  190.000000000000 -0.00167835564910138 
 140.000000000000  200.000000000000 -0.00292497112174617 
 140.000000000000  210.000000000000 -0.00408271282696350 
 140.000000000000  220.000000000000 -0.00511640336888592 
 140.000000000000  230.000000000000 -0.00599463458346978 
 140.000000000000  240.000000000000 -0.00669072185966636 
 140.000000000000  250.000000000000 -0.00718351493782561 
 140.000000000000  260.000000000000 -0.00745804054963298 
 140.000000000000  270.000000000000 -0.00750595737329037 
 140.000000000000  280.000000000000 -0.00732580948035802 
 140.000000000000  290.000000000000 -0.00692307057340346 
 140.000000000000  300.000000000000 -0.00630997767031878 
 140.000000000000  310.000000000000 -0.00550515928872423 
 140.000000000000  320.000000000000 -0.00453306942788682 
 140.000000000000  330.000000000000 -0.00342324454632687 
 140.000000000000  340.000000000000 -0.00220940611147210 
 140.000000000000  350.000000000000 -0.000928435989933680 
 140.000000000000  360.000000000000  0.000380744189347585 

 150.000000000000  0.00000000000000  0.000326527194424490 
 150.000000000000  10.0000000000000  0.00143871715742499 
 150.000000000000  20.0000000000000  0.00250719242762313 
 150.000000000000  30.0000000000000  0.00349948792460854 
 150.000000000000  40.0000000000000  0.00438545325183104 
 150.000000000000  50.0000000000000  0.00513816880114308 
 150.000000000000  60.0000000000000  0.00573476369147126 
 150.000000000000  70.0000000000000  0.00615711068896453 
 150.000000000000  80.0000000000000  0.00639237699382196 
 150.000000000000  90.0000000000000  0.00643341415842094 
 150.000000000000  100.000000000000  0.00627897528928094 
 150.000000000000  110.000000000000  0.00593375293329095 
 150.000000000000  120.000000000000  0.00540823649704677 
 150.000000000000  130.000000000000  0.00471839353153955 
 150.000000000000  140.000000000000  0.00388518456619882 
 150.000000000000  150.000000000000  0.00293392623381240 
 150.000000000000  160.000000000000  0.00189352203744990 
 150.000000000000  170.000000000000  0.000795584132147863 
 150.000000000000  180.000000000000 -0.000326527194424488 
 150.000000000000  190.000000000000 -0.00143871715742499 
 150.000000000000  200.000000000000 -0.00250719242762313 
 150.000000000000  210.000000000000 -0.00349948792460854 
 150.000000000000  220.000000000000 -0.00438545325183104 
 150.000000000000  230.000000000000 -0.00513816880114308 
 150.000000000000  240.000000000000 -0.00573476369147126 
 150.000000000000  250.000000000000 -0.00615711068896453 
 150.000000000000  260.000000000000 -0.00639237699382196 
 150.000000000000  270.000000000000 -0.00643341415842093 
 150.000000000000  280.000000000000 -0.00627897528928094 
 150.000000000000  290.000000000000 -0.00593375293329094 
 150.000000000000  300.000000000000 -0.00540823649704677 
 150.000000000000  310.000000000000 -0.00471839353153955 
 150.000000000000  320.000000000000 -0.00388518456619882 
 150.000000000000  330.000000000000 -0.00293392623381240 
 150.000000000000  340.000000000000 -0.00189352203744989 
 150.000000000000  350.000000000000 -0.000795584132147860 
 150.000000000000  360.000000000000  0.000326527194424491 

 160.000000000000  0.00000000000000  0.000262388835929543 
 160.000000000000  10.0000000000000  0.00115536397294625 
 160.000000000000  20.0000000000000  0.00201323396028736 
 160.000000000000  30.0000000000000  0.00280993285249068 
 160.000000000000  40.0000000000000  0.00352125335686570 
 160.000000000000  50.0000000000000  0.00412558235983253 
 160.000000000000  60.0000000000000  0.00460455763044125 
 160.000000000000  70.0000000000000  0.00494362574746761 
 160.000000000000  80.0000000000000  0.00513248429775249 
 160.000000000000  90.0000000000000  0.00516539490981253 
 160.000000000000  100.000000000000  0.00504135761135386 
 160.000000000000  110.000000000000  0.00476414121292425 
 160.000000000000  120.000000000000  0.00434216879451171 
 160.000000000000  130.000000000000  0.00378826177452136 
 160.000000000000  140.000000000000  0.00311925033746513 
 160.000000000000  150.000000000000  0.00235546205732185 
 160.000000000000  160.000000000000  0.00152010425448817 
 160.000000000000  170.000000000000  0.000638558853091724 
 160.000000000000  180.000000000000 -0.000262388835929542 
 160.000000000000  190.000000000000 -0.00115536397294625 
 160.000000000000  200.000000000000 -0.00201323396028736 
 160.000000000000  210.000000000000 -0.00280993285249068 
 160.000000000000  220.000000000000 -0.00352125335686570 
 160.000000000000  230.000000000000 -0.00412558235983253 
 160.000000000000  240.000000000000 -0.00460455763044125 
 160.000000000000  250.000000000000 -0.00494362574746761 
 160.000000000000  260.000000000000 -0.00513248429775249 
 160.000000000000  270.000000000000 -0.00516539490981253 
 160.000000000000  280.000000000000 -0.00504135761135386 
 160.000000000000  290.000000000000 -0.00476414121292425 
 160.000000000000  300.000000000000 -0.00434216879451171 
 160.000000000000  310.000000000000 -0.00378826177452136 
 160.000000000000  320.000000000000 -0.00311925033746513 
 160.000000000000  330.000000000000 -0.00235546205732185 
 160.000000000000  340.000000000000 -0.00152010425448816 
 160.000000000000  350.000000000000 -0.000638558853091721 
 160.000000000000  360.000000000000  0.000262388835929542 

 170.000000000000  0.00000000000000  0.000190277925430033 
 170.000000000000  10.0000000000000  0.000836905638791913 
 170.000000000000  20.0000000000000  0.00145810439781379 
 170.000000000000  30.0000000000000  0.00203499939254452 
 170.000000000000  40.0000000000000  0.00255006196049216 
 170.000000000000  50.0000000000000  0.00298764218616386 
 170.000000000000  60.0000000000000  0.00333444441582887 
 170.000000000000  70.0000000000000  0.00357993123922921 
 170.000000000000  80.0000000000000  0.00371664366345818 
 170.000000000000  90.0000000000000  0.00374042775068541 
 170.000000000000  100.000000000000  0.00365056083345584 
 170.000000000000  110.000000000000  0.00344977347257463 
 170.000000000000  120.000000000000  0.00314416649039884 
 170.000000000000  130.000000000000  0.00274302560043729 
 170.000000000000  140.000000000000  0.00225853926564439 
 170.000000000000  150.000000000000  0.00170542835814090 
 170.000000000000  160.000000000000  0.00110049887296368 
 170.000000000000  170.000000000000  0.000462131286410762 
 170.000000000000  180.000000000000 -0.000190277925430033 
 170.000000000000  190.000000000000 -0.000836905638791912 
 170.000000000000  200.000000000000 -0.00145810439781379 
 170.000000000000  210.000000000000 -0.00203499939254452 
 170.000000000000  220.000000000000 -0.00255006196049216 
 170.000000000000  230.000000000000 -0.00298764218616386 
 170.000000000000  240.000000000000 -0.00333444441582887 
 170.000000000000  250.000000000000 -0.00357993123922921 
 170.000000000000  260.000000000000 -0.00371664366345818 
 170.000000000000  270.000000000000 -0.00374042775068541 
 170.000000000000  280.000000000000 -0.00365056083345584 
 170.000000000000  290.000000000000 -0.00344977347257463 
 170.000000000000  300.000000000000 -0.00314416649039884 
 170.000000000000  310.000000000000 -0.00274302560043730 
 170.000000000000  320.000000000000 -0.00225853926564439 
 170.000000000000  330.000000000000 -0.00170542835814090 
 170.000000000000  340.000000000000 -0.00110049887296368 
 170.000000000000  350.000000000000 -0.000462131286410762 
 170.000000000000  360.000000000000  0.000190277925430033 

 180.000000000000  0.00000000000000  0.000112385516451608 
 180.000000000000  10.0000000000000  0.000493018350297575 
 180.000000000000  20.0000000000000  0.000858671071049073 
 180.000000000000  30.0000000000000  0.00119823350581527 
 180.000000000000  40.0000000000000  0.00150138822184268 
 180.000000000000  50.0000000000000  0.00175892401648850 
 180.000000000000  60.0000000000000  0.00196301579495182 
 180.000000000000  70.0000000000000  0.00210746233181944 
 180.000000000000  80.0000000000000  0.00218787469216213 
 180.000000000000  90.0000000000000  0.00220180958710149 
 180.000000000000  100.000000000000  0.00214884361190618 
 180.000000000000  110.000000000000  0.00203058611093043 
 180.000000000000  120.000000000000  0.00185063027850021 
 180.000000000000  130.000000000000  0.00161444398152187 
 180.000000000000  140.000000000000  0.00132920362111306 
 180.000000000000  150.000000000000  0.00100357608128622 
 180.000000000000  160.000000000000  0.000647455390063493 
 180.000000000000  170.000000000000  0.000271662094441925 
 180.000000000000  180.000000000000 -0.000112385516451608 
 180.000000000000  190.000000000000 -0.000493018350297575 
 180.000000000000  200.000000000000 -0.000858671071049071 
 180.000000000000  210.000000000000 -0.00119823350581527 
 180.000000000000  220.000000000000 -0.00150138822184268 
 180.000000000000  230.000000000000 -0.00175892401648850 
 180.000000000000  240.000000000000 -0.00196301579495182 
 180.000000000000  250.000000000000 -0.00210746233181944 
 180.000000000000  260.000000000000 -0.00218787469216213 
 180.000000000000  270.000000000000 -0.00220180958710149 
 180.000000000000  280.000000000000 -0.00214884361190618 
 180.000000000000  290.000000000000 -0.00203058611093043 
 180.000000000000  300.000000000000 -0.00185063027850021 
 180.000000000000  310.000000000000 -0.00161444398152187 
 180.000000000000  320.000000000000 -0.00132920362111306 
 180.000000000000  330.000000000000 -0.00100357608128622 
 180.000000000000  340.000000000000 -0.000647455390063493 
 180.000000000000  350.000000000000 -0.000271662094441925 
 180.000000000000  360.000000000000  0.000112385516451608 

 190.000000000000  0.00000000000000  3.10783304256165e-05 
 190.000000000000  10.0000000000000  0.000134150948708768 
 190.000000000000  20.0000000000000  0.000233147458299059 
 190.000000000000  30.0000000000000  0.000325059900347240 
 190.000000000000  40.0000000000000  0.000407095561811615 
 190.000000000000  50.0000000000000  0.000476761830630641 
 190.000000000000  60.0000000000000  0.000531941932479077 
 190.000000000000  70.0000000000000  0.000570959247884747 
 190.000000000000  80.0000000000000  0.000592628255462757 
 190.000000000000  90.0000000000000  0.000596290553382899 
 190.000000000000  100.000000000000  0.000581834864576077 
 190.000000000000  110.000000000000  0.000549700417831762 
 190.000000000000  120.000000000000  0.000500863602053462 
 190.000000000000  130.000000000000  0.000436808299175980 
 190.000000000000  140.000000000000  0.000359480797163699 
 190.000000000000  150.000000000000  0.000271230653035658 
 190.000000000000  160.000000000000  0.000174739302764463 
 190.000000000000  170.000000000000  7.29385872011235e-05 
 190.000000000000  180.000000000000 -3.10783304256169e-05 
 190.000000000000  190.000000000000 -0.000134150948708767 
 190.000000000000  200.000000000000 -0.000233147458299059 
 190.000000000000  210.000000000000 -0.000325059900347239 
 190.000000000000  220.000000000000 -0.000407095561811616 
 190.000000000000  230.000000000000 -0.000476761830630638 
 190.000000000000  240.000000000000 -0.000531941932479077 
 190.000000000000  250.000000000000 -0.000570959247884746 
 190.000000000000  260.000000000000 -0.000592628255462757 
 190.000000000000  270.000000000000 -0.000596290553382899 
 190.000000000000  280.000000000000 -0.000581834864576081 
 190.000000000000  290.000000000000 -0.000549700417831766 
 190.000000000000  300.000000000000 -0.000500863602053459 
 190.000000000000  310.000000000000 -0.000436808299175976 
 190.000000000000  320.000000000000 -0.000359480797163697 
 190.000000000000  330.000000000000 -0.000271230653035657 
 190.000000000000  340.000000000000 -0.000174739302764463 
 190.000000000000  350.000000000000 -7.29385872011235e-05 
 190.000000000000  360.000000000000  3.10783304256169e-05 

 200.000000000000  0.00000000000000 -5.11731549439638e-05 
 200.000000000000  10.0000000000000 -0.000228792561572900 
 200.000000000000  20.0000000000000 -0.000399460221993065 
 200.000000000000  30.0000000000000 -0.000557990485704597 
 200.000000000000  40.0000000000000 -0.000699566490864803 
 200.000000000000  50.0000000000000 -0.000819886522197812 
 200.000000000000  60.0000000000000 -0.000915294716436434 
 200.000000000000  70.0000000000000 -0.000982892143877611 
 200.000000000000  80.0000000000000 -0.00102062489089449 
 200.000000000000  90.0000000000000 -0.00102734646706266 
 200.000000000000  100.000000000000 -0.00100285264069152 
 200.000000000000  110.000000000000 -0.000947887644300889 
 200.000000000000  120.000000000000 -0.000864121561492469 
 200.000000000000  130.000000000000 -0.000754099582304710 
 200.000000000000  140.000000000000 -0.000621164668901425 
 200.000000000000  150.000000000000 -0.000469355981358057 
 200.000000000000  160.000000000000 -0.000303286149826712 
 200.000000000000  170.000000000000 -0.000128001122103079 
 200.000000000000  180.000000000000  5.11731549439642e-05 
 200.000000000000  190.000000000000  0.000228792561572899 
 200.000000000000  200.000000000000  0.000399460221993065 
 200.000000000000  210.000000000000  0.000557990485704597 
 200.000000000000  220.000000000000  0.000699566490864806 
 200.000000000000  230.000000000000  0.000819886522197811 
 200.000000000000  240.000000000000  0.000915294716436434 
 200.000000000000  250.000000000000  0.000982892143877611 
 200.000000000000  260.000000000000  0.00102062489089449 
 200.000000000000  270.000000000000  0.00102734646706265 
 200.000000000000  280.000000000000  0.00100285264069151 
 200.000000000000  290.000000000000  0.000947887644300892 
 200.000000000000  300.000000000000  0.000864121561492473 
 200.000000000000  310.000000000000  0.000754099582304713 
 200.000000000000  320.000000000000  0.000621164668901427 
 200.000000000000  330.000000000000  0.000469355981358057 
 200.000000000000  340.000000000000  0.000303286149826713 
 200.000000000000  350.000000000000  0.000128001122103079 
 200.000000000000  360.000000000000 -5.11731549439633e-05 

 210.000000000000  0.00000000000000 -0.000131869769895437 
 210.000000000000  10.0000000000000 -0.000584784325645797 
 210.000000000000  20.0000000000000 -0.00101993050557656 
 210.000000000000  30.0000000000000 -0.00142408661320511 
 210.000000000000  40.0000000000000 -0.00178497256971402 
 210.000000000000  50.0000000000000 -0.00209162303793188 
 210.000000000000  60.0000000000000 -0.00233472059855450 
 210.000000000000  70.0000000000000 -0.00250687885521567 
 210.000000000000  80.0000000000000 -0.00260286686640302 
 210.000000000000  90.0000000000000 -0.00261976808496890 
 210.000000000000  100.000000000000 -0.00255706897593962 
 210.000000000000  110.000000000000 -0.00241667462001575 
 210.000000000000  120.000000000000 -0.00220285082865906 
 210.000000000000  130.000000000000 -0.00192209452956987 
 210.000000000000  140.000000000000 -0.00158293636082647 
 210.000000000000  150.000000000000 -0.00119568147176380 
 210.000000000000  160.000000000000 -0.000772096406225600 
 210.000000000000  170.000000000000 -0.000325051582083871 
 210.000000000000  180.000000000000  0.000131869769895437 
 210.000000000000  190.000000000000  0.000584784325645797 
 210.000000000000  200.000000000000  0.00101993050557655 
 210.000000000000  210.000000000000  0.00142408661320511 
 210.000000000000  220.000000000000  0.00178497256971402 
 210.000000000000  230.000000000000  0.00209162303793188 
 210.000000000000  240.000000000000  0.00233472059855450 
 210.000000000000  250.000000000000  0.00250687885521567 
 210.000000000000  260.000000000000  0.00260286686640302 
 210.000000000000  270.000000000000  0.00261976808496890 
 210.000000000000  280.000000000000  0.00255706897593963 
 210.000000000000  290.000000000000  0.00241667462001575 
 210.000000000000  300.000000000000  0.00220285082865906 
 210.000000000000  310.000000000000  0.00192209452956988 
 210.000000000000  320.000000000000  0.00158293636082647 
 210.000000000000  330.000000000000  0.00119568147176380 
 210.000000000000  340.000000000000  0.000772096406225600 
 210.000000000000  350.000000000000  0.000325051582083873 
 210.000000000000  360.000000000000 -0.000131869769895435 

 220.000000000000  0.00000000000000 -0.000208559588617961 
 220.000000000000  10.0000000000000 -0.000923007713899093 
 220.000000000000  20.0000000000000 -0.00160941071685784 
 220.000000000000  30.0000000000000 -0.00224691258958598 
 220.000000000000  40.0000000000000 -0.00281614316027218 
 220.000000000000  50.0000000000000 -0.00329980664607071 
 220.000000000000  60.0000000000000 -0.00368320717671111 
 220.000000000000  70.0000000000000 -0.00395469532107991 
 220.000000000000  80.0000000000000 -0.00410602204929009 
 220.000000000000  90.0000000000000 -0.00413258937527999 
 220.000000000000  100.000000000000 -0.00403359006429314 
 220.000000000000  110.000000000000 -0.00381203216029779 
 220.000000000000  120.000000000000 -0.00347464758809315 
 220.000000000000  130.000000000000 -0.00303168760718082 
 220.000000000000  140.000000000000 -0.00249661133243224 
 220.000000000000  150.000000000000 -0.00188567678569401 
 220.000000000000  160.000000000000 -0.00121744690402095 
 220.000000000000  170.000000000000 -0.000512225514227083 
 220.000000000000  180.000000000000  0.000208559588617961 
 220.000000000000  190.000000000000  0.000923007713899092 
 220.000000000000  200.000000000000  0.00160941071685784 
 220.000000000000  210.000000000000  0.00224691258958598 
 220.000000000000  220.000000000000  0.00281614316027218 
 220.000000000000  230.000000000000  0.00329980664607071 
 220.000000000000  240.000000000000  0.00368320717671111 
 220.000000000000  250.000000000000  0.00395469532107991 
 220.000000000000  260.000000000000  0.00410602204929008 
 220.000000000000  270.000000000000  0.00413258937527999 
 220.000000000000  280.000000000000  0.00403359006429314 
 220.000000000000  290.000000000000  0.00381203216029780 
 220.000000000000  300.000000000000  0.00347464758809315 
 220.000000000000  310.000000000000  0.00303168760718082 
 220.000000000000  320.000000000000  0.00249661133243225 
 220.000000000000  330.000000000000  0.00188567678569401 
 220.000000000000  340.000000000000  0.00121744690402096 
 220.000000000000  350.000000000000  0.000512225514227085 
 220.000000000000  360.000000000000 -0.000208559588617962 

 230.000000000000  0.00000000000000 -0.000278912429776572 
 230.000000000000  10.0000000000000 -0.00123318597983000 
 230.000000000000  20.0000000000000 -0.00214998979790852 
 230.000000000000  30.0000000000000 -0.00300146726392491 
 230.000000000000  40.0000000000000 -0.00376174666594267 
 230.000000000000  50.0000000000000 -0.00440772729905142 
 230.000000000000  60.0000000000000 -0.00491978136859613 
 230.000000000000  70.0000000000000 -0.00528235037078553 
 230.000000000000  80.0000000000000 -0.00548441782995688 
 230.000000000000  90.0000000000000 -0.00551984402861432 
 230.000000000000  100.000000000000 -0.00538755255963816 
 230.000000000000  110.000000000000 -0.00509156303237054 
 230.000000000000  120.000000000000 -0.00464086893881955 
 230.000000000000  130.000000000000 -0.00404916439095552 
 230.000000000000  140.000000000000 -0.00333442803204836 
 230.000000000000  150.000000000000 -0.00251837676468940 
 230.000000000000  160.000000000000 -0.00162580589369549 
 230.000000000000  170.000000000000 -0.000683835733319121 
 230.000000000000  180.000000000000  0.000278912429776572 
 230.000000000000  190.000000000000  0.00123318597983001 
 230.000000000000  200.000000000000  0.00214998979790852 
 230.000000000000  210.000000000000  0.00300146726392491 
 230.000000000000  220.000000000000  0.00376174666594267 
 230.000000000000  230.000000000000  0.00440772729905142 
 230.000000000000  240.000000000000  0.00491978136859612 
 230.000000000000  250.000000000000  0.00528235037078553 
 230.000000000000  260.000000000000  0.00548441782995688 
 230.000000000000  270.000000000000  0.00551984402861432 
 230.000000000000  280.000000000000  0.00538755255963816 
 230.000000000000  290.000000000000  0.00509156303237054 
 230.000000000000  300.000000000000  0.00464086893881955 
 230.000000000000  310.000000000000  0.00404916439095552 
 230.000000000000  320.000000000000  0.00333442803204836 
 230.000000000000  330.000000000000  0.00251837676468940 
 230.000000000000  340.000000000000  0.00162580589369549 
 230.000000000000  350.000000000000  0.000683835733319122 
 230.000000000000  360.000000000000 -0.000278912429776574 

 240.000000000000  0.00000000000000 -0.000340790657892922 
 240.000000000000  10.0000000000000 -0.00150589451378600 
 240.000000000000  20.0000000000000 -0.00262524252689708 
 240.000000000000  30.0000000000000 -0.00366482387426521 
 240.000000000000  40.0000000000000 -0.00459305140270415 
 240.000000000000  50.0000000000000 -0.00538172138846808 
 240.000000000000  60.0000000000000 -0.00600687049312583 
 240.000000000000  70.0000000000000 -0.00644950387747309 
 240.000000000000  80.0000000000000 -0.00669617235010976 
 240.000000000000  90.0000000000000 -0.00673938101431505 
 240.000000000000  100.000000000000 -0.00657781699669172 
 240.000000000000  110.000000000000 -0.00621638933815992 
 240.000000000000  120.000000000000 -0.00566607983523291 
 240.000000000000  130.000000000000 -0.00494360936368709 
 240.000000000000  140.000000000000 -0.00407092982321268 
 240.000000000000  150.000000000000 -0.00307455714004984 
 240.000000000000  160.000000000000 -0.00198476559398757 
 240.000000000000  170.000000000000 -0.000834667949691837 
 240.000000000000  180.000000000000  0.000340790657892924 
 240.000000000000  190.000000000000  0.00150589451378600 
 240.000000000000  200.000000000000  0.00262524252689708 
 240.000000000000  210.000000000000  0.00366482387426521 
 240.000000000000  220.000000000000  0.00459305140270415 
 240.000000000000  230.000000000000  0.00538172138846808 
 240.000000000000  240.000000000000  0.00600687049312583 
 240.000000000000  250.000000000000  0.00644950387747309 
 240.000000000000  260.000000000000  0.00669617235010976 
 240.000000000000  270.000000000000  0.00673938101431505 
 240.000000000000  280.000000000000  0.00657781699669172 
 240.000000000000  290.000000000000  0.00621638933815992 
 240.000000000000  300.000000000000  0.00566607983523291 
 240.000000000000  310.000000000000  0.00494360936368709 
 240.000000000000  320.000000000000  0.00407092982321268 
 240.000000000000  330.000000000000  0.00307455714004985 
 240.000000000000  340.000000000000  0.00198476559398757 
 240.000000000000  350.000000000000  0.000834667949691836 
 240.000000000000  360.000000000000 -0.000340790657892922 

 250.000000000000  0.00000000000000 -0.000392314134317589 
 250.000000000000  10.0000000000000 -0.00173284720496000 
 250.000000000000  20.0000000000000 -0.00302072859014269 
 250.000000000000  30.0000000000000 -0.00421682666567631 
 250.000000000000  40.0000000000000 -0.00528479859679062 
 250.000000000000  50.0000000000000 -0.00619219459677857 
 250.000000000000  60.0000000000000 -0.00691144389734505 
 250.000000000000  70.0000000000000 -0.00742069247245007 
 250.000000000000  80.0000000000000 -0.00770446706183126 
 250.000000000000  90.0000000000000 -0.00775414531818717 
 250.000000000000  100.000000000000 -0.00756821779283681 
 250.000000000000  110.000000000000 -0.00715233379955409 
 250.000000000000  120.000000000000 -0.00651912976302746 
 250.000000000000  130.000000000000 -0.00568784526749007 
 250.000000000000  140.000000000000 -0.00468373847168858 
 250.000000000000  150.000000000000 -0.00353731865251085 
 250.000000000000  160.000000000000 -0.00228341919604619 
 250.000000000000  170.000000000000 -0.000960139202775526 
 250.000000000000  180.000000000000  0.000392314134317590 
 250.000000000000  190.000000000000  0.00173284720496000 
 250.000000000000  200.000000000000  0.00302072859014269 
 250.000000000000  210.000000000000  0.00421682666567631 
 250.000000000000  220.000000000000  0.00528479859679062 
 250.000000000000  230.000000000000  0.00619219459677856 
 250.000000000000  240.000000000000  0.00691144389734505 
 250.000000000000  250.000000000000  0.00742069247245007 
 250.000000000000  260.000000000000  0.00770446706183127 
 250.000000000000  270.000000000000  0.00775414531818717 
 250.000000000000  280.000000000000  0.00756821779283681 
 250.000000000000  290.000000000000  0.00715233379955409 
 250.000000000000  300.000000000000  0.00651912976302746 
 250.000000000000  310.000000000000  0.00568784526749007 
 250.000000000000  320.000000000000  0.00468373847168858 
 250.000000000000  330.000000000000  0.00353731865251085 
 250.000000000000  340.000000000000  0.00228341919604619 
 250.000000000000  350.000000000000  0.000960139202775526 
 250.000000000000  360.000000000000 -0.000392314134317589 

 260.000000000000  0.00000000000000 -0.000431917344291547 
 260.000000000000  10.0000000000000 -0.00190714821067428 
 260.000000000000  20.0000000000000 -0.00332443134373923 
 260.000000000000  30.0000000000000 -0.00464070331266810 
 260.000000000000  40.0000000000000 -0.00581596985975073 
 260.000000000000  50.0000000000000 -0.00681452110566759 
 260.000000000000  60.0000000000000 -0.00760601657610280 
 260.000000000000  70.0000000000000 -0.00816640708170322 
 260.000000000000  80.0000000000000 -0.00847866544052747 
 260.000000000000  90.0000000000000 -0.00853330384035302 
 260.000000000000  100.000000000000 -0.00832866212104954 
 260.000000000000  110.000000000000 -0.00787095821770435 
 260.000000000000  120.000000000000 -0.00717409923181125 
 260.000000000000  130.000000000000 -0.00625925887102895 
 260.000000000000  140.000000000000 -0.00515423409678824 
 260.000000000000  150.000000000000 -0.00389260052768492 
 260.000000000000  160.000000000000 -0.00251269226129881 
 260.000000000000  170.000000000000 -0.00105643711203676 
 260.000000000000  180.000000000000  0.000431917344291547 
 260.000000000000  190.000000000000  0.00190714821067428 
 260.000000000000  200.000000000000  0.00332443134373923 
 260.000000000000  210.000000000000  0.00464070331266810 
 260.000000000000  220.000000000000  0.00581596985975073 
 260.000000000000  230.000000000000  0.00681452110566759 
 260.000000000000  240.000000000000  0.00760601657610280 
 260.000000000000  250.000000000000  0.00816640708170322 
 260.000000000000  260.000000000000  0.00847866544052747 
 260.000000000000  270.000000000000  0.00853330384035302 
 260.000000000000  280.000000000000  0.00832866212104954 
 260.000000000000  290.000000000000  0.00787095821770435 
 260.000000000000  300.000000000000  0.00717409923181125 
 260.000000000000  310.000000000000  0.00625925887102895 
 260.000000000000  320.000000000000  0.00515423409678824 
 260.000000000000  330.000000000000  0.00389260052768492 
 260.000000000000  340.000000000000  0.00251269226129881 
 260.000000000000  350.000000000000  0.00105643711203676 
 260.000000000000  360.000000000000 -0.000431917344291545 

 270.000000000000  0.00000000000000 -0.000458396964319928 
 270.000000000000  10.0000000000000 -0.00202350148307078 
 270.000000000000  20.0000000000000 -0.00352712293319969 
 270.000000000000  30.0000000000000 -0.00492357453781365 
 270.000000000000  40.0000000000000 -0.00617042582154507 
 270.000000000000  50.0000000000000 -0.00722979183907496 
 270.000000000000  60.0000000000000 -0.00806948429002576 
 270.000000000000  70.0000000000000 -0.00866398954418020 
 270.000000000000  80.0000000000000 -0.00899524386022498 
 270.000000000000  90.0000000000000 -0.00905318224338984 
 270.000000000000  100.000000000000 -0.00883604426522056 
 270.000000000000  110.000000000000 -0.00835042755330669 
 270.000000000000  120.000000000000 -0.00761108732570583 
 270.000000000000  130.000000000000 -0.00664048806110942 
 270.000000000000  140.000000000000 -0.00546812092702529 
 270.000000000000  150.000000000000 -0.00412960770557619 
 270.000000000000  160.000000000000 -0.00266561844367550 
 270.000000000000  170.000000000000 -0.00112063571423173 
 270.000000000000  180.000000000000  0.000458396964319926 
 270.000000000000  190.000000000000  0.00202350148307078 
 270.000000000000  200.000000000000  0.00352712293319969 
 270.000000000000  210.000000000000  0.00492357453781364 
 270.000000000000  220.000000000000  0.00617042582154507 
 270.000000000000  230.000000000000  0.00722979183907497 
 270.000000000000  240.000000000000  0.00806948429002576 
 270.000000000000  250.000000000000  0.00866398954418020 
 270.000000000000  260.000000000000  0.00899524386022498 
 270.000000000000  270.000000000000  0.00905318224338984 
 270.000000000000  280.000000000000  0.00883604426522056 
 270.000000000000  290.000000000000  0.00835042755330670 
 270.000000000000  300.000000000000  0.00761108732570583 
 270.000000000000  310.000000000000  0.00664048806110942 
 270.000000000000  320.000000000000  0.00546812092702529 
 270.000000000000  330.000000000000  0.00412960770557619 
 270.000000000000  340.000000000000  0.00266561844367550 
 270.000000000000  350.000000000000  0.00112063571423173 
 270.000000000000  360.000000000000 -0.000458396964319925 

 280.000000000000  0.00000000000000 -0.000470948424547504 
 280.000000000000  10.0000000000000 -0.00207837168684534 
 280.000000000000  20.0000000000000 -0.00362264467714520 
 280.000000000000  30.0000000000000 -0.00505684544207666 
 280.000000000000  40.0000000000000 -0.00633739651713788 
 280.000000000000  50.0000000000000 -0.00742538900590324 
 280.000000000000  60.0000000000000 -0.00828776480715237 
 280.000000000000  70.0000000000000 -0.00889832106854752 
 280.000000000000  80.0000000000000 -0.00923850634704257 
 280.000000000000  90.0000000000000 -0.00929798428509252 
 280.000000000000  100.000000000000 -0.00907494767564700 
 280.000000000000  110.000000000000 -0.00857617337322205 
 280.000000000000  120.000000000000 -0.00781681638260486 
 280.000000000000  130.000000000000 -0.00681994938170218 
 280.000000000000  140.000000000000 -0.00561586166989737 
 280.000000000000  150.000000000000 -0.00424113884301586 
 280.000000000000  160.000000000000 -0.00273755115850912 
 280.000000000000  170.000000000000 -0.00115078436731881 
 280.000000000000  180.000000000000  0.000470948424547501 
 280.000000000000  190.000000000000  0.00207837168684534 
 280.000000000000  200.000000000000  0.00362264467714519 
 280.000000000000  210.000000000000  0.00505684544207666 
 280.000000000000  220.000000000000  0.00633739651713788 
 280.000000000000  230.000000000000  0.00742538900590324 
 280.000000000000  240.000000000000  0.00828776480715237 
 280.000000000000  250.000000000000  0.00889832106854752 
 280.000000000000  260.000000000000  0.00923850634704257 
 280.000000000000  270.000000000000  0.00929798428509252 
 280.000000000000  280.000000000000  0.00907494767564700 
 280.000000000000  290.000000000000  0.00857617337322205 
 280.000000000000  300.000000000000  0.00781681638260486 
 280.000000000000  310.000000000000  0.00681994938170218 
 280.000000000000  320.000000000000  0.00561586166989737 
 280.000000000000  330.000000000000  0.00424113884301586 
 280.000000000000  340.000000000000  0.00273755115850912 
 280.000000000000  350.000000000000  0.00115078436731881 
 280.000000000000  360.000000000000 -0.000470948424547500 

 290.000000000000  0.00000000000000 -0.000469190355206606 
 290.000000000000  10.0000000000000 -0.00207009161862192 
 290.000000000000  20.0000000000000 -0.00360809419572231 
 290.000000000000  30.0000000000000 -0.00503646665646943 
 290.000000000000  40.0000000000000 -0.00631180862643483 
 290.000000000000  50.0000000000000 -0.00739536948521529 
 290.000000000000  60.0000000000000 -0.00825422578442499 
 290.000000000000  70.0000000000000 -0.00886228161001474 
 290.000000000000  80.0000000000000 -0.00920106149341506 
 290.000000000000  90.0000000000000 -0.00926027177929973 
 290.000000000000  100.000000000000 -0.00903811339309400 
 290.000000000000  110.000000000000 -0.00854133650494517 
 290.000000000000  120.000000000000 -0.00778503542921839 
 290.000000000000  130.000000000000 -0.00679218999139282 
 290.000000000000  140.000000000000 -0.00559296729769275 
 290.000000000000  150.000000000000 -0.00422380512283030 
 290.000000000000  160.000000000000 -0.00272630476665918 
 290.000000000000  170.000000000000 -0.00114596701972989 
 290.000000000000  180.000000000000  0.000469190355206602 
 290.000000000000  190.000000000000  0.00207009161862191 
 290.000000000000  200.000000000000  0.00360809419572231 
 290.000000000000  210.000000000000  0.00503646665646943 
 290.000000000000  220.000000000000  0.00631180862643483 
 290.000000000000  230.000000000000  0.00739536948521528 
 290.000000000000  240.000000000000  0.00825422578442499 
 290.000000000000  250.000000000000  0.00886228161001474 
 290.000000000000  260.000000000000  0.00920106149341506 
 290.000000000000  270.000000000000  0.00926027177929973 
 290.000000000000  280.000000000000  0.00903811339309401 
 290.000000000000  290.000000000000  0.00854133650494517 
 290.000000000000  300.000000000000  0.00778503542921839 
 290.000000000000  310.000000000000  0.00679218999139282 
 290.000000000000  320.000000000000  0.00559296729769275 
 290.000000000000  330.000000000000  0.00422380512283030 
 290.000000000000  340.000000000000  0.00272630476665918 
 290.000000000000  350.000000000000  0.00114596701972989 
 290.000000000000  360.000000000000 -0.000469190355206601 

 300.000000000000  0.00000000000000 -0.000453176174344530 
 300.000000000000  10.0000000000000 -0.00199891286408357 
 300.000000000000  20.0000000000000 -0.00348391359794615 
 300.000000000000  30.0000000000000 -0.00486305738008048 
 300.000000000000  40.0000000000000 -0.00609443962454683 
 300.000000000000  50.0000000000000 -0.00714064540495658 
 300.000000000000  60.0000000000000 -0.00796988628807765 
 300.000000000000  70.0000000000000 -0.00855696620929254 
 300.000000000000  80.0000000000000 -0.00888404704227190 
 300.000000000000  90.0000000000000 -0.00894119060141654 
 300.000000000000  100.000000000000 -0.00872666060859790 
 300.000000000000  110.000000000000 -0.00824697544909035 
 300.000000000000  120.000000000000 -0.00751671011373312 
 300.000000000000  130.000000000000 -0.00655805334520896 
 300.000000000000  140.000000000000 -0.00540013344432574 
 300.000000000000  150.000000000000 -0.00407813322133606 
 300.000000000000  160.000000000000 -0.00263222098405107 
 300.000000000000  170.000000000000 -0.00110633004413377 
 300.000000000000  180.000000000000  0.000453176174344527 
 300.000000000000  190.000000000000  0.00199891286408358 
 300.000000000000  200.000000000000  0.00348391359794615 
 300.000000000000  210.000000000000  0.00486305738008048 
 300.000000000000  220.000000000000  0.00609443962454683 
 300.000000000000  230.000000000000  0.00714064540495659 
 300.000000000000  240.000000000000  0.00796988628807765 
 300.000000000000  250.000000000000  0.00855696620929254 
 300.000000000000  260.000000000000  0.00888404704227190 
 300.000000000000  270.000000000000  0.00894119060141654 
 300.000000000000  280.000000000000  0.00872666060859790 
 300.000000000000  290.000000000000  0.00824697544909034 
 300.000000000000  300.000000000000  0.00751671011373312 
 300.000000000000  310.000000000000  0.00655805334520896 
 300.000000000000  320.000000000000  0.00540013344432575 
 300.000000000000  330.000000000000  0.00407813322133606 
 300.000000000000  340.000000000000  0.00263222098405107 
 300.000000000000  350.000000000000  0.00110633004413377 
 300.000000000000  360.000000000000 -0.000453176174344525 

 310.000000000000  0.00000000000000 -0.000423392464743205 
 310.000000000000  10.0000000000000 -0.00186699815366876 
 310.000000000000  20.0000000000000 -0.00325387604844174 
 310.000000000000  30.0000000000000 -0.00454188656602356 
 310.000000000000  40.0000000000000 -0.00569189415860224 
 310.000000000000  50.0000000000000 -0.00666895642740920 
 310.000000000000  60.0000000000000 -0.00744338582982413 
 310.000000000000  70.0000000000000 -0.00799165172033481 
 310.000000000000  80.0000000000000 -0.00829709531729402 
 310.000000000000  90.0000000000000 -0.00835043587157006 
 310.000000000000  100.000000000000 -0.00815005265741289 
 310.000000000000  110.000000000000 -0.00770203421738585 
 310.000000000000  120.000000000000 -0.00701999336508092 
 310.000000000000  130.000000000000 -0.00612465356666605 
 310.000000000000  140.000000000000 -0.00504321926885228 
 310.000000000000  150.000000000000 -0.00380854930554651 
 310.000000000000  160.000000000000 -0.00245815849881065 
 310.000000000000  170.000000000000 -0.00103307778997665 
 310.000000000000  180.000000000000  0.000423392464743208 
 310.000000000000  190.000000000000  0.00186699815366877 
 310.000000000000  200.000000000000  0.00325387604844175 
 310.000000000000  210.000000000000  0.00454188656602356 
 310.000000000000  220.000000000000  0.00569189415860223 
 310.000000000000  230.000000000000  0.00666895642740920 
 310.000000000000  240.000000000000  0.00744338582982413 
 310.000000000000  250.000000000000  0.00799165172033482 
 310.000000000000  260.000000000000  0.00829709531729402 
 310.000000000000  270.000000000000  0.00835043587157006 
 310.000000000000  280.000000000000  0.00815005265741288 
 310.000000000000  290.000000000000  0.00770203421738585 
 310.000000000000  300.000000000000  0.00701999336508092 
 310.000000000000  310.000000000000  0.00612465356666605 
 310.000000000000  320.000000000000  0.00504321926885228 
 310.000000000000  330.000000000000  0.00380854930554651 
 310.000000000000  340.000000000000  0.00245815849881065 
 310.000000000000  350.000000000000  0.00103307778997665 
 310.000000000000  360.000000000000 -0.000423392464743207 

 320.000000000000  0.00000000000000 -0.000380744189347583 
 320.000000000000  10.0000000000000 -0.00167835564910138 
 320.000000000000  20.0000000000000 -0.00292497112174617 
 320.000000000000  30.0000000000000 -0.00408271282696350 
 320.000000000000  40.0000000000000 -0.00511640336888593 
 320.000000000000  50.0000000000000 -0.00599463458346978 
 320.000000000000  60.0000000000000 -0.00669072185966636 
 320.000000000000  70.0000000000000 -0.00718351493782561 
 320.000000000000  80.0000000000000 -0.00745804054963298 
 320.000000000000  90.0000000000000 -0.00750595737329037 
 320.000000000000  100.000000000000 -0.00732580948035802 
 320.000000000000  110.000000000000 -0.00692307057340346 
 320.000000000000  120.000000000000 -0.00630997767031878 
 320.000000000000  130.000000000000 -0.00550515928872423 
 320.000000000000  140.000000000000 -0.00453306942788682 
 320.000000000000  150.000000000000 -0.00342324454632687 
 320.000000000000  160.000000000000 -0.00220940611147210 
 320.000000000000  170.000000000000 -0.000928435989933681 
 320.000000000000  180.000000000000  0.000380744189347585 
 320.000000000000  190.000000000000  0.00167835564910138 
 320.000000000000  200.000000000000  0.00292497112174617 
 320.000000000000  210.000000000000  0.00408271282696350 
 320.000000000000  220.000000000000  0.00511640336888592 
 320.000000000000  230.000000000000  0.00599463458346978 
 320.000000000000  240.000000000000  0.00669072185966636 
 320.000000000000  250.000000000000  0.00718351493782561 
 320.000000000000  260.000000000000  0.00745804054963298 
 320.000000000000  270.000000000000  0.00750595737329036 
 320.000000000000  280.000000000000  0.00732580948035802 
 320.000000000000  290.000000000000  0.00692307057340346 
 320.000000000000  300.000000000000  0.00630997767031878 
 320.000000000000  310.000000000000  0.00550515928872423 
 320.000000000000  320.000000000000  0.00453306942788682 
 320.000000000000  330.000000000000  0.00342324454632687 
 320.000000000000  340.000000000000  0.00220940611147210 
 320.000000000000  350.000000000000  0.000928435989933681 
 320.000000000000  360.000000000000 -0.000380744189347584 

 330.000000000000  0.00000000000000 -0.000326527194424490 
 330.000000000000  10.0000000000000 -0.00143871715742499 
 330.000000000000  20.0000000000000 -0.00250719242762313 
 330.000000000000  30.0000000000000 -0.00349948792460854 
 330.000000000000  40.0000000000000 -0.00438545325183104 
 330.000000000000  50.0000000000000 -0.00513816880114309 
 330.000000000000  60.0000000000000 -0.00573476369147126 
 330.000000000000  70.0000000000000 -0.00615711068896453 
 330.000000000000  80.0000000000000 -0.00639237699382196 
 330.000000000000  90.0000000000000 -0.00643341415842094 
 330.000000000000  100.000000000000 -0.00627897528928094 
 330.000000000000  110.000000000000 -0.00593375293329095 
 330.000000000000  120.000000000000 -0.00540823649704677 
 330.000000000000  130.000000000000 -0.00471839353153955 
 330.000000000000  140.000000000000 -0.00388518456619882 
 330.000000000000  150.000000000000 -0.00293392623381240 
 330.000000000000  160.000000000000 -0.00189352203744989 
 330.000000000000  170.000000000000 -0.000795584132147859 
 330.000000000000  180.000000000000  0.000326527194424491 
 330.000000000000  190.000000000000  0.00143871715742499 
 330.000000000000  200.000000000000  0.00250719242762313 
 330.000000000000  210.000000000000  0.00349948792460854 
 330.000000000000  220.000000000000  0.00438545325183104 
 330.000000000000  230.000000000000  0.00513816880114309 
 330.000000000000  240.000000000000  0.00573476369147126 
 330.000000000000  250.000000000000  0.00615711068896453 
 330.000000000000  260.000000000000  0.00639237699382195 
 330.000000000000  270.000000000000  0.00643341415842094 
 330.000000000000  280.000000000000  0.00627897528928094 
 330.000000000000  290.000000000000  0.00593375293329095 
 330.000000000000  300.000000000000  0.00540823649704677 
 330.000000000000  310.000000000000  0.00471839353153955 
 330.000000000000  320.000000000000  0.00388518456619882 
 330.000000000000  330.000000000000  0.00293392623381240 
 330.000000000000  340.000000000000  0.00189352203744989 
 330.000000000000  350.000000000000  0.000795584132147860 
 330.000000000000  360.000000000000 -0.000326527194424490 

 340.000000000000  0.00000000000000 -0.000262388835929542 
 340.000000000000  10.0000000000000 -0.00115536397294625 
 340.000000000000  20.0000000000000 -0.00201323396028736 
 340.000000000000  30.0000000000000 -0.00280993285249068 
 340.000000000000  40.0000000000000 -0.00352125335686570 
 340.000000000000  50.0000000000000 -0.00412558235983253 
 340.000000000000  60.0000000000000 -0.00460455763044125 
 340.000000000000  70.0000000000000 -0.00494362574746761 
 340.000000000000  80.0000000000000 -0.00513248429775249 
 340.000000000000  90.0000000000000 -0.00516539490981253 
 340.000000000000  100.000000000000 -0.00504135761135386 
 340.000000000000  110.000000000000 -0.00476414121292425 
 340.000000000000  120.000000000000 -0.00434216879451171 
 340.000000000000  130.000000000000 -0.00378826177452136 
 340.000000000000  140.000000000000 -0.00311925033746513 
 340.000000000000  150.000000000000 -0.00235546205732185 
 340.000000000000  160.000000000000 -0.00152010425448816 
 340.000000000000  170.000000000000 -0.000638558853091721 
 340.000000000000  180.000000000000  0.000262388835929544 
 340.000000000000  190.000000000000  0.00115536397294625 
 340.000000000000  200.000000000000  0.00201323396028736 
 340.000000000000  210.000000000000  0.00280993285249068 
 340.000000000000  220.000000000000  0.00352125335686570 
 340.000000000000  230.000000000000  0.00412558235983253 
 340.000000000000  240.000000000000  0.00460455763044125 
 340.000000000000  250.000000000000  0.00494362574746760 
 340.000000000000  260.000000000000  0.00513248429775249 
 340.000000000000  270.000000000000  0.00516539490981253 
 340.000000000000  280.000000000000  0.00504135761135386 
 340.000000000000  290.000000000000  0.00476414121292425 
 340.000000000000  300.000000000000  0.00434216879451171 
 340.000000000000  310.000000000000  0.00378826177452136 
 340.000000000000  320.000000000000  0.00311925033746513 
 340.000000000000  330.000000000000  0.00235546205732185 
 340.000000000000  340.000000000000  0.00152010425448816 
 340.000000000000  350.000000000000  0.000638558853091722 
 340.000000000000  360.000000000000 -0.000262388835929541 

 350.000000000000  0.00000000000000 -0.000190277925430033 
 350.000000000000  10.0000000000000 -0.000836905638791912 
 350.000000000000  20.0000000000000 -0.00145810439781379 
 350.000000000000  30.0000000000000 -0.00203499939254452 
 350.000000000000  40.0000000000000 -0.00255006196049216 
 350.000000000000  50.0000000000000 -0.00298764218616386 
 350.000000000000  60.0000000000000 -0.00333444441582887 
 350.000000000000  70.0000000000000 -0.00357993123922921 
 350.000000000000  80.0000000000000 -0.00371664366345818 
 350.000000000000  90.0000000000000 -0.00374042775068541 
 350.000000000000  100.000000000000 -0.00365056083345584 
 350.000000000000  110.000000000000 -0.00344977347257463 
 350.000000000000  120.000000000000 -0.00314416649039884 
 350.000000000000  130.000000000000 -0.00274302560043730 
 350.000000000000  140.000000000000 -0.00225853926564439 
 350.000000000000  150.000000000000 -0.00170542835814090 
 350.000000000000  160.000000000000 -0.00110049887296368 
 350.000000000000  170.000000000000 -0.000462131286410762 
 350.000000000000  180.000000000000  0.000190277925430033 
 350.000000000000  190.000000000000  0.000836905638791913 
 350.000000000000  200.000000000000  0.00145810439781379 
 350.000000000000  210.000000000000  0.00203499939254452 
 350.000000000000  220.000000000000  0.00255006196049216 
 350.000000000000  230.000000000000  0.00298764218616386 
 350.000000000000  240.000000000000  0.00333444441582887 
 350.000000000000  250.000000000000  0.00357993123922921 
 350.000000000000  260.000000000000  0.00371664366345818 
 350.000000000000  270.000000000000  0.00374042775068541 
 350.000000000000  280.000000000000  0.00365056083345584 
 350.000000000000  290.000000000000  0.00344977347257463 
 350.000000000000  300.000000000000  0.00314416649039884 
 350.000000000000  310.000000000000  0.00274302560043730 
 350.000000000000  320.000000000000  0.00225853926564439 
 350.000000000000  330.000000000000  0.00170542835814090 
 350.000000000000  340.000000000000  0.00110049887296368 
 350.000000000000  350.000000000000  0.000462131286410762 
 350.000000000000  360.000000000000 -0.000190277925430033 

 360.000000000000  0.00000000000000 -0.000112385516451608 
 360.000000000000  10.0000000000000 -0.000493018350297575 
 360.000000000000  20.0000000000000 -0.000858671071049071 
 360.000000000000  30.0000000000000 -0.00119823350581527 
 360.000000000000  40.0000000000000 -0.00150138822184268 
 360.000000000000  50.0000000000000 -0.00175892401648851 
 360.000000000000  60.0000000000000 -0.00196301579495182 
 360.000000000000  70.0000000000000 -0.00210746233181944 
 360.000000000000  80.0000000000000 -0.00218787469216214 
 360.000000000000  90.0000000000000 -0.00220180958710149 
 360.000000000000  100.000000000000 -0.00214884361190618 
 360.000000000000  110.000000000000 -0.00203058611093043 
 360.000000000000  120.000000000000 -0.00185063027850022 
 360.000000000000  130.000000000000 -0.00161444398152187 
 360.000000000000  140.000000000000 -0.00132920362111306 
 360.000000000000  150.000000000000 -0.00100357608128622 
 360.000000000000  160.000000000000 -0.000647455390063493 
 360.000000000000  170.000000000000 -0.000271662094441925 
 360.000000000000  180.000000000000  0.000112385516451608 
 360.000000000000  190.000000000000  0.000493018350297575 
 360.000000000000  200.000000000000  0.000858671071049073 
 360.000000000000  210.000000000000  0.00119823350581527 
 360.000000000000  220.000000000000  0.00150138822184268 
 360.000000000000  230.000000000000  0.00175892401648850 
 360.000000000000  240.000000000000  0.00196301579495182 
 360.000000000000  250.000000000000  0.00210746233181945 
 360.000000000000  260.000000000000  0.00218787469216213 
 360.000000000000  270.000000000000  0.00220180958710149 
 360.000000000000  280.000000000000  0.00214884361190618 
 360.000000000000  290.000000000000  0.00203058611093043 
 360.000000000000  300.000000000000  0.00185063027850022 
 360.000000000000  310.000000000000  0.00161444398152187 
 360.000000000000  320.000000000000  0.00132920362111306 
 360.000000000000  330.000000000000  0.00100357608128622 
 360.000000000000  340.000000000000  0.000647455390063494 
 360.000000000000  350.000000000000  0.000271662094441925 
 360.000000000000  360.000000000000 -0.000112385516451608 

