-10.0000000000000  0.0251606390623893 
-8.10000000000000  0.0188075676550787 
-6.20000000000000  0.0137244004113396 
-4.30000000000000  0.00995585725492508 
-2.40000000000000  0.00753509250764277 
-0.500000000000000  0.00648340320925212 
 1.40000000000000  0.00681004175357350 
 3.30000000000000  0.00851213448917032 
 5.20000000000000  0.0115747070007273 
 7.10000000000000  0.0159708158487079 
 9.00000000000000  0.0216617856082919 
 10.9000000000000  0.0285975491222071 
 12.8000000000000  0.0367170879740311 
 14.7000000000000  0.0459489693068315 
 16.6000000000000  0.0562119742644044 
 18.5000000000000  0.0674158125263042 
 20.4000000000000  0.0794619166504360 
 22.3000000000000  0.0922443092348639 
 24.2000000000000  0.105650535269848 
 26.1000000000000  0.119562651477603 
 28.0000000000000  0.133858263935921 
 29.9000000000000  0.148411604856998 
 31.8000000000000  0.163094639048346 
 33.7000000000000  0.177778190321546 
 35.6000000000000  0.192333077939076 
 37.5000000000000  0.206631253101160 
 39.4000000000000  0.220546925474226 
 41.3000000000000  0.233957669850178 
 43.2000000000000  0.246745503200459 
 45.1000000000000  0.258797922649388 
 47.0000000000000  0.270008895235027 
 48.9000000000000  0.280279790750015 
 50.8000000000000  0.289520249455563 
 52.7000000000000  0.297648977034763 
 54.6000000000000  0.304594459791498 
 56.5000000000000  0.310295593802871 
 58.4000000000000  0.314702222490105 
 60.3000000000000  0.317775577878540 
 62.2000000000000  0.319488621664689 
 64.1000000000000  0.319826283089753 
 66.0000000000000  0.318785591526874 
 67.9000000000000  0.316375702615671 
 69.8000000000000  0.312617817714129 
 71.7000000000000  0.307544997376487 
 73.6000000000000  0.301201870498062 
 75.5000000000000  0.293644241685877 
 77.4000000000000  0.284938600309286 
 79.3000000000000  0.275161535549805 
 81.2000000000000  0.264399062596338 
 83.1000000000000  0.252745865913696 
 85.0000000000000  0.240304466241858 
 86.9000000000000  0.227184318654438 
 88.8000000000000  0.213500849611310 
 90.7000000000000  0.199374441477069 
 92.6000000000000  0.184929373439183 
 94.5000000000000  0.170292728143261 
 96.4000000000000  0.155593273664482 
 98.3000000000000  0.140960330651197 
 100.200000000000  0.126522634607197 
 102.100000000000  0.112407203321868 
 104.000000000000  0.0987382194122051 
 105.900000000000  0.0856359378076681 
 107.800000000000  0.0732156277894654 
 109.700000000000  0.0615865588918190 
 111.600000000000  0.0508510395869009 
 113.500000000000  0.0411035172107541 
 115.400000000000  0.0324297470487342 
 117.300000000000  0.0249060378905659 
 119.200000000000  0.0185985806923573 
 121.100000000000  0.0135628662517682 
 123.000000000000  0.00984319701942167 
 124.900000000000  0.00747229734147149 
 126.800000000000  0.00647102556227488 
 128.700000000000  0.00684819051998967 
 130.600000000000  0.00860047404950372 
 132.500000000000  0.0117124601744887 
 134.400000000000  0.0161567707317567 
 136.300000000000  0.0218943062347436 
 138.200000000000  0.0288745898570883 
 140.100000000000  0.0370362115100587 
 142.000000000000  0.0463073681069879 
 143.900000000000  0.0566064952616641 
 145.800000000000  0.0678429848632124 
 147.700000000000  0.0799179822144963 
 149.600000000000  0.0927252557210941 
 151.500000000000  0.106152131479633 
 153.400000000000  0.120080484543299 
 155.300000000000  0.134387778143717 
 157.200000000000  0.148948141726486 
 159.100000000000  0.163633478316205 
 161.000000000000  0.178314591468762 
 162.900000000000  0.192862321896362 
 164.800000000000  0.207148683765680 
 166.700000000000  0.221047990672354 
 168.600000000000  0.234437961385923 
 170.500000000000  0.247200795637232 
 172.400000000000  0.259224210483910 
 174.300000000000  0.270402428136345 
 176.200000000000  0.280637106553595 
 178.100000000000  0.289838204622205 
 180.000000000000  0.297924774306355 
