-180.000000000000  0.0264630358869389 
-178.200000000000  0.0264891492846710 
-176.400000000000  0.0265676958440968 
-174.600000000000  0.0266992981357840 
-172.800000000000  0.0268850054507841 
-171.000000000000  0.0271263116670397 
-169.200000000000  0.0274251809911950 
-167.400000000000  0.0277840823438423 
-165.600000000000  0.0282060334344756 
-163.800000000000  0.0286946558999502 
-162.000000000000  0.0292542432743412 
-160.200000000000  0.0298898440406879 
-158.400000000000  0.0306073626145412 
-156.600000000000  0.0314136818626743 
-154.800000000000  0.0323168117170433 
-153.000000000000  0.0333260696701592 
-151.200000000000  0.0344523005228089 
-149.400000000000  0.0357081448205491 
-147.600000000000  0.0371083681296977 
-145.800000000000  0.0386702669004804 
-144.000000000000  0.0404141714728995 
-142.200000000000  0.0423640732656112 
-140.400000000000  0.0445484120175591 
-138.600000000000  0.0470010710949592 
-136.800000000000  0.0497626457541470 
-135.000000000000  0.0528820729772607 
-133.200000000000  0.0564187452579310 
-131.400000000000  0.0604452793792466 
-129.600000000000  0.0650511823640578 
-127.800000000000  0.0703477623465884 
-126.000000000000  0.0764747913604007 
-124.200000000000  0.0836096715579009 
-122.400000000000  0.0919802391793539 
-120.600000000000  0.101882952731810 
-118.800000000000  0.113709213846208 
-117.000000000000  0.127984252354126 
-115.200000000000  0.145425916511333 
-113.400000000000  0.167035902602022 
-111.600000000000  0.194245569658784 
-109.800000000000  0.229157018763715 
-108.000000000000  0.274957574321600 
-106.200000000000  0.336665738619522 
-104.400000000000  0.422548470124025 
-102.600000000000  0.546995422535826 
-100.800000000000  0.736833066085079 
-99.0000000000000  1.04665661209996 
-97.2000000000000  1.60116465500798 
-95.4000000000000  2.73349575521427 
-93.6000000000000  5.54619445713912 
-91.8000000000000  14.5574695388240 
-90.0000000000000  31.8058743094543 
-88.2000000000000  14.5574695388241 
-86.4000000000000  5.54619445713907 
-84.6000000000000  2.73349575521425 
-82.8000000000000  1.60116465500798 
-81.0000000000000  1.04665661209996 
-79.2000000000000  0.736833066085080 
-77.4000000000000  0.546995422535824 
-75.6000000000000  0.422548470124024 
-73.8000000000000  0.336665738619522 
-72.0000000000000  0.274957574321600 
-70.2000000000000  0.229157018763716 
-68.4000000000000  0.194245569658784 
-66.6000000000000  0.167035902602022 
-64.8000000000000  0.145425916511333 
-63.0000000000000  0.127984252354126 
-61.2000000000000  0.113709213846208 
-59.4000000000000  0.101882952731810 
-57.6000000000000  0.0919802391793540 
-55.8000000000000  0.0836096715579009 
-54.0000000000000  0.0764747913604007 
-52.2000000000000  0.0703477623465884 
-50.4000000000000  0.0650511823640578 
-48.6000000000000  0.0604452793792466 
-46.8000000000000  0.0564187452579309 
-45.0000000000000  0.0528820729772607 
-43.2000000000000  0.0497626457541471 
-41.4000000000000  0.0470010710949592 
-39.6000000000000  0.0445484120175591 
-37.8000000000000  0.0423640732656112 
-36.0000000000000  0.0404141714728995 
-34.2000000000000  0.0386702669004804 
-32.4000000000000  0.0371083681296977 
-30.6000000000000  0.0357081448205491 
-28.8000000000000  0.0344523005228089 
-27.0000000000000  0.0333260696701592 
-25.2000000000000  0.0323168117170433 
-23.4000000000000  0.0314136818626743 
-21.6000000000000  0.0306073626145412 
-19.8000000000000  0.0298898440406879 
-18.0000000000000  0.0292542432743412 
-16.2000000000000  0.0286946558999502 
-14.4000000000000  0.0282060334344756 
-12.6000000000000  0.0277840823438423 
-10.8000000000000  0.0274251809911950 
-9.00000000000000  0.0271263116670397 
-7.20000000000000  0.0268850054507841 
-5.40000000000000  0.0266992981357840 
-3.60000000000000  0.0265676958440968 
-1.80000000000000  0.0264891492846710 
 4.44089209850063e-15  0.0264630358869389 
 1.80000000000000  0.0264891492846710 
 3.60000000000000  0.0265676958440968 
 5.40000000000000  0.0266992981357840 
 7.20000000000000  0.0268850054507841 
 9.00000000000001  0.0271263116670397 
 10.8000000000000  0.0274251809911950 
 12.6000000000000  0.0277840823438423 
 14.4000000000000  0.0282060334344756 
 16.2000000000000  0.0286946558999502 
 18.0000000000000  0.0292542432743412 
 19.8000000000000  0.0298898440406879 
 21.6000000000000  0.0306073626145412 
 23.4000000000000  0.0314136818626743 
 25.2000000000000  0.0323168117170433 
 27.0000000000000  0.0333260696701592 
 28.8000000000000  0.0344523005228089 
 30.6000000000000  0.0357081448205491 
 32.4000000000000  0.0371083681296977 
 34.2000000000000  0.0386702669004804 
 36.0000000000000  0.0404141714728995 
 37.8000000000000  0.0423640732656112 
 39.6000000000000  0.0445484120175591 
 41.4000000000000  0.0470010710949592 
 43.2000000000000  0.0497626457541471 
 45.0000000000000  0.0528820729772607 
 46.8000000000000  0.0564187452579309 
 48.6000000000000  0.0604452793792467 
 50.4000000000000  0.0650511823640578 
 52.2000000000000  0.0703477623465884 
 54.0000000000000  0.0764747913604007 
 55.8000000000000  0.0836096715579009 
 57.6000000000000  0.0919802391793541 
 59.4000000000000  0.101882952731810 
 61.2000000000000  0.113709213846208 
 63.0000000000000  0.127984252354126 
 64.8000000000000  0.145425916511333 
 66.6000000000000  0.167035902602022 
 68.4000000000000  0.194245569658784 
 70.2000000000000  0.229157018763716 
 72.0000000000000  0.274957574321600 
 73.8000000000000  0.336665738619523 
 75.6000000000000  0.422548470124025 
 77.4000000000000  0.546995422535825 
 79.2000000000000  0.736833066085080 
 81.0000000000000  1.04665661209996 
 82.8000000000000  1.60116465500799 
 84.6000000000000  2.73349575521426 
 86.4000000000000  5.54619445713910 
 88.2000000000000  14.5574695388241 
 90.0000000000000  31.8058743094543 
 91.8000000000000  14.5574695388239 
 93.6000000000000  5.54619445713909 
 95.4000000000000  2.73349575521426 
 97.2000000000000  1.60116465500798 
 99.0000000000000  1.04665661209996 
 100.800000000000  0.736833066085078 
 102.600000000000  0.546995422535824 
 104.400000000000  0.422548470124024 
 106.200000000000  0.336665738619522 
 108.000000000000  0.274957574321600 
 109.800000000000  0.229157018763715 
 111.600000000000  0.194245569658784 
 113.400000000000  0.167035902602022 
 115.200000000000  0.145425916511333 
 117.000000000000  0.127984252354125 
 118.800000000000  0.113709213846208 
 120.600000000000  0.101882952731810 
 122.400000000000  0.0919802391793539 
 124.200000000000  0.0836096715579009 
 126.000000000000  0.0764747913604006 
 127.800000000000  0.0703477623465883 
 129.600000000000  0.0650511823640578 
 131.400000000000  0.0604452793792466 
 133.200000000000  0.0564187452579309 
 135.000000000000  0.0528820729772607 
 136.800000000000  0.0497626457541470 
 138.600000000000  0.0470010710949592 
 140.400000000000  0.0445484120175591 
 142.200000000000  0.0423640732656112 
 144.000000000000  0.0404141714728995 
 145.800000000000  0.0386702669004804 
 147.600000000000  0.0371083681296977 
 149.400000000000  0.0357081448205491 
 151.200000000000  0.0344523005228089 
 153.000000000000  0.0333260696701592 
 154.800000000000  0.0323168117170433 
 156.600000000000  0.0314136818626743 
 158.400000000000  0.0306073626145412 
 160.200000000000  0.0298898440406879 
 162.000000000000  0.0292542432743412 
 163.800000000000  0.0286946558999502 
 165.600000000000  0.0282060334344756 
 167.400000000000  0.0277840823438423 
 169.200000000000  0.0274251809911950 
 171.000000000000  0.0271263116670397 
 172.800000000000  0.0268850054507841 
 174.600000000000  0.0266992981357840 
 176.400000000000  0.0265676958440968 
 178.200000000000  0.0264891492846710 
 180.000000000000  0.0264630358869389 
