-2.00000000000000  0.339138630191533 -103.104820451154 
-1.96000000000000  0.389533392298335 -102.797839835148 
-1.92000000000000  0.445799435648364 -102.490744386878 
-1.88000000000000  0.508339739005946 -102.183475507766 
-1.84000000000000  0.577537490656032 -101.875970514663 
-1.80000000000000  0.653746217167896 -101.568162192293 
-1.76000000000000  0.737278922275010 -101.259978284417 
-1.72000000000000  0.828396338889046 -100.951340913751 
-1.68000000000000  0.927294438039516 -100.642165918780 
-1.64000000000000  1.03409138125300 -100.332362093321 
-1.60000000000000  1.14881414639299 -100.021830311818 
-1.56000000000000  1.27138509990164 -99.7104625199078 
-1.52000000000000  1.40160882916295 -99.3981405654616 
-1.48000000000000  1.53915958564421 -99.0847348399684 
-1.44000000000000  1.68356972076868 -98.7701026934302 
-1.40000000000000  1.83421952029586 -98.4540865775322 
-1.36000000000000  1.99032885753016 -98.1365118612245 
-1.32000000000000  2.15095108925565 -97.8171842493208 
-1.28000000000000  2.31496960940302 -97.4958867174023 
-1.24000000000000  2.48109745287739 -97.1723758539693 
-1.20000000000000  2.64788030485504 -96.8463774717483 
-1.16000000000000  2.81370321877930 -96.5175813120382 
-1.12000000000000  2.97680127934467 -96.1856346157521 
-1.08000000000000  3.13527436561186 -95.8501342678817 
-1.04000000000000  3.28710607530232 -95.5106171320724 
-1.00000000000000  3.43018676614851 -95.1665480696212 
-0.960000000000000  3.56234055640175 -94.8173049690721 
-0.920000000000000  3.68135600726542 -94.4621598788537 
-0.880000000000000  3.78502008868156 -94.1002550063596 
-0.840000000000000  3.87115491053529 -93.7305718773179 
-0.800000000000000  3.93765658826555 -93.3518912692510 
-0.760000000000000  3.98253550962161 -92.9627405320372 
-0.720000000000000  4.00395718255223 -92.5613234097395 
-0.680000000000000  4.00028277770840 -92.1454251896687 
-0.640000000000000  3.97010843764058 -91.7122824368174 
-0.600000000000000  3.91230241367049 -91.2584008772984 
-0.560000000000000  3.82603911672936 -90.7792956662872 
-0.520000000000000  3.71082923856625 -90.2691125445496 
-0.480000000000000  3.56654522828692 -89.7200609728085 
-0.440000000000000  3.39344162171775 -89.1215407433811 
-0.400000000000000  3.19217007030647 -88.4587499484126 
-0.360000000000000  2.96378951916977 -87.7103764570646 
-0.320000000000000  2.70977311813363 -86.8445845210657 
-0.280000000000000  2.43201582465581 -85.8116279590377 
-0.240000000000000  2.13285225584393 -84.5292634341708 
-0.200000000000000  1.81510936567034 -82.8512638626797 
-0.160000000000000  1.48226534577291 -80.4910645391294 
-0.120000000000000  1.13896276003553 -76.8048183254344 
-0.0800000000000000  0.792991502501886 -70.0185872542571 
-0.0400000000000000  0.466145326612708 -53.4430277102555 
 4.16333634234434e-17  0.279882174273551  6.14317978097473e-14 
 0.0400000000000000  0.466145326612708  53.4430277102555 
 0.0800000000000000  0.792991502501887  70.0185872542571 
 0.120000000000000  1.13896276003553  76.8048183254344 
 0.160000000000000  1.48226534577291  80.4910645391294 
 0.200000000000000  1.81510936567034  82.8512638626797 
 0.240000000000000  2.13285225584393  84.5292634341708 
 0.280000000000000  2.43201582465581  85.8116279590377 
 0.320000000000000  2.70977311813363  86.8445845210657 
 0.360000000000000  2.96378951916977  87.7103764570646 
 0.400000000000000  3.19217007030647  88.4587499484126 
 0.440000000000000  3.39344162171776  89.1215407433811 
 0.480000000000000  3.56654522828692  89.7200609728085 
 0.520000000000000  3.71082923856625  90.2691125445496 
 0.560000000000000  3.82603911672936  90.7792956662873 
 0.600000000000000  3.91230241367049  91.2584008772985 
 0.640000000000000  3.97010843764058  91.7122824368174 
 0.680000000000000  4.00028277770840  92.1454251896687 
 0.720000000000000  4.00395718255222  92.5613234097395 
 0.760000000000000  3.98253550962161  92.9627405320372 
 0.800000000000000  3.93765658826555  93.3518912692510 
 0.840000000000000  3.87115491053529  93.7305718773179 
 0.880000000000000  3.78502008868156  94.1002550063596 
 0.920000000000000  3.68135600726542  94.4621598788537 
 0.960000000000000  3.56234055640175  94.8173049690721 
 1.00000000000000  3.43018676614851  95.1665480696212 
 1.04000000000000  3.28710607530232  95.5106171320724 
 1.08000000000000  3.13527436561186  95.8501342678817 
 1.12000000000000  2.97680127934467  96.1856346157521 
 1.16000000000000  2.81370321877930  96.5175813120382 
 1.20000000000000  2.64788030485504  96.8463774717483 
 1.24000000000000  2.48109745287739  97.1723758539693 
 1.28000000000000  2.31496960940302  97.4958867174023 
 1.32000000000000  2.15095108925565  97.8171842493208 
 1.36000000000000  1.99032885753016  98.1365118612245 
 1.40000000000000  1.83421952029586  98.4540865775322 
 1.44000000000000  1.68356972076868  98.7701026934302 
 1.48000000000000  1.53915958564421  99.0847348399684 
 1.52000000000000  1.40160882916295  99.3981405654616 
 1.56000000000000  1.27138509990164  99.7104625199078 
 1.60000000000000  1.14881414639299  100.021830311818 
 1.64000000000000  1.03409138125299  100.332362093321 
 1.68000000000000  0.927294438039515  100.642165918780 
 1.72000000000000  0.828396338889046  100.951340913751 
 1.76000000000000  0.737278922275010  101.259978284417 
 1.80000000000000  0.653746217167896  101.568162192293 
 1.84000000000000  0.577537490656032  101.875970514663 
 1.88000000000000  0.508339739005946  102.183475507766 
 1.92000000000000  0.445799435648364  102.490744386878 
 1.96000000000000  0.389533392298335  102.797839835148 
 2.00000000000000  0.339138630191533  103.104820451154 
