 100.000000000000  100779323090.665  175.897305287883 
 224.750000000000  99808163267.9887  170.836841170881 
 349.500000000000  98157444143.6124  165.904297563077 
 474.250000000000  95926280324.9952  161.157967290388 
 599.000000000000  93235156063.7794  156.642310375667 
 723.750000000000  90210278207.3898  152.386901725903 
 848.500000000000  86970829959.0186  148.407331043086 
 973.250000000000  83620688599.1401  144.707372068259 
 1098.00000000000  80244563800.0409  141.281700730572 
 1222.75000000000  76907563427.7190  138.118602217978 
 1347.50000000000  73656920031.5413  135.202331171593 
 1472.25000000000  70524769457.4179  132.514985435841 
 1597.00000000000  67531198920.3886  130.037886112423 
 1721.75000000000  64687103490.7948  127.752526880086 
 1846.50000000000  61996633927.8059  125.641181051005 
 1971.25000000000  59459174834.3492  123.687254269074 
 2096.00000000000  57070877556.0924  121.875458096919 
 2220.75000000000  54825810322.1102  120.191863541908 
 2345.50000000000  52716798394.9879  118.623878212813 
 2470.25000000000  50736023028.1797  117.160178029130 
 2595.00000000000  48875438100.1749  115.790614563826 
 2719.75000000000  47127051941.7424  114.506111887998 
 2844.50000000000  45483111281.4634  113.298561691287 
 2969.25000000000  43936215259.0797  112.160721957930 
 3094.00000000000  42479380258.9047  111.086122144481 
 3218.75000000000  41106070744.5773  110.068976287091 
 3343.50000000000  39810207066.5940  109.104104508262 
 3468.25000000000  38586158086.6500  108.186862811809 
 3593.00000000000  37428724168.7881  107.313080722440 
 3717.75000000000  36333114421.0714  106.479006154802 
 3842.50000000000  35294920870.9345  105.681256826850 
 3967.25000000000  34310091398.5160  104.916777524356 
 4092.00000000000  33374902642.0929  104.182802551439 
 4216.75000000000  32485933659.3617  103.476822749452 
 4341.50000000000  31640040827.2686  102.796556522834 
 4466.25000000000  30834334254.6371  102.139924369105 
 4591.00000000000  30066155839.3875  101.505026467281 
 4715.75000000000  29333059006.4883  100.890122932442 
 4840.50000000000  28632790100.1636  100.293616392937 
 4965.25000000000  27963271364.3903  99.7140365905005 
 5090.00000000000  27322585422.3269  99.1500267423188 
 5214.75000000000  26708961152.9620  98.6003314381272 
 5339.50000000000  26120760858.4027  98.0637858751662 
 5464.25000000000  25556468615.3109  97.5393062596299 
 5589.00000000000  25014679707.2571  97.0258812256042 
 5713.75000000000  24494091039.9741  96.5225641417949 
 5838.50000000000  23993492447.7810  96.0284661929850 
 5963.25000000000  23511758806.2457  95.5427501374816 
 6088.00000000000  23047842873.0607  95.0646246541190 
 6212.75000000000  22600768785.8625  94.5933392029486 
 6337.50000000000  22169626152.1888  94.1281793328060 
 6462.25000000000  21753564672.8185  93.6684623766941 
 6587.00000000000  21351789245.3590  93.2135334825396 
 6711.75000000000  20963555500.0873  92.7627619325164 
 6836.50000000000  20588165724.7425  92.3155377089032 
 6961.25000000000  20224965139.2072  91.8712682684632 
 7086.00000000000  19873338484.8309  91.4293754906949 
 7210.75000000000  19532706896.5727  90.9892927680664 
 7335.50000000000  19202525029.1931  90.5504622085830 
 7460.25000000000  18882278411.4365  90.1123319227908 
 7585.00000000000  18571481004.5507  89.6743533686275 
 7709.75000000000  18269672943.6009  89.2359787284239 
 7834.50000000000  17976418441.8872  88.7966582928521 
 7959.25000000000  17691303840.3770  88.3558378267245 
 8084.00000000000  17413935785.4442  87.9129558912685 
 8208.75000000000  17143939519.3672  87.4674410968318 
 8333.50000000000  16880957269.0030  87.0187092589000 
 8458.25000000000  16624646718.8190  86.5661604288035 
 8583.00000000000  16374679555.0437  86.1091757685283 
 8707.75000000000  16130740068.0819  85.6471142365812 
 8832.50000000000  15892523800.5377  85.1793090488335 
 8957.25000000000  15659736228.1838  84.7050638746290 
 9082.00000000000  15432091460.9961  84.2236487240914 
 9206.75000000000  15209310950.9311  83.7342954774247 
 9331.50000000000  14991122192.4195  83.2361930009436 
 9456.25000000000  14777257400.5695  82.7284817874674 
 9581.00000000000  14567452150.7637  82.2102480503979 
 9705.75000000000  14361443961.6536  81.6805171911049 
 9830.50000000000  14158970801.4391  81.1382465479257 
 9955.25000000000  13959769494.6933  80.5823173219204 
 10080.0000000000  13763574003.7609  80.0115255592091 
 10204.7500000000  13570113554.8085  79.4245720519344 
 10329.5000000000  13379110573.7994  78.8200509992775 
 10454.2500000000  13190278391.8390  78.1964372461056 
 10579.0000000000  13003318672.2881  77.5520718893227 
 10703.7500000000  12817918503.5381  76.8851460103887 
 10828.5000000000  12633747091.1039  76.1936822563569 
 10953.2500000000  12450451970.3980  75.4755139508039 
 11078.0000000000  12267654646.8400  74.7282613700152 
 11202.7500000000  12084945552.4358  73.9493047688476 
 11327.5000000000  11901878187.2170  73.1357536854415 
 11452.2500000000  11717962289.5917  72.2844119958557 
 11577.0000000000  11532655851.4413  71.3917381315350 
 11701.7500000000  11345355761.6716  70.4537998191842 
 11826.5000000000  11155386826.3160  69.4662226621986 
 11951.2500000000  10961988875.4480  68.4241318683049 
 12076.0000000000  10764301629.7750  67.3220864598426 
 12200.7500000000  10561346967.9039  66.1540054125102 
 12325.5000000000  10352008217.8078  64.9130854028401 
 12450.2500000000  10135006108.0062  63.5917102750202 
 12575.0000000000  9908871079.98999  62.1813530681302 
 12699.7500000000  9671911822.61614  60.6724726261058 
 12824.5000000000  9422180202.32834  59.0544086580805 
 12949.2500000000  9157433321.85085  57.3152819196115 
 13074.0000000000  8875094378.28034  55.4419103331068 
 13198.7500000000  8572215495.68068  53.4197578382394 
 13323.5000000000  8245448019.53180  51.2329410904076 
 13448.2500000000  7891029159.42717  48.8643302602340 
 13573.0000000000  7504798596.68563  46.2957942145738 
 13697.7500000000  7082264772.39662  43.5086564311290 
 13822.5000000000  6618747523.61870  40.4844433695419 
 13947.2500000000  6109629889.77816  37.2060156504359 
 14072.0000000000  5550753690.83153  33.6591633945287 
 14196.7500000000  4938984716.56353  29.8347040774209 
 14321.5000000000  4272945702.23043  25.7310250132219 
 14446.2500000000  3553861279.38306  21.3568503004313 
 14571.0000000000  2786379797.73454  16.7337958289182 
 14695.7500000000  1979152479.19644  11.8980654502213 
 14820.5000000000  1144906101.22065  6.90055198282062 
 14945.2500000000  299798513.866014  1.80477258988854 
 15070.0000000000  537974668.117713  176.682548780825 
 15194.7500000000  1350095521.16760  171.608020883249 
 15319.5000000000  2120120362.56160  166.651172919553 
 15444.2500000000  2835072335.54067  161.872227539198 
 15569.0000000000  3486302177.06900  157.317947607465 
 15693.7500000000  4069555316.73217  153.020232593829 
 15818.5000000000  4584416595.28020  148.996751797342 
 15943.2500000000  5033413562.93521  145.252963767955 
 16068.0000000000  5421044194.00750  141.784790703821 
 16192.7500000000  5752909962.14724  138.581355244933 
 16317.5000000000  6035039679.51417  135.627408810118 
 16442.2500000000  6273417511.24727  132.905284928117 
 16567.0000000000  6473688334.82807  130.396353942669 
 16691.7500000000  6640998772.33191  128.082034480971 
 16816.5000000000  6779932612.77596  125.944448307096 
 16941.2500000000  6894506561.70398  123.966807646112 
 17066.0000000000  6988201109.62436  122.133612612619 
 17190.7500000000  7064009272.26259  120.430720359692 
 17315.5000000000  7124492163.25746  118.845331907282 
 17440.2500000000  7171834796.36945  117.365929384822 
 17565.0000000000  7207898491.65131  115.982186130905 
 17689.7500000000  7234268155.99673  114.684864498837 
 17814.5000000000  7252293855.19409  113.465710824688 
 17939.2500000000  7263126747.25727  112.317353300239 
 18064.0000000000  7267749786.86958  111.233206002257 
 18188.7500000000  7267003760.83752  110.207380702062 
 18313.5000000000  7261609254.16891  109.234607047037 
 18438.2500000000  7252185125.86099  108.310161075046 
 18563.0000000000  7239264023.24026  107.429801657893 
 18687.7500000000  7223305401.69688  106.589714277707 
 18812.5000000000  7204706452.99257  105.786461457164 
 18937.2500000000  7183811285.28282  105.016939148726 
 19062.0000000000  7160918644.01997  104.278338411716 
 19186.7500000000  7136288415.79790  103.568111751313 
 19311.5000000000  7110147116.87826  102.883943548934 
 19436.2500000000  7082692534.07256  102.223724072004 
 19561.0000000000  7054097657.12918  101.585526608601 
 19685.7500000000  7024514018.03095  100.967587326599 
 19810.5000000000  6994074532.92523  100.368287506454 
 19935.2500000000  6962895926.12981  99.7861378413492 
 20060.0000000000  6931080802.21368  99.2197645379664 
 20184.7500000000  6898719421.05400  98.6678969859091 
 20309.5000000000  6865891221.60830  98.1293567941895 
 20434.2500000000  6832666132.57153  97.6030480195999 
 20559.0000000000  6799105701.82635  97.0879484346585 
 20683.7500000000  6765264071.41074  96.5831017025799 
 20808.5000000000  6731188820.42418  96.0876103437542 
 20933.2500000000  6696921694.71822  95.6006293928844 
 21058.0000000000  6662499239.23790  95.1213606585322 
 21182.7500000000  6627953346.39275  94.6490475076500 
 21307.5000000000  6593311731.75365  94.1829701069538 
 21432.2500000000  6558598346.62283  93.7224410609358 
 21557.0000000000  6523833735.55120  93.2668013931034 
 21681.7500000000  6489035345.63232  92.8154168228104 
 21806.5000000000  6454217793.34494  92.3676742949486 
 21931.2500000000  6419393093.81527  91.9229787239030 
 22056.0000000000  6384570856.59661  91.4807499166309 
 22180.7500000000  6349758451.39713  91.0404196425783 
 22305.5000000000  6314961146.60610  90.6014288204668 
 22430.2500000000  6280182222.95876  90.1632247938056 
 22555.0000000000  6245423064.22713  89.7252586683648 
 22679.7500000000  6210683226.41583  89.2869826857979 
 22804.5000000000  6175960486.56838  88.8478476081586 
 22929.2500000000  6141250871.94077  88.4073000882249 
 23054.0000000000  6106548669.96722  87.9647800003249 
 23178.7500000000  6071846419.11910  87.5197177057494 
 23303.5000000000  6037134880.43518  87.0715312258324 
 23428.2500000000  6002402989.17054  86.6196232943396 
 23553.0000000000  5967637785.66572  86.1633782589232 
 23677.7500000000  5932824324.16709  85.7021587990142 
 23802.5000000000  5897945557.92567  85.2353024245929 
 23927.2500000000  5862982198.45244  84.7621177167393 
 24052.0000000000  5827912546.30333  84.2818802666343 
 24176.7500000000  5792712290.19008  83.7938282646698 
 24301.5000000000  5757354270.54947  83.2971576854247 
 24426.2500000000  5721808202.93155  82.7910170073305 
 24551.0000000000  5686040355.66521  82.2745013977466 
 24675.7500000000  5650013175.19752  81.7466462846897 
 24800.5000000000  5613684851.24837  81.2064202254229 
 24925.2500000000  5577008812.43299  80.6527169692522 
 25050.0000000000  5539933141.23216  80.0843465969182 
 25174.7500000000  5502399895.07445  79.5000256016032 
 25299.5000000000  5464344317.76339  78.8983657564280 
 25424.2500000000  5425693922.45050  78.2778615899991 
 25549.0000000000  5386367423.71568  77.6368762646649 
 25673.7500000000  5346273491.94941  76.9736256212078 
 25798.5000000000  5305309297.98606  76.2861601183157 
 25923.2500000000  5263358809.64637  75.5723443549858 
 26048.0000000000  5220290794.31049  74.8298338187952 
 26172.7500000000  5175956472.64222  74.0560484527805 
 26297.5000000000  5130186757.88307  73.2481425790311 
 26422.2500000000  5082789002.49488  72.4029706593008 
 26547.0000000000  5033543159.14715  71.5170483145350 
 26671.7500000000  4982197246.00304  70.5865079706742 
 26796.5000000000  4928461987.02388  69.6070484549296 
 26921.2500000000  4872004477.00752  68.5738778470242 
 27046.0000000000  4812440699.33798  67.4816489126499 
 27170.7500000000  4749326704.04384  66.3243865409129 
 27295.5000000000  4682148238.57203  65.0954068183182 
 27420.2500000000  4610308620.30989  63.7872277654639 
 27545.0000000000  4533114659.39515  62.3914724372383 
 27669.7500000000  4449760500.62829  60.8987661853240 
 27794.5000000000  4359309382.53969  59.2986316054841 
 27919.2500000000  4260673553.04352  57.5793873211777 
 28044.0000000000  4152592998.68053  55.7280606616626 
 28168.7500000000  4033614329.24227  53.7303299434235 
 28293.5000000000  3902072233.24341  51.5705199862877 
 28418.2500000000  3756077529.21467  49.2316851688878 
 28543.0000000000  3593518127.74053  46.6958279239390 
 28667.7500000000  3412082258.29360  43.9443164428857 
 28792.5000000000  3209316940.95726  40.9585811377270 
 28917.2500000000  2982738227.81853  37.7211796784018 
 29042.0000000000  2730011629.23529  34.2173151489399 
 29166.7500000000  2449218499.71154  30.4368554855872 
 29291.5000000000  2139212810.31944  26.3768156763574 
 29416.2500000000  1800048410.02377  22.0441124177184 
 29541.0000000000  1433418562.16038  17.4581906747791 
 29665.7500000000  1043004865.09797  12.6529038380757 
 29790.5000000000  634602125.960732  7.67691143670943 
 29915.2500000000  215898705.354331  2.59197684343445 
 30040.0000000000  204131530.394194  177.468980999491 
 30164.7500000000  616143225.354794  172.382132470165 
 30289.5000000000  1011437095.30449  167.402477754835 
 30414.2500000000  1382832964.41723  162.592077042707 
 30539.0000000000  1725207896.78953  157.999961908395 
 30663.7500000000  2035635465.15408  153.660373449975 
 30788.5000000000  2313187365.41338  149.593112059585 
 30913.2500000000  2558528833.46256  145.805388479312 
 31038.0000000000  2773444716.19817  142.294439630102 
 31162.7500000000  2960396851.72505  139.050286004105 
 31287.5000000000  3122165991.43738  136.058224158078 
 31412.2500000000  3261592815.89226  133.300859174102 
 31537.0000000000  3381409220.05854  130.759635482679 
 31661.7500000000  3484141047.86993  128.415912679633 
 31786.5000000000  3572062047.07055  126.251670407202 
 31911.2500000000  3647181619.57945  124.249932232837 
 32036.0000000000  3711253076.38083  122.394988442329 
 32160.7500000000  3765793066.38717  120.672481943547 
 32285.5000000000  3812106050.06732  119.069405570438 
 32410.2500000000  3851310036.68873  117.574045408733 
 32535.0000000000  3884361415.11599  116.175894015520 
 32659.7500000000  3912077756.73470  114.865549416332 
 32784.5000000000  3935158119.32364  113.634610060461 
 32909.2500000000  3954200763.20411  112.475571969557 
 33034.0000000000  3969718400.88221  111.381731657460 
 33158.7500000000  3982151204.13566  110.347096655884 
 33283.5000000000  3991877831.33357  109.366304369215 
 33408.2500000000  3999224740.37110  108.434549298037 
 33533.0000000000  4004474036.11019  107.547518271516 
 33657.7500000000  4007870075.96585  106.701333114182 
 33782.5000000000  4009625029.24104  105.892500075747 
 33907.2500000000  4009923558.27755  105.117865328415 
 34032.0000000000  4008926764.10839  104.374575855000 
 34156.7500000000  4006775516.76659  103.660045093907 
 34281.5000000000  4003593270.88083  102.971922761378 
 34406.2500000000  3999488450.53817  102.308068329798 
 34531.0000000000  3994556473.34938  101.666527698675 
 34655.7500000000  3988881471.89266  101.045512649686 
 34780.5000000000  3982537760.91456  100.443382727472 
 34905.2500000000  3975591090.53117  99.8586292332262 
 35030.0000000000  3968099718.93046  99.2898610584416 
 35154.7500000000  3960115332.49319  98.7357921216749 
 35279.5000000000  3951683836.62856  98.1952302022399 
 35404.2500000000  3942846036.79305  97.6670669917393 
 35529.0000000000  3933638225.98829  97.1502692077437 
 35653.7500000000  3924092692.40119  96.6438706341511 
 35778.5000000000  3914238158.66072  96.1469649701971 
 35903.2500000000  3904100162.36348  95.6586993851016 
 36028.0000000000  3893701385.99898  95.1782686882465 
 36152.7500000000  3883061943.13341  94.7049100358652 
 36277.5000000000  3872199626.64324  94.2378981047342 
 36402.2500000000  3861130123.89229  93.7765406714961 
 36527.0000000000  3849867202.98786  93.3201745432039 
 36651.7500000000  3838422873.60917  92.8681617906040 
 36776.5000000000  3826807525.35447  92.4198862407090 
 36901.2500000000  3815030046.08535  91.9747501894596 
 37026.0000000000  3803097922.34373  91.5321712988338 
 37150.7500000000  3791017323.56697  91.0915796457062 
 37275.5000000000  3778793171.52091  90.6524148921571 
 37400.2500000000  3766429196.09893  90.2141235488331 
 37525.0000000000  3753927978.39219  89.7761563044038 
 37649.7500000000  3741290981.71452  89.3379653951819 
 37774.5000000000  3728518571.05981  88.8990019895884 
 37899.2500000000  3715610021.27508  88.4587135623770 
 38024.0000000000  3702563514.04364  88.0165412333692 
 38148.7500000000  3689376123.58618  87.5719170449109 
 38273.5000000000  3676043790.79720  87.1242611513133 
 38398.2500000000  3662561285.33697  86.6729788921769 
 38523.0000000000  3648922154.98893  86.2174577196839 
 38647.7500000000  3635118661.36486  85.7570639476380 
 38772.5000000000  3621141700.78779  85.2911392871970 
 38897.2500000000  3606980708.90132  84.8189971307944 
 39022.0000000000  3592623547.23260  84.3399185416404 
 39146.7500000000  3578056369.56922  83.8531479013014 
 39271.5000000000  3563263465.58356  83.3578881621095 
 39396.2500000000  3548227078.64210  82.8532956443911 
 39521.0000000000  3532927194.15367  82.3384743105906 
 39645.7500000000  3517341294.12371  81.8124694391276 
 39770.5000000000  3501444072.76746  81.2742606100403 
 39895.2500000000  3485207107.06779  80.7227539019168 
 40020.0000000000  3468598475.01081  80.1567731850074 
 40144.7500000000  3451582312.85439  79.5750503784450 
 40269.5000000000  3434118301.13603  78.9762145198145 
 40394.2500000000  3416161067.14747  78.3587794725269 
 40519.0000000000  3397659489.22843  77.7211300701443 
 40643.7500000000  3378555885.37631  77.0615064665328 
 40768.5000000000  3358785065.23731  76.3779864260627 
 40893.2500000000  3338273220.42126  75.6684652486617 
 41018.0000000000  3316936623.13633  74.9306329801018 
 41142.7500000000  3294680097.22001  74.1619485084764 
 41267.5000000000  3271395218.58743  73.3596100938157 
 41392.2500000000  3246958193.75759  72.5205218203652 
 41517.0000000000  3221227355.30040  71.6412554024980 
 41641.7500000000  3194040201.66409  70.7180067196808 
 41766.5000000000  3165209895.89364  69.7465464103032 
 41891.2500000000  3134521123.44174  68.7221638297333 
 42016.0000000000  3101725194.17856  67.6396036924158 
 42140.7500000000  3066534259.03819  66.4929947985654 
 42265.5000000000  3028614499.76812  65.2757704347547 
 42390.2500000000  2987578144.96918  63.9805803969851 
 42515.0000000000  2942974173.75822  62.5991952071157 
 42639.7500000000  2894277600.94751  61.1224041132649 
 42764.5000000000  2840877312.06543  59.5399100737053 
 42889.2500000000  2782062559.79765  57.8402273882456 
 43014.0000000000  2717008485.84705  56.0105913181103 
 43138.7500000000  2644761451.78967  54.0368943774821 
 43263.5000000000  2564225628.02849  51.9036715099784 
 43388.2500000000  2474153299.17753  49.5941665802544 
 43513.0000000000  2373142799.19179  47.0905257607551 
 43637.7500000000  2259649954.43861  44.3741790044413 
 43762.5000000000  2132021321.41570  41.4264868493670 
 43887.2500000000  1988559991.49572  38.2297414675469 
 44012.0000000000  1827636373.75374  34.7686089317274 
 44136.7500000000  1647855392.23825  31.0320694200130 
 44261.5000000000  1448285255.86131  27.0158345524140 
 44386.2500000000  1228738378.85904  22.7250798795174 
 44511.0000000000  990070806.559096  18.1771275068155 
 44635.7500000000  734436420.592546  13.4034915377157 
 44760.5000000000  465408448.860588  8.45055653362237 
 44885.2500000000  187882663.630282  3.37823247246860 
 45010.0000000000  92279964.7302311  178.256314144267 
 45134.7500000000  368832798.873799  173.158914884663 
 45259.5000000000  635822261.424468  168.157997210879 
 45384.2500000000  888200639.265463  163.317357822001 
 45509.0000000000  1122234321.60258  158.688253817960 
 45633.7500000000  1335647923.77079  154.307277898764 
 45758.5000000000  1527531507.94024  150.196408896699 
 45883.2500000000  1698092819.37688  146.364675747457 
 46008.0000000000  1848347234.68760  142.810699132988 
 46132.7500000000  1979817684.83379  139.525459443367 
 46257.5000000000  2094285579.07961  136.494848727030 
 46382.2500000000  2193606563.31775  133.701781388499 
 46507.0000000000  2279587587.77336  131.127802386276 
 46631.7500000000  2353913693.69818  128.754229540578 
 46756.5000000000  2418111136.96161  126.562910697654 
 46881.2500000000  2473534931.65649  124.536686150806 
 47006.0000000000  2521371529.07680  122.659638386062 
 47130.7500000000  2562650006.57236  120.917195930569 
 47255.5000000000  2598257348.86595  119.296141982746 
 47380.2500000000  2628955052.73948  117.784564406117 
 47505.0000000000  2655395432.49754  116.371772457187 
 47629.7500000000  2678136759.02476  115.048197222434 
 47754.5000000000  2697656839.67684  113.805286712610 
 47879.2500000000  2714364929.67379  112.635402373695 
 48004.0000000000  2728612024.69955  111.531720941428 
 48128.7500000000  2740699665.42428  110.488143700173 
 48253.5000000000  2750887418.57545  109.499214011407 
 48378.2500000000  2759399205.93275  108.560043237104 
 48503.0000000000  2766428644.69087  107.666244746586 
 48627.7500000000  2772143547.60787  106.813875456959 
 48752.5000000000  2776689713.68296  105.999384245223 
 48877.2500000000  2780194122.27874  105.219566536873 
 49002.0000000000  2782767626.91407  104.471524389348 
 49126.7500000000  2784507229.99347  103.752631428649 
 49251.5000000000  2785498006.68574  103.060502050562 
 49376.2500000000  2785814734.97852  102.392964356031 
 49501.0000000000  2785523279.46482  101.748036348376 
 49625.7500000000  2784681768.46556  101.123904975389 
 49750.5000000000  2783341597.45241  100.518907650403 
 49875.2500000000  2781548286.21217  99.9315159325882 
 50000.0000000000  2779342212.60965  99.3603210878140 
