 10.0000000000000  1.05708857827862e-12  7.73472624813811e-29  1.28912104135635e-31 
 10.2329299228075  1.05710480989920e-12  7.73484501504598e-29  1.28914083584100e-31 
 10.4712854805090  1.05712164718781e-12  7.73496821363195e-29  1.28916136893866e-31 
 10.7151930523761  1.05713907970439e-12  7.73509576750622e-29  1.28918262791770e-31 
 10.9647819614318  1.05715709080238e-12  7.73522755486561e-29  1.28920459247760e-31 
 11.2201845430196  1.05717565671655e-12  7.73536340181977e-29  1.28922723363663e-31 
 11.4815362149688  1.05719474557476e-12  7.73550307516003e-29  1.28925051252667e-31 
 11.7489755493953  1.05721431630955e-12  7.73564627439534e-29  1.28927437906589e-31 
 12.0226443461741  1.05723431750982e-12  7.73579262335033e-29  1.28929877055839e-31 
 12.3026877081238  1.05725468615404e-12  7.73594166089576e-29  1.28932361014929e-31 
 12.5892541179416  1.05727534628638e-12  7.73609283126241e-29  1.28934880521040e-31 
 12.8824955169313  1.05729620759008e-12  7.73624547360159e-29  1.28937424560026e-31 
 13.1825673855640  1.05731716390248e-12  7.73639881112019e-29  1.28939980185336e-31 
 13.4896288259165  1.05733809165705e-12  7.73655193968100e-29  1.28942532328017e-31 
 13.8038426460288  1.05735884825496e-12  7.73670381588695e-29  1.28945063598116e-31 
 14.1253754462275  1.05737927042541e-12  7.73685324508433e-29  1.28947554084739e-31 
 14.4543977074592  1.05739917252537e-12  7.73699886892147e-29  1.28949981148691e-31 
 14.7910838816820  1.05741834486288e-12  7.73713915308044e-29  1.28952319218007e-31 
 15.1356124843620  1.05743655203546e-12  7.73727237511934e-29  1.28954539585322e-31 
 15.4881661891247  1.05745353130692e-12  7.73739661259514e-29  1.28956610209919e-31 
 15.8489319246110  1.05746899109603e-12  7.73750973200543e-29  1.28958495533424e-31 
 16.2181009735891  1.05748260955726e-12  7.73760937840377e-29  1.28960156306730e-31 
 16.5958690743754  1.05749403334996e-12  7.73769296639350e-29  1.28961549439892e-31 
 16.9824365246173  1.05750287660631e-12  7.73775767257648e-29  1.28962627876275e-31 
 17.3780082874936  1.05750872015402e-12  7.73780042986554e-29  1.28963340497759e-31 
 17.7827941003890  1.05751111104675e-12  7.73781792404827e-29  1.28963632067471e-31 
 18.1970085860996  1.05750956244519e-12  7.73780659291729e-29  1.28963443215288e-31 
 18.6208713666284  1.05750355389834e-12  7.73776262832817e-29  1.28962710472136e-31 
 19.0546071796322  1.05749253206930e-12  7.73768198150993e-29  1.28961366358499e-31 
 19.4984459975802  1.05747591193538e-12  7.73756037184665e-29  1.28959339530778e-31 
 19.9526231496885  1.05745307849844e-12  7.73739329939156e-29  1.28956554989859e-31 
 20.4173794466950  1.05742338902704e-12  7.73717606127313e-29  1.28952934354552e-31 
 20.8929613085401  1.05738617581386e-12  7.73690377187125e-29  1.28948396197854e-31 
 21.3796208950220  1.05734074946229e-12  7.73657138686483e-29  1.28942856447747e-31 
 21.8776162394952  1.05728640264960e-12  7.73617373076750e-29  1.28936228846125e-31 
 22.3872113856830  1.05722241431318e-12  7.73570552755776e-29  1.28928425459296e-31 
 22.9086765276774  1.05714805419888e-12  7.73516143395987e-29  1.28919357232665e-31 
 23.4422881531988  1.05706258765664e-12  7.73453607453284e-29  1.28908934575547e-31 
 23.9883291901945  1.05696528055003e-12  7.73382407759419e-29  1.28897067959903e-31 
 24.5470891568499  1.05685540416147e-12  7.73302011111106e-29  1.28883668518518e-31 
 25.1188643150954  1.05673223988902e-12  7.73211891706681e-29  1.28868648617780e-31 
 25.7039578276882  1.05659508357648e-12  7.73111534314453e-29  1.28851922385742e-31 
 26.3026799189533  1.05644324926177e-12  7.73000437015377e-29  1.28833406169230e-31 
 26.9153480392686  1.05627607213501e-12  7.72878113367479e-29  1.28813018894580e-31 
 27.5422870333811  1.05609291050797e-12  7.72744093846933e-29  1.28790682307822e-31 
 28.1838293126440  1.05589314657315e-12  7.72597926403463e-29  1.28766321067244e-31 
 28.8403150312655  1.05567618575773e-12  7.72439175987620e-29  1.28739862664603e-31 
 29.5120922666632  1.05544145449766e-12  7.72267422922096e-29  1.28711237153683e-31 
 30.1995172040195  1.05518839625498e-12  7.72082259987580e-29  1.28680376664597e-31 
 30.9029543251352  1.05491646565674e-12  7.71883288134219e-29  1.28647214689037e-31 
 31.6227766016831  1.05462512063215e-12  7.71670110728345e-29  1.28611685121391e-31 
 32.3593656929621  1.05431381249870e-12  7.71442326298493e-29  1.28573721049749e-31 
 33.1131121482583  1.05398197394036e-12  7.71199519739040e-29  1.28533253289840e-31 
 33.8844156139194  1.05362900491418e-12  7.70941251998025e-29  1.28490208666338e-31 
 34.6736850452523  1.05325425654088e-12  7.70667048289941e-29  1.28444508048324e-31 
 35.4813389233567  1.05285701312084e-12  7.70376384936746e-29  1.28396064156124e-31 
 36.3078054770092  1.05243647249763e-12  7.70068674999884e-29  1.28344779166647e-31 
 37.1535229097163  1.05199172508803e-12  7.69743252936542e-29  1.28290542156090e-31 
 38.0189396320551  1.05152173206431e-12  7.69399358635560e-29  1.28233226439260e-31 
 38.9045144994270  1.05102530330831e-12  7.69036121286460e-29  1.28172686881077e-31 
 39.8107170553486  1.05050107601939e-12  7.68652543726841e-29  1.28108757287807e-31 
 40.7380277804101  1.04994749509898e-12  7.68247488089728e-29  1.28041248014955e-31 
 41.6869383470324  1.04936279673166e-12  7.67819663789868e-29  1.27969943964978e-31 
 42.6579518801581  1.04874499692534e-12  7.67367619138528e-29  1.27894603189755e-31 
 43.6515832240153  1.04809188703689e-12  7.66889738069623e-29  1.27814956344937e-31 
 44.6683592150950  1.04740103855360e-12  7.66384243638320e-29  1.27730707273053e-31 
 45.7088189614861  1.04666981941978e-12  7.65849209967185e-29  1.27641534994531e-31 
 46.7735141287184  1.04589542398284e-12  7.65282584157807e-29  1.27547097359635e-31 
 47.8630092322624  1.04507491796186e-12  7.64682219194298e-29  1.27447036532383e-31 
 48.9778819368431  1.04420529872088e-12  7.64045918045340e-29  1.27340986340890e-31 
 50.1187233627256  1.04328356938987e-12  7.63371487898541e-29  1.27228581316423e-31 
 51.2861383991348  1.04230682317863e-12  7.62656801853013e-29  1.27109466975502e-31 
 52.4807460249756  1.04127233171946e-12  7.61899863559747e-29  1.26983310593291e-31 
 53.7031796370235  1.04017762888762e-12  7.61098868553147e-29  1.26849811425525e-31 
 54.9540873857606  1.03902057983216e-12  7.60252254760931e-29  1.26708709126822e-31 
 56.2341325190330  1.03779942451229e-12  7.59358734359738e-29  1.26559789059956e-31 
 57.5439937337137  1.03651278644620e-12  7.58417300176630e-29  1.26402883362772e-31 
 58.8843655355569  1.03515964070232e-12  7.57427202268294e-29  1.26237867044716e-31 
 60.2559586074336  1.03373924035440e-12  7.56387894108160e-29  1.26064649018027e-31 
 61.6595001861460  1.03225100662930e-12  7.55298952207414e-29  1.25883158701236e-31 
 63.0957344480170  1.03069439392255e-12  7.54159977346789e-29  1.25693329557798e-31 
 64.5654229034632  1.02906874533180e-12  7.52970488870284e-29  1.25495081478381e-31 
 66.0693448007572  1.02737315651079e-12  7.51729825066944e-29  1.25288304177824e-31 
 67.6082975391956  1.02560636507667e-12  7.50437062250159e-29  1.25072843708360e-31 
 69.1830970918910  1.02376667973121e-12  7.49090962895547e-29  1.24848493815925e-31 
 70.7945784384110  1.02185195834185e-12  7.47689959602878e-29  1.24614993267146e-31 
 72.4435960074962  1.01985963848946e-12  7.46232177447851e-29  1.24372029574642e-31 
 74.1310241300888  1.01778681815300e-12  7.44715493019171e-29  1.24119248836528e-31 
 75.8577575029153  1.01563037891787e-12  7.43137624570189e-29  1.23856270761698e-31 
 77.6247116628660  1.01338713967358e-12  7.41496244479611e-29  1.23582707413269e-31 
 79.4328234724249  1.01105402520539e-12  7.39789102610154e-29  1.23298183768359e-31 
 81.2830516164066  1.00862823161977e-12  7.38014147350512e-29  1.23002357891752e-31 
 83.1763771102637  1.00610736918553e-12  7.36169630132300e-29  1.22694938355383e-31 
 85.1138038202340  1.00348956345233e-12  7.34254179418600e-29  1.22375696569767e-31 
 87.0963589956044  1.00077349774099e-12  7.32266831794105e-29  1.22044471965684e-31 
 89.1250938133707  9.97958384852960e-13  7.30207011264974e-29  1.21701168544162e-31 
 91.2010839355870  9.95043863159437e-13  7.28074453227087e-29  1.21345742204515e-31 
 93.3254300796950  9.92029821915080e-13  7.25869076647987e-29  1.20978179441331e-31 
 95.4992586021393  9.88916171803271e-13  7.23590816174627e-29  1.20598469362438e-31 
 97.7237220955767  9.85702588053393e-13  7.21239434172066e-29  1.20206572362011e-31 
 99.9999999999954  9.82388263163903e-13  7.18814339790729e-29  1.19802389965121e-31 
 102.329299228071  9.78971712317467e-13  7.16314446588490e-29  1.19385741098082e-31 
 104.712854805085  9.75450674627570e-13  7.13738100272737e-29  1.18956350045456e-31 
 107.151930523756  9.71822145020469e-13  7.11083102028418e-29  1.18513850338070e-31 
 109.647819614313  9.68082552289124e-13  7.08346838800261e-29  1.18057806466710e-31 
 112.201845430191  9.64228067601260e-13  7.05526509028388e-29  1.17587751504731e-31 
 114.815362149683  9.60254987327354e-13  7.02619402763879e-29  1.17103233793980e-31 
 117.489755493947  9.56160094892911e-13  6.99623166436403e-29  1.16603861072734e-31 
 120.226443461735  9.51940886793917e-13  6.96535968229911e-29  1.16089328038319e-31 
 123.026877081232  9.47595567395886e-13  6.93356494277102e-29  1.15559415712850e-31 
 125.892541179410  9.43122781862761e-13  6.90083753243262e-29  1.15013958873877e-31 
 128.824955169307  9.38521146704543e-13  6.86716732827566e-29  1.14452788804594e-31 
 131.825673855634  9.33788711939934e-13  6.83254006227017e-29  1.13875667704503e-31 
 134.896288259158  9.28922509307221e-13  6.79693401561957e-29  1.13282233593660e-31 
 138.038426460281  9.23918299205502e-13  6.76031816712749e-29  1.12671969452125e-31 
 141.253754462268  9.18770551549177e-13  6.72265205310987e-29  1.12044200885164e-31 
 144.543977074585  9.13472623151911e-13  6.68388706531498e-29  1.11398117755250e-31 
 147.910838816813  9.08017054301939e-13  6.64396862096747e-29  1.10732810349458e-31 
 151.356124843613  9.02395903642666e-13  6.60283861309262e-29  1.10047310218210e-31 
 154.881661891240  8.96601060212794e-13  6.56043769371662e-29  1.09340628228610e-31 
 158.489319246103  8.90624498263303e-13  6.51670713836464e-29  1.08611785639411e-31 
 162.181009735884  8.84458463857145e-13  6.47159021141242e-29  1.07859836856874e-31 
 165.958690743747  8.78095598640179e-13  6.42503307171918e-29  1.07083884528653e-31 
 169.824365246165  8.71529015370313e-13  6.37698532527515e-29  1.06283088754586e-31 
 173.780082874928  8.64752342298570e-13  6.32740034993806e-29  1.05456672498968e-31 
 177.827941003882  8.57759750799057e-13  6.27623549760197e-29  1.04603924960033e-31 
 181.970085860988  8.50545975704245e-13  6.22345224299064e-29  1.03724204049844e-31 
 186.208713666276  8.43106333545919e-13  6.16901631712674e-29  1.02816938618779e-31 
 190.546071796314  8.35436741498815e-13  6.11289784594256e-29  1.01881630765709e-31 
 194.984459975793  8.27533738820571e-13  6.05507150715641e-29  1.00917858452607e-31 
 199.526231496876  8.19394512144515e-13  5.99551671534004e-29  9.99252785890008e-32 
 204.173794466941  8.11016925643504e-13  5.93421784262785e-29  9.89036307104642e-32 
 208.929613085391  8.02399556749363e-13  5.87116448007621e-29  9.78527413346035e-32 
 213.796208950210  7.93541737827133e-13  5.80635174259437e-29  9.67725290432395e-32 
 218.776162394942  7.84443604006707e-13  5.73978061892892e-29  9.56630103154820e-32 
 223.872113856820  7.75106147273068e-13  5.67145836744253e-29  9.45243061240422e-32 
 229.086765276763  7.65531276891866e-13  5.60139895824846e-29  9.33566493041410e-32 
 234.422881531978  7.55721886279796e-13  5.52962356250161e-29  9.21603927083602e-32 
 239.883291901934  7.45681926499320e-13  5.45616109016012e-29  9.09360181693354e-32 
 245.470891568488  7.35416486652307e-13  5.38104877822627e-29  8.96841463037712e-32 
 251.188643150942  7.24931881559095e-13  5.30433283229496e-29  8.84055472049160e-32 
 257.039578276870  7.14235747230869e-13  5.22606912512592e-29  8.71011520854319e-32 
 263.026799189521  7.03337144772696e-13  5.14632395690309e-29  8.57720659483849e-32 
 269.153480392674  6.92246673484214e-13  5.06517488279340e-29  8.44195813798900e-32 
 275.422870333798  6.80976594052137e-13  4.98271161434731e-29  8.30451935724551e-32 
 281.838293126427  6.69540962843555e-13  4.89903700212410e-29  8.16506167020683e-32 
 288.403150312642  6.57955778400746e-13  4.81426810759566e-29  8.02378017932609e-32 
 295.120922666619  6.46239141290417e-13  4.72853737276476e-29  7.88089562127461e-32 
 301.995172040181  6.34411428450349e-13  4.64199389586098e-29  7.73665649310163e-32 
 309.029543251338  6.22495483072912e-13  4.55480482071996e-29  7.59134136786661e-32 
 316.227766016816  6.10516820827050e-13  4.46715684571154e-29  7.44526140951924e-32 
 323.593656929606  5.98503852792615e-13  4.37925785495214e-29  7.29876309158689e-32 
 331.131121482568  5.86488124795050e-13  4.29133866951869e-29  7.15223111586448e-32 
 338.844156139179  5.74504571796212e-13  4.20365490882855e-29  7.00609151471424e-32 
 346.736850452507  5.62591784514657e-13  4.11648894150235e-29  6.86081490250392e-32 
 354.813389233550  5.50792283395389e-13  4.03015189000307e-29  6.71691981667179e-32 
 363.078054770076  5.39152792296121e-13  3.94498563320075e-29  6.57497605533459e-32 
 371.535229097146  5.27724500680817e-13  3.86136472484489e-29  6.43560787474148e-32 
 380.189396320534  5.16563298623754e-13  3.77969811309120e-29  6.29949685515200e-32 
 389.045144994252  5.05729963512824e-13  3.70043050661130e-29  6.16738417768550e-32 
 398.107170553468  4.95290271130558e-13  3.62404318737350e-29  6.04007197895584e-32 
 407.380277804083  4.85314997137867e-13  3.55105402149936e-29  5.91842336916561e-32 
 416.869383470305  4.75879768577659e-13  3.48201637271437e-29  5.80336062119062e-32 
 426.579518801561  4.67064719971304e-13  3.41751658600282e-29  5.69586097667137e-32 
 436.515832240133  4.58953906513511e-13  3.35816969394965e-29  5.59694948991608e-32 
 446.683592150930  4.51634429846652e-13  3.30461302002363e-29  5.50768836670604e-32 
 457.088189614841  4.45195242204207e-13  3.25749742848464e-29  5.42916238080774e-32 
 467.735141287163  4.39725614385233e-13  3.21747611453964e-29  5.36246019089939e-32 
 478.630092322602  4.35313283045807e-13  3.18519104805815e-29  5.30865174676359e-32 
 489.778819368408  4.32042332157749e-13  3.16125747218750e-29  5.26876245364583e-32 
 501.187233627234  4.29990908315937e-13  3.14624718623667e-29  5.24374531039445e-32 
 512.861383991325  4.29228912850904e-13  3.14067165884430e-29  5.23445276474050e-32 
 524.807460249731  4.29815846029187e-13  3.14496625397403e-29  5.24161042329005e-32 
 537.031796370211  4.31798990341411e-13  3.15947693801773e-29  5.26579489669621e-32 
 549.540873857581  4.35212104103536e-13  3.18445072086456e-29  5.30741786810760e-32 
 562.341325190304  4.40074752218658e-13  3.22003075907927e-29  5.36671793179879e-32 
 575.439937337111  4.46392334117527e-13  3.26625656034327e-29  5.44376093390545e-32 
 588.843655355542  4.54156792054898e-13  3.32306916606505e-29  5.53844861010842e-32 
 602.559586074309  4.63347911403638e-13  3.39032066564349e-29  5.65053444273914e-32 
 616.595001861432  4.73935072031584e-13  3.46778701130733e-29  5.77964501884554e-32 
 630.957344480142  4.85879284532112e-13  3.55518291723189e-29  5.92530486205315e-32 
 645.654229034602  4.99135348280635e-13  3.65217765005708e-29  6.08696275009513e-32 
 660.693448007541  5.13653995130480e-13  3.75841071432858e-29  6.26401785721430e-32 
 676.082975391926  5.29383924328015e-13  3.87350674198944e-29  6.45584456998239e-32 
 691.830970918878  5.46273680675507e-13  3.99708923491385e-29  6.66181539152309e-32 
 707.945784384078  5.64273368304326e-13  4.12879310460056e-29  6.88132184100093e-32 
 724.435960074928  5.83336214460305e-13  4.26827611440375e-29  7.11379352400625e-32 
 741.310241300854  6.03419986103235e-13  4.41522924480380e-29  7.35871540800633e-32 
 758.577575029119  6.24488199212573e-13  4.56938554190761e-29  7.61564256984602e-32 
 776.247116628625  6.46510937365320e-13  4.73052610698997e-29  7.88421017831661e-32 
 794.328234724213  6.69464941731891e-13  4.89848075499412e-29  8.16413459165687e-32 
 812.830516164028  6.93332559354227e-13  5.07312031907363e-29  8.45520053178938e-32 
 831.763771102598  7.18099332348288e-13  5.25433901076623e-29  8.75723168461038e-32 
 851.138038202302  7.43750609367580e-13  5.44202962604321e-29  9.07004937673868e-32 
 870.963589956004  7.70268351688469e-13  5.63606017540809e-29  9.39343362568015e-32 
 891.250938133667  7.97629645004873e-13  5.83626299468556e-29  9.72710499114260e-32 
 912.010839355828  8.25807759100188e-13  6.04244249865010e-29  1.00707374977502e-31 
 933.254300796907  8.54775231930631e-13  6.25439774729039e-29  1.04239962454840e-31 
 954.992586021350  8.84507462491465e-13  6.47194873484250e-29  1.07865812247375e-31 
 977.237220955722  9.14985387483817e-13  6.69495597498411e-29  1.11582599583069e-31 
 999.999999999909  9.46196666017736e-13  6.92332916931696e-29  1.15388819488616e-31 
 1023.29299228066  9.78135610641723e-13  7.15702670270935e-29  1.19283778378489e-31 
 1047.12854805080  1.01080244573955e-12  7.39605021697929e-29  1.23267503616322e-31 
 1071.51930523751  1.04420241595589e-12  7.64043808723706e-29  1.27340634787284e-31 
 1096.47819614308  1.07834505986226e-12  7.89026010729283e-29  1.31504335121547e-31 
 1122.01845430186  1.11324378263311e-12  8.14561436292368e-29  1.35760239382061e-31 
 1148.15362149677  1.14891576029539e-12  8.40662653126693e-29  1.40110442187782e-31 
 1174.89755493942  1.18538217564979e-12  8.67345160705814e-29  1.44557526784302e-31 
 1202.26443461730  1.22266879601157e-12  8.94627812996528e-29  1.49104635499421e-31 
 1230.26877081226  1.26080693655844e-12  9.22533523341391e-29  1.53755587223565e-31 
 1258.92541179405  1.29983490215714e-12  9.51090319444447e-29  1.58515053240741e-31 
 1288.24955169301  1.33980006496879e-12  9.80332863556855e-29  1.63388810592809e-31 
 1318.25673855628  1.38076181902391e-12  1.01030461434201e-28  1.68384102390334e-31 
 1348.96288259152  1.42279576004757e-12  1.04106088525714e-28  1.73510147542857e-31 
 1380.38426460275  1.46599956272679e-12  1.07267314495505e-28  1.78778857492508e-31 
 1412.53754462262  1.51050112607737e-12  1.10523497725594e-28  1.84205829542656e-31 
 1445.43977074578  1.55646948249327e-12  1.13887006330831e-28  1.89811677218052e-31 
 1479.10838816806  1.60412828162411e-12  1.17374204775377e-28  1.95623674625628e-31 
 1513.56124843606  1.65376919870468e-12  1.21006434961328e-28  2.01677391602214e-31 
 1548.81661891233  1.70575552735710e-12  1.24810279114360e-28  2.08017131857267e-31 
 1584.89319246096  1.76048856126513e-12  1.28815099927939e-28  2.14691833213231e-31 
 1621.81009735877  1.81827320614096e-12  1.33043207379334e-28  2.21738678965557e-31 
 1659.58690743739  1.87897359748471e-12  1.37484660251365e-28  2.29141100418942e-31 
 1698.24365246157  1.94139574118888e-12  1.42052093892167e-28  2.36753489820279e-31 
 1737.80082874920  2.00275556826072e-12  1.46541797733321e-28  2.44236329555535e-31 
 1778.27941003874  2.05937538887096e-12  1.50684674892699e-28  2.51141124821164e-31 
 1819.70085860980  2.10918487719055e-12  1.54329239450753e-28  2.57215399084589e-31 
 1862.08713666268  2.15355427250664e-12  1.57575751934354e-28  2.62626253223924e-31 
 1905.46071796305  2.19591507482902e-12  1.60675295495298e-28  2.67792159158831e-31 
 1949.84459975784  2.23925794582185e-12  1.63846697105595e-28  2.73077828509325e-31 
 1995.26231496867  2.28524503764467e-12  1.67211576582173e-28  2.78685960970289e-31 
 2041.73794466931  2.33466346866940e-12  1.70827527444221e-28  2.84712545740369e-31 
 2089.29613085382  2.38795676844675e-12  1.74727002787234e-28  2.91211671312056e-31 
 2137.96208950200  2.44512350900520e-12  1.78909898126412e-28  2.98183163544020e-31 
 2187.76162394932  2.50531758737872e-12  1.83314304034725e-28  3.05523840057875e-31 
 2238.72113856810  2.56730863814847e-12  1.87850194568319e-28  3.13083657613866e-31 
 2290.86765276753  2.63037845437099e-12  1.92465018463172e-28  3.20775030771953e-31 
 2344.22881531967  2.69440286373866e-12  1.97149690020820e-28  3.28582816701367e-31 
 2398.83291901923  2.75947573420165e-12  2.01911077567277e-28  3.36518462612128e-31 
 2454.70891568476  2.82568229820854e-12  2.06755417568160e-28  3.44592362613599e-31 
 2511.88643150931  2.89304532683011e-12  2.11684376184682e-28  3.52807293641136e-31 
 2570.39578276858  2.96153288094204e-12  2.16695616428361e-28  3.61159360713934e-31 
 2630.26799189509  3.03108171761464e-12  2.21784510808575e-28  3.69640851347624e-31 
 2691.53480392662  3.10164362087828e-12  2.26947531358665e-28  3.78245885597775e-31 
 2754.22870333786  3.17331097089671e-12  2.32191437543185e-28  3.86985729238641e-31 
 2818.38293126414  3.24668034254790e-12  2.37559880797430e-28  3.95933134662383e-31 
 2884.03150312628  3.32381087245352e-12  2.43203528325674e-28  4.05339213876124e-31 
 2951.20922666605  3.40995188330258e-12  2.49506473522001e-28  4.15844122536669e-31 
 3019.95172040167  3.51265857070385e-12  2.57021530700989e-28  4.28369217834983e-31 
 3090.29543251324  3.62964309801623e-12  2.65581298658208e-28  4.42635497763680e-31 
 3162.27766016802  3.74348356942380e-12  2.73911015773593e-28  4.56518359622655e-31 
 3235.93656929592  3.84552595556366e-12  2.81377465971966e-28  4.68962443286610e-31 
 3311.31121482553  3.94028305614953e-12  2.88310851197758e-28  4.80518085329596e-31 
 3388.44156139163  4.03312465770316e-12  2.95104079194086e-28  4.91840131990143e-31 
 3467.36850452492  4.12681730706750e-12  3.01959578432154e-28  5.03265964053590e-31 
 3548.13389233534  4.22247166963783e-12  3.08958616394766e-28  5.14931027324611e-31 
 3630.78054770059  4.32050639092130e-12  3.16131825409804e-28  5.26886375683007e-31 
 3715.35229097129  4.42108461453370e-12  3.23491142709710e-28  5.39151904516184e-31 
 3801.89396320516  4.52426883488690e-12  3.31041141015994e-28  5.51735235026657e-31 
 3890.45144994235  4.63008500021357e-12  3.38783718963079e-28  5.64639531605131e-31 
 3981.07170553450  4.73854960026713e-12  3.46720083107646e-28  5.77866805179409e-31 
 4073.80277804064  4.84968147663690e-12  3.54851612090409e-28  5.91419353484015e-31 
 4168.69383470285  4.96351535567618e-12  3.63180846841637e-28  6.05301411402729e-31 
 4265.79518801542  5.08014102225021e-12  3.71714356927667e-28  6.19523928212779e-31 
 4365.15832240114  5.19968824421722e-12  3.80461637473882e-28  6.34102729123137e-31 
 4466.83592150909  5.32207225934364e-12  3.89416486420337e-28  6.49027477367229e-31 
 4570.88189614819  5.44721538437511e-12  3.98573219676610e-28  6.64288699461016e-31 
 4677.35141287141  5.57521442522207e-12  4.07938920539518e-28  6.79898200899197e-31 
 4786.30092322580  5.70616267942911e-12  4.17520415598451e-28  6.95867359330752e-31 
 4897.78819368386  5.84013069422548e-12  4.27322866800258e-28  7.12204778000430e-31 
 5011.87233627211  5.97718203469232e-12  4.37350925207412e-28  7.28918208679021e-31 
 5128.61383991301  6.11737974290629e-12  4.47609203614102e-28  7.46015339356838e-31 
 5248.07460249707  6.26078823360661e-12  4.58102415252354e-28  7.63504025420591e-31 
 5370.31796370186  6.40747378613157e-12  4.68835409787070e-28  7.81392349645117e-31 
 5495.40873857556  6.55750462736766e-12  4.79813179385420e-28  7.99688632309034e-31 
 5623.41325190279  6.71095089943803e-12  4.91040856352608e-28  8.18401427254347e-31 
 5754.39937337084  6.86788460051175e-12  5.02523708800877e-28  8.37539514668128e-31 
 5888.43655355514  7.02837952526538e-12  5.14267136293078e-28  8.57111893821796e-31 
 6025.59586074281  7.19251121211640e-12  5.26276665981735e-28  8.77127776636225e-31 
 6165.95001861404  7.36035689815388e-12  5.38557949311321e-28  8.97596582185535e-31 
 6309.57344480113  7.53199548080458e-12  5.51116759213358e-28  9.18527932022263e-31 
 6456.54229034572  7.70750748481959e-12  5.63958987690831e-28  9.39931646151386e-31 
 6606.93448007511  7.88697503318260e-12  5.77090643689545e-28  9.61817739482576e-31 
 6760.82975391895  8.07048182069019e-12  5.90517851164985e-28  9.84196418608308e-31 
 6918.30970918847  8.25811308911771e-12  6.04246847265208e-28  1.00707807877535e-30 
 7079.45784384047  8.44995560303355e-12  6.18283980561171e-28  1.03047330093528e-30 
 7244.35960074895  8.64609762544311e-12  6.32635709264593e-28  1.05439284877432e-30 
 7413.10241300820  8.84662889253458e-12  6.47308599380108e-28  1.07884766563351e-30 
 7585.77575029084  9.05164058686947e-12  6.62309322743608e-28  1.10384887123935e-30 
 7762.47116628590  9.26122530841062e-12  6.77644654902364e-28  1.12940775817061e-30 
 7943.28234724177  9.47547704281382e-12  6.93321472794922e-28  1.15553578799154e-30 
 8128.30516163991  9.69449112643261e-12  7.09346752190492e-28  1.18224458698415e-30 
 8317.63771102560  9.91836420749556e-12  7.25727564848301e-28  1.20954594141384e-30 
 8511.38038202263  1.01471942029195e-11  7.42471075357603e-28  1.23745179226267e-30 
 8709.63589955964  1.03810802502166e-11  7.59584537618711e-28  1.26597422936452e-30 
 8912.50938133626  1.06201226539429e-11  7.77075290924654e-28  1.29512548487442e-30 
 9120.10839355786  1.08644228261203e-11  7.94950755601811e-28  1.32491792600302e-30 
 9332.54300796864  1.11140832200401e-11  8.13218428166366e-28  1.35536404694394e-30 
 9549.92586021306  1.13692072568352e-11  8.31885875951520e-28  1.38647645991920e-30 
 9772.37220955678  1.16298992441728e-11  8.50960731158287e-28  1.41826788526381e-30 
 10000.0000000000  1.18962642863916e-11  8.70450684280203e-28  1.45075114046701e-30 