-100.000000000000  1.94239593382002e-06 
-99.8000000000000  1.93440436445809e-06 
-99.6000000000000  1.92677980460440e-06 
-99.4000000000000  1.91950476114347e-06 
-99.2000000000000  1.91256293962106e-06 
-99.0000000000000  1.90593914947461e-06 
-98.8000000000000  1.89961921786288e-06 
-98.6000000000000  1.89358991122610e-06 
-98.4000000000000  1.88783886380413e-06 
-98.2000000000000  1.88235451242483e-06 
-98.0000000000000  1.87712603694980e-06 
-97.8000000000000  1.87214330583010e-06 
-97.6000000000000  1.86739682628335e-06 
-97.4000000000000  1.86287769865457e-06 
-97.2000000000000  1.85857757456909e-06 
-97.0000000000000  1.85448861852624e-06 
-96.8000000000000  1.85060347261824e-06 
-96.6000000000000  1.84691522409093e-06 
-96.4000000000000  1.84341737549115e-06 
-96.2000000000000  1.84010381717101e-06 
-96.0000000000000  1.83696880194189e-06 
-95.8000000000000  1.83400692169104e-06 
-95.6000000000000  1.83121308579180e-06 
-95.4000000000000  1.82858250115456e-06 
-95.2000000000000  1.82611065378006e-06 
-95.0000000000000  1.82379329168956e-06 
-94.8000000000000  1.82162640911795e-06 
-94.6000000000000  1.81960623186670e-06 
-94.4000000000000  1.81772920372247e-06 
-94.2000000000000  1.81599197385615e-06 
-94.0000000000000  1.81439138512428e-06 
-93.8000000000000  1.81292446320226e-06 
-93.6000000000000  1.81158840648443e-06 
-93.4000000000000  1.81038057669215e-06 
-93.2000000000000  1.80929849013591e-06 
-93.0000000000000  1.80833980958213e-06 
-92.8000000000000  1.80750233667967e-06 
-92.6000000000000  1.80678400490465e-06 
-92.4000000000000  1.80618287298576e-06 
-92.2000000000000  1.80569711877540e-06 
-92.0000000000000  1.80532503353471e-06 
-91.8000000000000  1.80506501660349e-06 
-91.6000000000000  1.80491557042779e-06 
-91.4000000000000  1.80487529592086e-06 
-91.2000000000000  1.80494288813447e-06 
-91.0000000000000  1.80511713221987e-06 
-90.8000000000000  1.80539689965903e-06 
-90.6000000000000  1.80578114474848e-06 
-90.4000000000000  1.80626890131943e-06 
-90.2000000000000  1.80685927967901e-06 
-90.0000000000000  1.80755146375891e-06 
-89.8000000000000  1.80834470845830e-06 
-89.6000000000000  1.80923833716952e-06 
-89.4000000000000  1.81023173947539e-06 
-89.2000000000000  1.81132436900807e-06 
-89.0000000000000  1.81251574146028e-06 
-88.8000000000000  1.81380543274013e-06 
-88.6000000000000  1.81519307726168e-06 
-88.4000000000000  1.81667836636388e-06 
-88.2000000000000  1.81826104685113e-06 
-88.0000000000000  1.81994091964918e-06 
-87.8000000000000  1.82171783857061e-06 
-87.6000000000000  1.82359170918460e-06 
-87.4000000000000  1.82556248778613e-06 
-87.2000000000000  1.82763018045994e-06 
-87.0000000000000  1.82979484223535e-06 
-86.8000000000000  1.83205657632792e-06 
-86.6000000000000  1.83441553346468e-06 
-86.4000000000000  1.83687191128954e-06 
-86.2000000000000  1.83942595384612e-06 
-86.0000000000000  1.84207795113536e-06 
-85.8000000000000  1.84482823874546e-06 
-85.6000000000000  1.84767719755198e-06 
-85.4000000000000  1.85062525348635e-06 
-85.2000000000000  1.85367287737084e-06 
-85.0000000000000  1.85682058481859e-06 
-84.8000000000000  1.86006893619747e-06 
-84.6000000000000  1.86341853665637e-06 
-84.4000000000000  1.86687003621329e-06 
-84.2000000000000  1.87042412990415e-06 
-84.0000000000000  1.87408155799189e-06 
-83.8000000000000  1.87784310623524e-06 
-83.6000000000000  1.88170960621705e-06 
-83.4000000000000  1.88568193573176e-06 
-83.2000000000000  1.88976101923220e-06 
-83.0000000000000  1.89394782833585e-06 
-82.8000000000000  1.89824338239067e-06 
-82.6000000000000  1.90264874910112e-06 
-82.4000000000000  1.90716504521483e-06 
-82.2000000000000  1.91179343727065e-06 
-82.0000000000000  1.91653514240894e-06 
-81.8000000000000  1.92139142924508e-06 
-81.6000000000000  1.92636361880740e-06 
-81.4000000000000  1.93145308554075e-06 
-81.2000000000000  1.93666125837716e-06 
-81.0000000000000  1.94198962187524e-06 
-80.8000000000000  1.94743971743005e-06 
-80.6000000000000  1.95301314455527e-06 
-80.4000000000000  1.95871156223990e-06 
-80.2000000000000  1.96453669038164e-06 
-80.0000000000000  1.97049031129938e-06 
-79.8000000000000  1.97657427132746e-06 
-79.6000000000000  1.98279048249444e-06 
-79.4000000000000  1.98914092428954e-06 
-79.2000000000000  1.99562764551971e-06 
-79.0000000000000  2.00225276626096e-06 
-78.8000000000000  2.00901847990760e-06 
-78.6000000000000  2.01592705532319e-06 
-78.4000000000000  2.02298083909736e-06 
-78.2000000000000  2.03018225791306e-06 
-78.0000000000000  2.03753382102870e-06 
-77.8000000000000  2.04503812288042e-06 
-77.6000000000000  2.05269784580954e-06 
-77.4000000000000  2.06051576292100e-06 
-77.2000000000000  2.06849474107863e-06 
-77.0000000000000  2.07663774404370e-06 
-76.8000000000000  2.08494783576332e-06 
-76.6000000000000  2.09342818381596e-06 
-76.4000000000000  2.10208206302161e-06 
-76.2000000000000  2.11091285922450e-06 
-76.0000000000000  2.11992407325710e-06 
-75.8000000000000  2.12911932509428e-06 
-75.6000000000000  2.13850235820723e-06 
-75.4000000000000  2.14807704412744e-06 
-75.2000000000000  2.15784738723142e-06 
-75.0000000000000  2.16781752975770e-06 
-74.8000000000000  2.17799175706834e-06 
-74.6000000000000  2.18837450316781e-06 
-74.4000000000000  2.19897035649306e-06 
-74.2000000000000  2.20978406598951e-06 
-74.0000000000000  2.22082054748832e-06 
-73.8000000000000  2.23208489040167e-06 
-73.6000000000000  2.24358236475355e-06 
-73.4000000000000  2.25531842856491e-06 
-73.2000000000000  2.26729873561305e-06 
-73.0000000000000  2.27952914358649e-06 
-72.8000000000000  2.29201572265812e-06 
-72.6000000000000  2.30476476450057e-06 
-72.4000000000000  2.31778279176970e-06 
-72.2000000000000  2.33107656808370e-06 
-72.0000000000000  2.34465310852696e-06 
-71.8000000000000  2.35851969071015e-06 
-71.6000000000000  2.37268386641999e-06 
-71.4000000000000  2.38715347389420e-06 
-71.2000000000000  2.40193665076021e-06 
-71.0000000000000  2.41704184767813e-06 
-70.8000000000000  2.43247784273194e-06 
-70.6000000000000  2.44825375661569e-06 
-70.4000000000000  2.46437906866479e-06 
-70.2000000000000  2.48086363378620e-06 
-70.0000000000000  2.49771770034522e-06 
-69.8000000000000  2.51495192907053e-06 
-69.6000000000000  2.53257741304415e-06 
-69.4000000000000  2.55060569884726e-06 
-69.2000000000000  2.56904880893881e-06 
-69.0000000000000  2.58791926534903e-06 
-68.8000000000000  2.60723011477656e-06 
-68.6000000000000  2.62699495518455e-06 
-68.4000000000000  2.64722796399832e-06 
-68.2000000000000  2.66794392801545e-06 
-68.0000000000000  2.68915827514742e-06 
-67.8000000000000  2.71088710812167e-06 
-67.6000000000000  2.73314724028303e-06 
-67.4000000000000  2.75595623364466e-06 
-67.2000000000000  2.77933243935086e-06 
-67.0000000000000  2.80329504072714e-06 
-66.8000000000000  2.82786409910775e-06 
-66.6000000000000  2.85306060264631e-06 
-66.4000000000000  2.87890651833262e-06 
-66.2000000000000  2.90542484745760e-06 
-66.0000000000000  2.93263968478877e-06 
-65.8000000000000  2.96057628174150e-06 
-65.6000000000000  2.98926111385592e-06 
-65.4000000000000  3.01872195291649e-06 
-65.2000000000000  3.04898794408131e-06 
-65.0000000000000  3.08008968842057e-06 
-64.8000000000000  3.11205933130019e-06 
-64.6000000000000  3.14493065708571e-06 
-64.4000000000000  3.17873919068573e-06 
-64.2000000000000  3.21352230650202e-06 
-64.0000000000000  3.24931934540658e-06 
-63.8000000000000  3.28617174042491e-06 
-63.6000000000000  3.32412315186922e-06 
-63.4000000000000  3.36321961273746e-06 
-63.2000000000000  3.40350968527323e-06 
-63.0000000000000  3.44504462967013e-06 
-62.8000000000000  3.48787858600155e-06 
-62.6000000000000  3.53206877056580e-06 
-62.4000000000000  3.57767568795722e-06 
-62.2000000000000  3.62476336030821e-06 
-62.0000000000000  3.67339957529722e-06 
-61.8000000000000  3.72365615468446e-06 
-61.6000000000000  3.77560924532410e-06 
-61.4000000000000  3.82933963480977e-06 
-61.2000000000000  3.88493309414405e-06 
-61.0000000000000  3.94248075008367e-06 
-60.8000000000000  4.00207949010567e-06 
-60.6000000000000  4.06383240326879e-06 
-60.4000000000000  4.12784926061465e-06 
-60.2000000000000  4.19424703916995e-06 
-60.0000000000000  4.26315049408011e-06 
-59.8000000000000  4.33469278393474e-06 
-59.6000000000000  4.40901615494363e-06 
-59.4000000000000  4.48627269029854e-06 
-59.2000000000000  4.56662513182274e-06 
-59.0000000000000  4.65024778187924e-06 
-58.8000000000000  4.73732749449548e-06 
-58.6000000000000  4.82806476578404e-06 
-58.4000000000000  4.92267493501598e-06 
-58.2000000000000  5.02138950915926e-06 
-58.0000000000000  5.12445762535563e-06 
-57.8000000000000  5.23214766770878e-06 
-57.6000000000000  5.34474905692869e-06 
-57.4000000000000  5.46257423386731e-06 
-57.2000000000000  5.58596086083690e-06 
-57.0000000000000  5.71527426788407e-06 
-56.8000000000000  5.85091017496716e-06 
-56.6000000000000  5.99329772533107e-06 
-56.4000000000000  6.14290287038624e-06 
-56.2000000000000  6.30023215218316e-06 
-56.0000000000000  6.46583693625884e-06 
-55.8000000000000  6.64031815536367e-06 
-55.6000000000000  6.82433163352776e-06 
-55.4000000000000  7.01859407029530e-06 
-55.2000000000000  7.22388977697489e-06 
-55.0000000000000  7.44107827069170e-06 
-54.8000000000000  7.67110284819189e-06 
-54.6000000000000  7.91500028009230e-06 
-54.4000000000000  8.17391178799032e-06 
-54.2000000000000  8.44909549199569e-06 
-54.0000000000000  8.74194054531077e-06 
-53.8000000000000  9.05398320599982e-06 
-53.6000000000000  9.38692513459661e-06 
-53.4000000000000  9.74265425024410e-06 
-53.2000000000000  1.01232685281036e-05 
-53.0000000000000  1.05311031771263e-05 
-52.8000000000000  1.09687616999565e-05 
-52.6000000000000  1.14391514052176e-05 
-52.4000000000000  1.19455240153434e-05 
-52.2000000000000  1.24915220876912e-05 
-52.0000000000000  1.30812320379908e-05 
-51.8000000000000  1.37192446149715e-05 
-51.6000000000000  1.44107237099332e-05 
-51.4000000000000  1.51614843740933e-05 
-51.2000000000000  1.59780808273058e-05 
-51.0000000000000  1.68679050248129e-05 
-50.8000000000000  1.78392959296737e-05 
-50.6000000000000  1.89016589066208e-05 
-50.4000000000000  2.00655934449966e-05 
-50.2000000000000  2.13430254960130e-05 
-50.0000000000000  2.27473377303511e-05 
-49.8000000000000  2.42934865015837e-05 
-49.6000000000000  2.59980875690149e-05 
-49.4000000000000  2.78794427931082e-05 
-49.2000000000000  2.99574659237685e-05 
-49.0000000000000  3.22534459130575e-05 
-48.8000000000000  3.47895595596437e-05 
-48.6000000000000  3.75880109180787e-05 
-48.4000000000000  4.06696336075472e-05 
-48.2000000000000  4.40517485105645e-05 
-48.0000000000000  4.77450352806491e-05 
-47.8000000000000  5.17491761481271e-05 
-47.6000000000000  5.60471081716513e-05 
-47.4000000000000  6.05979412158901e-05 
-47.2000000000000  6.53290437974463e-05 
-47.0000000000000  7.01285263633875e-05 
-46.8000000000000  7.48403172657706e-05 
-46.6000000000000  7.92649580123086e-05 
-46.4000000000000  8.31695402915348e-05 
-46.2000000000000  8.63090364582886e-05 
-46.0000000000000  8.84580729280068e-05 
-45.8000000000000  8.94474942925379e-05 
-45.6000000000000  8.91959900882857e-05 
-45.4000000000000  8.77264969225460e-05 
-45.2000000000000  8.51614953663449e-05 
-45.0000000000000  8.16989226342681e-05 
-44.8000000000000  7.75770663559457e-05 
-44.6000000000000  7.30390717334953e-05 
-44.4000000000000  6.83052908496266e-05 
-44.2000000000000  6.35570065370343e-05 
-44.0000000000000  5.89308437572144e-05 
-43.8000000000000  5.45208782590302e-05 
-43.6000000000000  5.03850187141707e-05 
-43.4000000000000  4.65529044109450e-05 
-43.2000000000000  4.30335602310902e-05 
-43.0000000000000  3.98219300065903e-05 
-42.8000000000000  3.69040112393546e-05 
-42.6000000000000  3.42606523389498e-05 
-42.4000000000000  3.18702230902542e-05 
-42.2000000000000  2.97104063491978e-05 
-42.0000000000000  2.77593401632588e-05 
-41.8000000000000  2.59962991664913e-05 
-41.6000000000000  2.44020605441458e-05 
-41.4000000000000  2.29590612867037e-05 
-41.2000000000000  2.16514224672323e-05 
-41.0000000000000  2.04648928048619e-05 
-40.8000000000000  1.93867466849026e-05 
-40.6000000000000  1.84056597109969e-05 
-40.4000000000000  1.75115764968448e-05 
-40.2000000000000  1.66955797270031e-05 
-40.0000000000000  1.59497657336546e-05 
-39.8000000000000  1.52671293649302e-05 
-39.6000000000000  1.46414593424595e-05 
-39.4000000000000  1.40672443281990e-05 
-39.2000000000000  1.35395893407051e-05 
-39.0000000000000  1.30541418406514e-05 
-38.8000000000000  1.26070266511803e-05 
-38.6000000000000  1.21947888282532e-05 
-38.4000000000000  1.18143436082751e-05 
-38.2000000000000  1.14629326080054e-05 
-38.0000000000000  1.11380855178249e-05 
-37.8000000000000  1.08375866029328e-05 
-37.6000000000000  1.05594454013487e-05 
-37.4000000000000  1.03018710788245e-05 
-37.2000000000000  1.00632499668419e-05 
-37.0000000000000  9.84212586983045e-06 
-36.8000000000000  9.63718278133921e-06 
-36.6000000000000  9.44722969628656e-06 
-36.4000000000000  9.27118724799449e-06 
-36.2000000000000  9.10807593499152e-06 
-36.0000000000000  8.95700573408715e-06 
-35.8000000000000  8.81716692352506e-06 
-35.6000000000000  8.68782196362811e-06 
-35.4000000000000  8.56829830272727e-06 
-35.2000000000000  8.45798199374743e-06 
-35.0000000000000  8.35631202198255e-06 
-34.8000000000000  8.26277525766564e-06 
-34.6000000000000  8.17690195821365e-06 
-34.4000000000000  8.09826175475727e-06 
-34.2000000000000  8.02646006596683e-06 
-34.0000000000000  7.96113488944553e-06 
-33.8000000000000  7.90195392724169e-06 
-33.6000000000000  7.84861200746868e-06 
-33.4000000000000  7.80082876873485e-06 
-33.2000000000000  7.75834657817619e-06 
-33.0000000000000  7.72092865743820e-06 
-32.8000000000000  7.68835739404560e-06 
-32.6000000000000  7.66043281829174e-06 
-32.4000000000000  7.63697122812881e-06 
-32.2000000000000  7.61780394659192e-06 
-32.0000000000000  7.60277619808463e-06 
-31.8000000000000  7.59174609142507e-06 
-31.6000000000000  7.58458369893059e-06 
-31.4000000000000  7.58117022202896e-06 
-31.2000000000000  7.58139723494905e-06 
-31.0000000000000  7.58516599898171e-06 
-30.8000000000000  7.59238684062838e-06 
-30.6000000000000  7.60297858768552e-06 
-30.4000000000000  7.61686805795932e-06 
-30.2000000000000  7.63398959587732e-06 
-30.0000000000000  7.65428465277172e-06 
-29.8000000000000  7.67770140706047e-06 
-29.6000000000000  7.70419442095402e-06 
-29.4000000000000  7.73372433067373e-06 
-29.2000000000000  7.76625756748816e-06 
-29.0000000000000  7.80176610715943e-06 
-28.8000000000000  7.84022724564882e-06 
-28.6000000000000  7.88162339916118e-06 
-28.4000000000000  7.92594192681563e-06 
-28.2000000000000  7.97317497441716e-06 
-28.0000000000000  8.02331933797350e-06 
-27.8000000000000  8.07637634575569e-06 
-27.6000000000000  8.13235175784041e-06 
-27.4000000000000  8.19125568220078e-06 
-27.2000000000000  8.25310250652902e-06 
-27.0000000000000  8.31791084508252e-06 
-26.8000000000000  8.38570349994510e-06 
-26.6000000000000  8.45650743618733e-06 
-26.4000000000000  8.53035377049697e-06 
-26.2000000000000  8.60727777293174e-06 
-26.0000000000000  8.68731888152357e-06 
-25.8000000000000  8.77052072953689e-06 
-25.6000000000000  8.85693118525346e-06 
-25.4000000000000  8.94660240422420e-06 
-25.2000000000000  9.03959089399431e-06 
-25.0000000000000  9.13595759137253e-06 
-24.8000000000000  9.23576795237944e-06 
-24.6000000000000  9.33909205507330e-06 
-24.4000000000000  9.44600471551555e-06 
-24.2000000000000  9.55658561720324e-06 
-24.0000000000000  9.67091945436104e-06 
-23.8000000000000  9.78909608955350e-06 
-23.6000000000000  9.91121072614775e-06 
-23.4000000000000  1.00373640962296e-05 
-23.2000000000000  1.01676626646521e-05 
-23.0000000000000  1.03022188499749e-05 
-22.8000000000000  1.04411512631370e-05 
-22.6000000000000  1.05845849647964e-05 
-22.4000000000000  1.07326517423613e-05 
-22.2000000000000  1.08854904078440e-05 
-22.0000000000000  1.10432471177740e-05 
-21.8000000000000  1.12060757165241e-05 
-21.6000000000000  1.13741381045318e-05 
-21.4000000000000  1.15476046330301e-05 
-21.2000000000000  1.17266545270547e-05 
-21.0000000000000  1.19114763386476e-05 
-20.8000000000000  1.21022684323574e-05 
-20.6000000000000  1.22992395053206e-05 
-20.4000000000000  1.25026091444150e-05 
-20.2000000000000  1.27126084232031e-05 
-20.0000000000000  1.29294805416253e-05 
-19.8000000000000  1.31534815116735e-05 
-19.6000000000000  1.33848808925688e-05 
-19.4000000000000  1.36239625792893e-05 
-19.2000000000000  1.38710256486488e-05 
-19.0000000000000  1.41263852675152e-05 
-18.8000000000000  1.43903736681865e-05 
-18.6000000000000  1.46633411964130e-05 
-18.4000000000000  1.49456574380748e-05 
-18.2000000000000  1.52377124310977e-05 
-18.0000000000000  1.55399179698232e-05 
-17.8000000000000  1.58527090097515e-05 
-17.6000000000000  1.61765451813511e-05 
-17.4000000000000  1.65119124224901e-05 
-17.2000000000000  1.68593247399966e-05 
-17.0000000000000  1.72193261119194e-05 
-16.8000000000000  1.75924925432333e-05 
-16.6000000000000  1.79794342890504e-05 
-16.4000000000000  1.83807982608544e-05 
-16.2000000000000  1.87972706329083e-05 
-16.0000000000000  1.92295796678028e-05 
-15.8000000000000  1.96784987821472e-05 
-15.6000000000000  2.01448498756796e-05 
-15.4000000000000  2.06295069496225e-05 
-15.2000000000000  2.11334000429685e-05 
-15.0000000000000  2.16575195185914e-05 
-14.8000000000000  2.22029207346878e-05 
-14.6000000000000  2.27707291411137e-05 
-14.4000000000000  2.33621458447626e-05 
-14.2000000000000  2.39784536932922e-05 
-14.0000000000000  2.46210239323440e-05 
-13.8000000000000  2.52913234980017e-05 
-13.6000000000000  2.59909230137037e-05 
-13.4000000000000  2.67215055693086e-05 
-13.2000000000000  2.74848763696310e-05 
-13.0000000000000  2.82829733507133e-05 
-12.8000000000000  2.91178788745530e-05 
-12.6000000000000  2.99918326272081e-05 
-12.4000000000000  3.09072458614145e-05 
-12.2000000000000  3.18667171433750e-05 
-12.0000000000000  3.28730497845835e-05 
-11.8000000000000  3.39292711638479e-05 
-11.6000000000000  3.50386541725573e-05 
-11.4000000000000  3.62047410482734e-05 
-11.2000000000000  3.74313698985775e-05 
-11.0000000000000  3.87227042595518e-05 
-10.8000000000000  4.00832660822199e-05 
-10.6000000000000  4.15179725967802e-05 
-10.4000000000000  4.30321775697731e-05 
-10.2000000000000  4.46317175448725e-05 
-9.99999999999999  4.63229637454704e-05 
-9.80000000000000  4.81128804185851e-05 
-9.59999999999999  5.00090905171499e-05 
-9.40000000000000  5.20199497540519e-05 
-9.20000000000000  5.41546302194274e-05 
-8.99999999999999  5.64232149361470e-05 
-8.80000000000000  5.88368049410669e-05 
-8.59999999999999  6.14076407259065e-05 
-8.40000000000000  6.41492401563970e-05 
-8.20000000000000  6.70765553168860e-05 
-7.99999999999999  7.02061511053341e-05 
-7.79999999999999  7.35564088359867e-05 
-7.60000000000000  7.71477585986707e-05 
-7.40000000000000  8.10029446779250e-05 
-7.19999999999999  8.51473289524183e-05 
-6.99999999999999  8.96092378706939e-05 
-6.79999999999999  9.44203593202952e-05 
-6.60000000000000  9.96161964474282e-05 
-6.40000000000000  0.000105236586196290 
-6.19999999999999  0.000111326290941430 
-5.99999999999999  0.000117935671954128 
-5.79999999999999  0.000125121453371521 
-5.59999999999999  0.000132947584510379 
-5.40000000000000  0.000141486206306025 
-5.19999999999999  0.000150818723637146 
-4.99999999999999  0.000161036978239653 
-4.79999999999999  0.000172244505223622 
-4.59999999999999  0.000184557837560468 
-4.40000000000000  0.000198107793951533 
-4.19999999999999  0.000213040641476075 
-3.99999999999999  0.000229518958767468 
-3.79999999999999  0.000247721929351768 
-3.59999999999999  0.000267844656910576 
-3.39999999999999  0.000290095901277215 
-3.19999999999999  0.000314693372529985 
-2.99999999999999  0.000341855382165134 
-2.79999999999999  0.000371787242409115 
-2.59999999999999  0.000404660371202316 
-2.39999999999999  0.000440581717060230 
-2.19999999999999  0.000479551105159715 
-1.99999999999999  0.000521404850607642 
-1.79999999999999  0.000565746137737561 
-1.59999999999999  0.000611867023707617 
-1.39999999999999  0.000658674086792822 
-1.19999999999999  0.000704639292580620 
-0.999999999999994  0.000747806928065524 
-0.799999999999994  0.000785890519959289 
-0.599999999999995  0.000816482243747458 
-0.399999999999994  0.000837365755961281 
-0.199999999999994  0.000846876808451175 
 5.55111512312578e-15  0.000844215473888677 
 0.200000000000006  0.000829608099346028 
 0.400000000000006  0.000804260718448195 
 0.600000000000006  0.000770121029212241 
 0.800000000000006  0.000729531874068277 
 1.00000000000001  0.000684881455818505 
 1.20000000000001  0.000638331487945976 
 1.40000000000001  0.000591657850584673 
 1.60000000000001  0.000546196613122799 
 1.80000000000001  0.000502865669753315 
 2.00000000000001  0.000462228128601789 
 2.20000000000001  0.000424570297487004 
 2.40000000000001  0.000389977032041742 
 2.60000000000001  0.000358395890226912 
 2.80000000000001  0.000329687448914356 
 3.00000000000001  0.000303662441690740 
 3.20000000000001  0.000280107824940016 
 3.40000000000001  0.000258804228248300 
 3.60000000000001  0.000239537048726841 
 3.80000000000001  0.000222103045550580 
 4.00000000000001  0.000206313859611937 
 4.20000000000001  0.000191997502839522 
 4.40000000000001  0.000178998557124937 
 4.60000000000001  0.000167177592595894 
 4.80000000000001  0.000156410147653365 
 5.00000000000001  0.000146585494990870 
 5.20000000000001  0.000137605336171256 
 5.40000000000001  0.000129382512026407 
 5.60000000000001  0.000121839779360906 
 5.80000000000001  0.000114908680453221 
 6.00000000000001  0.000108528516566264 
 6.20000000000001  0.000102645427238201 
 6.40000000000001  9.72115715472706e-05 
 6.60000000000001  9.21844044836644e-05 
 6.80000000000001  8.75260401087133e-05 
 7.00000000000001  8.32026927302041e-05 
 7.20000000000001  7.91841874725281e-05 
 7.40000000000001  7.54435321106342e-05 
 7.60000000000001  7.19565427002554e-05 
 7.80000000000001  6.87015162686330e-05 
 8.00000000000001  6.56589445661444e-05 
 8.20000000000001  6.28112635828453e-05 
 8.40000000000001  6.01426341852070e-05 
 8.60000000000001  5.76387498184416e-05 
 8.80000000000001  5.52866677466536e-05 
 9.00000000000001  5.30746607684564e-05 
 9.20000000000001  5.09920867537170e-05 
 9.40000000000001  4.90292737028167e-05 
 9.60000000000001  4.71774183387092e-05 
 9.80000000000001  4.54284965095252e-05 
 10.0000000000000  4.37751839105926e-05 
 10.2000000000000  4.22107858342192e-05 
 10.4000000000000  4.07291748275987e-05 
 10.6000000000000  3.93247352874969e-05 
 10.8000000000000  3.79923141482206e-05 
 11.0000000000000  3.67271769296138e-05 
 11.2000000000000  3.55249685069493e-05 
 11.4000000000000  3.43816780467022e-05 
 11.6000000000000  3.32936076231562e-05 
 11.8000000000000  3.22573440921747e-05 
 12.0000000000000  3.12697338516080e-05 
 12.2000000000000  3.03278601638808e-05 
 12.4000000000000  2.94290227562754e-05 
 12.6000000000000  2.85707194491729e-05 
 12.8000000000000  2.77506295927225e-05 
 13.0000000000000  2.69665991187377e-05 
 13.2000000000000  2.62166270375539e-05 
 13.4000000000000  2.54988532296113e-05 
 13.6000000000000  2.48115473989986e-05 
 13.8000000000000  2.41530990714538e-05 
 14.0000000000000  2.35220085326262e-05 
 14.2000000000000  2.29168786139796e-05 
 14.4000000000000  2.23364072437529e-05 
 14.6000000000000  2.17793806890086e-05 
 14.8000000000000  2.12446674221164e-05 
 15.0000000000000  2.07312125510646e-05 
 15.2000000000000  2.02380327578106e-05 
 15.4000000000000  1.97642116924086e-05 
 15.6000000000000  1.93088957728249e-05 
 15.8000000000000  1.88712903410004e-05 
 16.0000000000000  1.84506561246402e-05 
 16.2000000000000  1.80463059511022e-05 
 16.4000000000000  1.76576016542523e-05 
 16.6000000000000  1.72839511068066e-05 
 16.8000000000000  1.69248052989867e-05 
 17.0000000000000  1.65796553687755e-05 
 17.2000000000000  1.62480294692530e-05 
 17.4000000000000  1.59294893342585e-05 
 17.6000000000000  1.56236263753435e-05 
 17.8000000000000  1.53300571119810e-05 
 18.0000000000000  1.50484177062232e-05 
 18.2000000000000  1.47783573478123e-05 
 18.4000000000000  1.45195302250230e-05 
 18.6000000000000  1.42715858336587e-05 
 18.8000000000000  1.40341574403466e-05 
 19.0000000000000  1.38068486501702e-05 
 19.2000000000000  1.35892182585873e-05 
 19.4000000000000  1.33807639151401e-05 
 19.6000000000000  1.31809055975616e-05 
 19.8000000000000  1.29889704630837e-05 
 20.0000000000000  1.28041812321981e-05 
 20.2000000000000  1.26256507304326e-05 
 20.4000000000000  1.24523853757273e-05 
 20.6000000000000  1.22833000543951e-05 
 20.8000000000000  1.21172458494124e-05 
 21.0000000000000  1.19530505016881e-05 
 21.2000000000000  1.17895695346618e-05 
 21.4000000000000  1.16257440523195e-05 
 21.6000000000000  1.14606597481070e-05 
 21.8000000000000  1.12936009160382e-05 
 22.0000000000000  1.11240933105926e-05 
 22.2000000000000  1.09519305084530e-05 
 22.4000000000000  1.07771799409089e-05 
 22.6000000000000  1.06001669860021e-05 
 22.8000000000000  1.04214383227481e-05 
 23.0000000000000  1.02417087523627e-05 
 23.2000000000000  1.00617981825882e-05 
 23.4000000000000  9.88256671790728e-06 
 23.6000000000000  9.70485541216994e-06 
 23.8000000000000  9.52943839341594e-06 
 24.0000000000000  9.35698940512610e-06 
 24.2000000000000  9.18806311899440e-06 
 24.4000000000000  9.02308948547277e-06 
 24.6000000000000  8.86237818478208e-06 
 24.8000000000000  8.70612988693555e-06 
 25.0000000000000  8.55445129545781e-06 
 25.2000000000000  8.40737155451870e-06 
 25.4000000000000  8.26485830528991e-06 
 25.6000000000000  8.12683232885363e-06 
 25.8000000000000  7.99318023394609e-06 
 26.0000000000000  7.86376502002395e-06 
 26.2000000000000  7.73843458461237e-06 
 26.4000000000000  7.61702837750589e-06 
 26.6000000000000  7.49938246377753e-06 
 26.8000000000000  7.38533326905932e-06 
 27.0000000000000  7.27472026425545e-06 
 27.2000000000000  7.16738781669793e-06 
 27.4000000000000  7.06318639971911e-06 
 27.6000000000000  6.96197331797869e-06 
 27.8000000000000  6.86361307441753e-06 
 28.0000000000000  6.76797747758641e-06 
 28.2000000000000  6.67494556554531e-06 
 28.4000000000000  6.58440340425897e-06 
 28.6000000000000  6.49624380391150e-06 
 28.8000000000000  6.41036598523118e-06 
 29.0000000000000  6.32667521918065e-06 
 29.2000000000000  6.24508245671175e-06 
 29.4000000000000  6.16550396026458e-06 
 29.6000000000000  6.08786094494561e-06 
 29.8000000000000  6.01207923455366e-06 
 30.0000000000000  5.93808893560342e-06 
 30.2000000000000  5.86582413104188e-06 
 30.4000000000000  5.79522259432139e-06 
 30.6000000000000  5.72622552377732e-06 
 30.8000000000000  5.65877729677497e-06 
 31.0000000000000  5.59282524277723e-06 
 31.2000000000000  5.52831943429556e-06 
 31.4000000000000  5.46521249458530e-06 
 31.6000000000000  5.40345942090797e-06 
 31.8000000000000  5.34301742218711e-06 
 32.0000000000000  5.28384576991767e-06 
 32.2000000000000  5.22590566124008e-06 
 32.4000000000000  5.16916009315318e-06 
 32.6000000000000  5.11357374690830e-06 
 32.8000000000000  5.05911288169764e-06 
 33.0000000000000  5.00574523681974e-06 
 33.2000000000000  4.95343994157292e-06 
 33.4000000000000  4.90216743219218e-06 
 33.6000000000000  4.85189937520554e-06 
 33.8000000000000  4.80260859664250e-06 
 34.0000000000000  4.75426901657920e-06 
 34.2000000000000  4.70685558855307e-06 
 34.4000000000000  4.66034424342320e-06 
 34.6000000000000  4.61471183729282e-06 
 34.8000000000000  4.56993610314625e-06 
 35.0000000000000  4.52599560588558e-06 
 35.2000000000000  4.48286970048219e-06 
 35.4000000000000  4.44053849298468e-06 
 35.6000000000000  4.39898280414936e-06 
 35.8000000000000  4.35818413548113e-06 
 36.0000000000000  4.31812463749221e-06 
 36.2000000000000  4.27878708000422e-06 
 36.4000000000000  4.24015482433480e-06 
 36.6000000000000  4.20221179722469e-06 
 36.8000000000000  4.16494246637412e-06 
 37.0000000000000  4.12833181746905e-06 
 37.2000000000000  4.09236533258870e-06 
 37.4000000000000  4.05702896989503e-06 
 37.6000000000000  4.02230914451395e-06 
 37.8000000000000  3.98819271052553e-06 
 38.0000000000000  3.95466694398784e-06 
 38.2000000000000  3.92171952692551e-06 
 38.4000000000000  3.88933853221979e-06 
 38.6000000000000  3.85751240934237e-06 
 38.8000000000000  3.82622997088010e-06 
 39.0000000000000  3.79548037980209e-06 
 39.2000000000000  3.76525313742469e-06 
 39.4000000000000  3.73553807203360e-06 
 39.6000000000000  3.70632532812573e-06 
 39.8000000000000  3.67760535623657e-06 
 40.0000000000000  3.64936890332138e-06 
 40.2000000000000  3.62160700366172e-06 
 40.4000000000000  3.59431097027055e-06 
 40.6000000000000  3.56747238677193e-06 
 40.8000000000000  3.54108309973313e-06 
 41.0000000000000  3.51513521142889e-06 
 41.2000000000000  3.48962107301957e-06 
 41.4000000000000  3.46453327812631e-06 
 41.6000000000000  3.43986465678821e-06 
 41.8000000000000  3.41560826978768e-06 
 42.0000000000000  3.39175740333193e-06 
 42.2000000000000  3.36830556407950e-06 
 42.4000000000000  3.34524647450233e-06 
 42.6000000000000  3.32257406857480e-06 
 42.8000000000000  3.30028248778274e-06 
 43.0000000000000  3.27836607744617e-06 
 43.2000000000000  3.25681938335086e-06 
 43.4000000000000  3.23563714868495e-06 
 43.6000000000000  3.21481431127782e-06 
 43.8000000000000  3.19434600113962e-06 
 44.0000000000000  3.17422753830083e-06 
 44.2000000000000  3.15445443095258e-06 
 44.4000000000000  3.13502237388925e-06 
 44.6000000000000  3.11592724725625e-06 
 44.8000000000000  3.09716511560704e-06 
 45.0000000000000  3.07873222727467e-06 
 45.2000000000000  3.06062501406422e-06 
 45.4000000000000  3.04284009127422e-06 
 45.6000000000000  3.02537425805616e-06 
 45.8000000000000  3.00822449812292e-06 
 46.0000000000000  2.99138798081853e-06 
 46.2000000000000  2.97486206256316e-06 
 46.4000000000000  2.95864428868921e-06 
 46.6000000000000  2.94273239568634e-06 
 46.8000000000000  2.92712431387516e-06 
 47.0000000000000  2.91181817053176e-06 
 47.2000000000000  2.89681229348746e-06 
 47.4000000000000  2.88210521523110e-06 
 47.6000000000000  2.86769567754380e-06 
 47.8000000000000  2.85358263669923e-06 
 48.0000000000000  2.83976526926621e-06 
 48.2000000000000  2.82624297855363e-06 
 48.4000000000000  2.81301540174232e-06 
 48.6000000000000  2.80008241775254e-06 
 48.8000000000000  2.78744415590111e-06 
 49.0000000000000  2.77510100540716e-06 
 49.2000000000000  2.76305362581200e-06 
 49.4000000000000  2.75130295838473e-06 
 49.6000000000000  2.73985023859286e-06 
 49.8000000000000  2.72869700972509e-06 
 50.0000000000000  2.71784513776250e-06 
 50.2000000000000  2.70729682760415e-06 
 50.4000000000000  2.69705464076441e-06 
 50.6000000000000  2.68712151467124e-06 
 50.8000000000000  2.67750078370866e-06 
 51.0000000000000  2.66819620216159e-06 
 51.2000000000000  2.65921196923844e-06 
 51.4000000000000  2.65055275636563e-06 
 51.6000000000000  2.64222373696960e-06 
 51.8000000000000  2.63423061898561e-06 
 52.0000000000000  2.62657968035916e-06 
 52.2000000000000  2.61927780783599e-06 
 52.4000000000000  2.61233253937015e-06 
 52.6000000000000  2.60575211051743e-06 
 52.8000000000000  2.59954550522424e-06 
 53.0000000000000  2.59372251147006e-06 
 53.2000000000000  2.58829378227586e-06 
 53.4000000000000  2.58327090265255e-06 
 53.6000000000000  2.57866646313302e-06 
 53.8000000000000  2.57449414061016e-06 
 54.0000000000000  2.57076878729325e-06 
 54.2000000000000  2.56750652869658e-06 
 54.4000000000000  2.56472487169038e-06 
 54.6000000000000  2.56244282377645e-06 
 54.8000000000000  2.56068102490167e-06 
 55.0000000000000  2.55946189329505e-06 
 55.2000000000000  2.55880978701163e-06 
 55.4000000000000  2.55875118309243e-06 
 55.6000000000000  2.55931487650967e-06 
 55.8000000000000  2.56053220136427e-06 
 56.0000000000000  2.56243727714614e-06 
 56.2000000000000  2.56506728326269e-06 
 56.4000000000000  2.56846276549673e-06 
 56.6000000000000  2.57266797858126e-06 
 56.8000000000000  2.57773126968618e-06 
 57.0000000000000  2.58370550831589e-06 
 57.2000000000000  2.59064856893054e-06 
 57.4000000000000  2.59862387354799e-06 
 57.6000000000000  2.60770100267714e-06 
 57.8000000000000  2.61795638420267e-06 
 58.0000000000000  2.62947407131323e-06 
 58.2000000000000  2.64234662227304e-06 
 58.4000000000000  2.65667609681621e-06 
 58.6000000000000  2.67257518623604e-06 
 58.8000000000000  2.69016849689299e-06 
 59.0000000000000  2.70959400992316e-06 
 59.2000000000000  2.73100474344635e-06 
 59.4000000000000  2.75457064759731e-06 
 59.6000000000000  2.78048076728113e-06 
 59.8000000000000  2.80894571271355e-06 
 60.0000000000000  2.84020048355296e-06 
 60.2000000000000  2.87450769872015e-06 
 60.4000000000000  2.91216129071340e-06 
 60.6000000000000  2.95349073011624e-06 
 60.8000000000000  2.99886585262159e-06 
 61.0000000000000  3.04870236651992e-06 
 61.2000000000000  3.10346812201834e-06 
 61.4000000000000  3.16369022308093e-06 
 61.6000000000000  3.22996305477722e-06 
 61.8000000000000  3.30295727992583e-06 
 62.0000000000000  3.38342982138553e-06 
 62.2000000000000  3.47223478062311e-06 
 62.4000000000000  3.57033513434018e-06 
 62.6000000000000  3.67881487730610e-06 
 62.8000000000000  3.79889100992135e-06 
 63.0000000000000  3.93192435921237e-06 
 63.2000000000000  4.07942761068600e-06 
 63.4000000000000  4.24306803354101e-06 
 63.6000000000000  4.42466109801968e-06 
 63.8000000000000  4.62614938715493e-06 
 64.0000000000000  4.84955877100046e-06 
 64.2000000000000  5.09692066108669e-06 
 64.4000000000000  5.37014536531477e-06 
 64.6000000000000  5.67082752811929e-06 
 64.8000000000000  5.99996144610301e-06 
 65.0000000000000  6.35754393301568e-06 
 65.2000000000000  6.74204934603365e-06 
 65.4000000000000  7.14978143724644e-06 
 65.6000000000000  7.57414729085189e-06 
 65.8000000000000  8.00496529369275e-06 
 66.0000000000000  8.42800801914989e-06 
 66.2000000000000  8.82506724029881e-06 
 66.4000000000000  9.17485676608459e-06 
 66.6000000000000  9.45496246976471e-06 
 66.8000000000000  9.64475484501386e-06 
 67.0000000000000  9.72874584976709e-06 
 67.2000000000000  9.69949465716723e-06 
 67.4000000000000  9.55911404754610e-06 
 67.6000000000000  9.31883543830815e-06 
 67.8000000000000  8.99679227073496e-06 
 68.0000000000000  8.61479405948896e-06 
 68.2000000000000  8.19507065726260e-06 
 68.4000000000000  7.75774233006505e-06 
 68.6000000000000  7.31933716517395e-06 
 68.8000000000000  6.89228916146363e-06 
 69.0000000000000  6.48513996609246e-06 
 69.2000000000000  6.10312909270056e-06 
 69.4000000000000  5.74891988434680e-06 
 69.6000000000000  5.42330085194862e-06 
 69.8000000000000  5.12578278709302e-06 
 70.0000000000000  4.85506706015587e-06 
 70.2000000000000  4.60939125214881e-06 
 70.4000000000000  4.38677173831376e-06 
 70.6000000000000  4.18516608562048e-06 
 70.8000000000000  4.00257629576866e-06 
 71.0000000000000  3.83711017066811e-06 
 71.2000000000000  3.68701406184155e-06 
 71.4000000000000  3.55068672509310e-06 
 71.6000000000000  3.42668116678277e-06 
 71.8000000000000  3.31369922556211e-06 
 72.0000000000000  3.21058207622627e-06 
 72.2000000000000  3.11629874230299e-06 
 72.4000000000000  3.02993394419340e-06 
 72.6000000000000  2.95067609494271e-06 
 72.8000000000000  2.87780591339155e-06 
 73.0000000000000  2.81068590122625e-06 
 73.2000000000000  2.74875078823275e-06 
 73.4000000000000  2.69149896220165e-06 
 73.6000000000000  2.63848484803303e-06 
 73.8000000000000  2.58931217210912e-06 
 74.0000000000000  2.54362803448542e-06 
 74.2000000000000  2.50111770725281e-06 
 74.4000000000000  2.46150007882048e-06 
 74.6000000000000  2.42452366843403e-06 
 74.8000000000000  2.38996314141994e-06 
 75.0000000000000  2.35761626245906e-06 
 75.2000000000000  2.32730123104456e-06 
 75.4000000000000  2.29885434982858e-06 
 75.6000000000000  2.27212798262416e-06 
 75.8000000000000  2.24698876432149e-06 
 76.0000000000000  2.22331602988123e-06 
 76.2000000000000  2.20100043389947e-06 
 76.4000000000000  2.17994273603655e-06 
 76.6000000000000  2.16005273091289e-06 
 76.8000000000000  2.14124830394990e-06 
 77.0000000000000  2.12345459712314e-06 
 77.2000000000000  2.10660327074654e-06 
 77.4000000000000  2.09063184926202e-06 
 77.6000000000000  2.07548314061064e-06 
 77.8000000000000  2.06110472014047e-06 
 78.0000000000000  2.04744847119681e-06 
 78.2000000000000  2.03447017556557e-06 
 78.4000000000000  2.02212914782581e-06 
 78.6000000000000  2.01038790843134e-06 
 78.8000000000000  1.99921189100144e-06 
 79.0000000000000  1.98856917987109e-06 
 79.2000000000000  1.97843027444584e-06 
 79.4000000000000  1.96876787733411e-06 
 79.6000000000000  1.95955670360147e-06 
 79.8000000000000  1.95077330881422e-06 
 80.0000000000000  1.94239593382002e-06 
 80.2000000000000  1.93440436445809e-06 
 80.4000000000000  1.92677980460440e-06 
 80.6000000000000  1.91950476114347e-06 
 80.8000000000000  1.91256293962106e-06 
 81.0000000000000  1.90593914947461e-06 
 81.2000000000000  1.89961921786288e-06 
 81.4000000000000  1.89358991122610e-06 
 81.6000000000000  1.88783886380413e-06 
 81.8000000000000  1.88235451242483e-06 
 82.0000000000000  1.87712603694980e-06 
 82.2000000000000  1.87214330583010e-06 
 82.4000000000000  1.86739682628335e-06 
 82.6000000000000  1.86287769865457e-06 
 82.8000000000000  1.85857757456909e-06 
 83.0000000000000  1.85448861852624e-06 
 83.2000000000000  1.85060347261824e-06 
 83.4000000000000  1.84691522409093e-06 
 83.6000000000000  1.84341737549115e-06 
 83.8000000000000  1.84010381717101e-06 
 84.0000000000000  1.83696880194189e-06 
 84.2000000000000  1.83400692169104e-06 
 84.4000000000000  1.83121308579180e-06 
 84.6000000000000  1.82858250115456e-06 
 84.8000000000000  1.82611065378006e-06 
 85.0000000000000  1.82379329168956e-06 
 85.2000000000000  1.82162640911795e-06 
 85.4000000000000  1.81960623186670e-06 
 85.6000000000000  1.81772920372247e-06 
 85.8000000000000  1.81599197385615e-06 
 86.0000000000000  1.81439138512428e-06 
 86.2000000000000  1.81292446320225e-06 
 86.4000000000000  1.81158840648443e-06 
 86.6000000000000  1.81038057669215e-06 
 86.8000000000000  1.80929849013591e-06 
 87.0000000000000  1.80833980958213e-06 
 87.2000000000000  1.80750233667967e-06 
 87.4000000000000  1.80678400490465e-06 
 87.6000000000000  1.80618287298576e-06 
 87.8000000000000  1.80569711877540e-06 
 88.0000000000000  1.80532503353471e-06 
 88.2000000000000  1.80506501660349e-06 
 88.4000000000000  1.80491557042779e-06 
 88.6000000000000  1.80487529592086e-06 
 88.8000000000000  1.80494288813447e-06 
 89.0000000000000  1.80511713221987e-06 
 89.2000000000000  1.80539689965903e-06 
 89.4000000000000  1.80578114474848e-06 
 89.6000000000000  1.80626890131943e-06 
 89.8000000000000  1.80685927967901e-06 
 90.0000000000000  1.80755146375891e-06 
 90.2000000000000  1.80834470845830e-06 
 90.4000000000000  1.80923833716952e-06 
 90.6000000000000  1.81023173947539e-06 
 90.8000000000000  1.81132436900807e-06 
 91.0000000000000  1.81251574146028e-06 
 91.2000000000000  1.81380543274013e-06 
 91.4000000000000  1.81519307726167e-06 
 91.6000000000000  1.81667836636388e-06 
 91.8000000000000  1.81826104685113e-06 
 92.0000000000000  1.81994091964918e-06 
 92.2000000000000  1.82171783857061e-06 
 92.4000000000000  1.82359170918460e-06 
 92.6000000000000  1.82556248778613e-06 
 92.8000000000000  1.82763018045994e-06 
 93.0000000000000  1.82979484223535e-06 
 93.2000000000000  1.83205657632792e-06 
 93.4000000000000  1.83441553346468e-06 
 93.6000000000000  1.83687191128954e-06 
 93.8000000000000  1.83942595384612e-06 
 94.0000000000000  1.84207795113536e-06 
 94.2000000000000  1.84482823874546e-06 
 94.4000000000000  1.84767719755198e-06 
 94.6000000000000  1.85062525348635e-06 
 94.8000000000000  1.85367287737084e-06 
 95.0000000000000  1.85682058481859e-06 
 95.2000000000000  1.86006893619747e-06 
 95.4000000000000  1.86341853665637e-06 
 95.6000000000000  1.86687003621329e-06 
 95.8000000000000  1.87042412990415e-06 
 96.0000000000000  1.87408155799189e-06 
 96.2000000000000  1.87784310623524e-06 
 96.4000000000000  1.88170960621705e-06 
 96.6000000000000  1.88568193573176e-06 
 96.8000000000000  1.88976101923220e-06 
 97.0000000000000  1.89394782833585e-06 
 97.2000000000000  1.89824338239067e-06 
 97.4000000000000  1.90264874910112e-06 
 97.6000000000000  1.90716504521483e-06 
 97.8000000000000  1.91179343727065e-06 
 98.0000000000000  1.91653514240894e-06 
 98.2000000000000  1.92139142924508e-06 
 98.4000000000000  1.92636361880740e-06 
 98.6000000000000  1.93145308554075e-06 
 98.8000000000000  1.93666125837716e-06 
 99.0000000000000  1.94198962187524e-06 
 99.2000000000000  1.94743971743005e-06 
 99.4000000000000  1.95301314455527e-06 
 99.6000000000000  1.95871156223990e-06 
 99.8000000000000  1.96453669038164e-06 
 100.000000000000  1.97049031129938e-06 
 100.200000000000  1.97657427132746e-06 
 100.400000000000  1.98279048249444e-06 
 100.600000000000  1.98914092428954e-06 
 100.800000000000  1.99562764551971e-06 
 101.000000000000  2.00225276626096e-06 
 101.200000000000  2.00901847990760e-06 
 101.400000000000  2.01592705532319e-06 
 101.600000000000  2.02298083909737e-06 
 101.800000000000  2.03018225791306e-06 
 102.000000000000  2.03753382102870e-06 
 102.200000000000  2.04503812288042e-06 
 102.400000000000  2.05269784580954e-06 
 102.600000000000  2.06051576292100e-06 
 102.800000000000  2.06849474107863e-06 
 103.000000000000  2.07663774404370e-06 
 103.200000000000  2.08494783576332e-06 
 103.400000000000  2.09342818381596e-06 
 103.600000000000  2.10208206302161e-06 
 103.800000000000  2.11091285922450e-06 
 104.000000000000  2.11992407325710e-06 
 104.200000000000  2.12911932509428e-06 
 104.400000000000  2.13850235820723e-06 
 104.600000000000  2.14807704412744e-06 
 104.800000000000  2.15784738723142e-06 
 105.000000000000  2.16781752975770e-06 
 105.200000000000  2.17799175706835e-06 
 105.400000000000  2.18837450316781e-06 
 105.600000000000  2.19897035649306e-06 
 105.800000000000  2.20978406598951e-06 
 106.000000000000  2.22082054748833e-06 
 106.200000000000  2.23208489040167e-06 
 106.400000000000  2.24358236475355e-06 
 106.600000000000  2.25531842856491e-06 
 106.800000000000  2.26729873561305e-06 
 107.000000000000  2.27952914358649e-06 
 107.200000000000  2.29201572265812e-06 
 107.400000000000  2.30476476450056e-06 
 107.600000000000  2.31778279176970e-06 
 107.800000000000  2.33107656808370e-06 
 108.000000000000  2.34465310852696e-06 
 108.200000000000  2.35851969071016e-06 
 108.400000000000  2.37268386641999e-06 
 108.600000000000  2.38715347389420e-06 
 108.800000000000  2.40193665076021e-06 
 109.000000000000  2.41704184767813e-06 
 109.200000000000  2.43247784273194e-06 
 109.400000000000  2.44825375661569e-06 
 109.600000000000  2.46437906866479e-06 
 109.800000000000  2.48086363378620e-06 
 110.000000000000  2.49771770034522e-06 
 110.200000000000  2.51495192907054e-06 
 110.400000000000  2.53257741304415e-06 
 110.600000000000  2.55060569884726e-06 
 110.800000000000  2.56904880893881e-06 
 111.000000000000  2.58791926534903e-06 
 111.200000000000  2.60723011477656e-06 
 111.400000000000  2.62699495518455e-06 
 111.600000000000  2.64722796399832e-06 
 111.800000000000  2.66794392801545e-06 
 112.000000000000  2.68915827514742e-06 
 112.200000000000  2.71088710812167e-06 
 112.400000000000  2.73314724028302e-06 
 112.600000000000  2.75595623364466e-06 
 112.800000000000  2.77933243935086e-06 
 113.000000000000  2.80329504072715e-06 
 113.200000000000  2.82786409910775e-06 
 113.400000000000  2.85306060264631e-06 
 113.600000000000  2.87890651833262e-06 
 113.800000000000  2.90542484745760e-06 
 114.000000000000  2.93263968478878e-06 
 114.200000000000  2.96057628174151e-06 
 114.400000000000  2.98926111385592e-06 
 114.600000000000  3.01872195291650e-06 
 114.800000000000  3.04898794408131e-06 
 115.000000000000  3.08008968842057e-06 
 115.200000000000  3.11205933130019e-06 
 115.400000000000  3.14493065708570e-06 
 115.600000000000  3.17873919068573e-06 
 115.800000000000  3.21352230650202e-06 
 116.000000000000  3.24931934540658e-06 
 116.200000000000  3.28617174042491e-06 
 116.400000000000  3.32412315186922e-06 
 116.600000000000  3.36321961273746e-06 
 116.800000000000  3.40350968527323e-06 
 117.000000000000  3.44504462967014e-06 
 117.200000000000  3.48787858600155e-06 
 117.400000000000  3.53206877056580e-06 
 117.600000000000  3.57767568795722e-06 
 117.800000000000  3.62476336030822e-06 
 118.000000000000  3.67339957529722e-06 
 118.200000000000  3.72365615468447e-06 
 118.400000000000  3.77560924532411e-06 
 118.600000000000  3.82933963480977e-06 
 118.800000000000  3.88493309414405e-06 
 119.000000000000  3.94248075008368e-06 
 119.200000000000  4.00207949010568e-06 
 119.400000000000  4.06383240326878e-06 
 119.600000000000  4.12784926061465e-06 
 119.800000000000  4.19424703916995e-06 
 120.000000000000  4.26315049408011e-06 
 120.200000000000  4.33469278393475e-06 
 120.400000000000  4.40901615494363e-06 
 120.600000000000  4.48627269029854e-06 
 120.800000000000  4.56662513182275e-06 
 121.000000000000  4.65024778187924e-06 
 121.200000000000  4.73732749449549e-06 
 121.400000000000  4.82806476578403e-06 
 121.600000000000  4.92267493501599e-06 
 121.800000000000  5.02138950915926e-06 
 122.000000000000  5.12445762535564e-06 
 122.200000000000  5.23214766770877e-06 
 122.400000000000  5.34474905692870e-06 
 122.600000000000  5.46257423386731e-06 
 122.800000000000  5.58596086083691e-06 
 123.000000000000  5.71527426788408e-06 
 123.200000000000  5.85091017496717e-06 
 123.400000000000  5.99329772533107e-06 
 123.600000000000  6.14290287038625e-06 
 123.800000000000  6.30023215218316e-06 
 124.000000000000  6.46583693625886e-06 
 124.200000000000  6.64031815536367e-06 
 124.400000000000  6.82433163352775e-06 
 124.600000000000  7.01859407029531e-06 
 124.800000000000  7.22388977697490e-06 
 125.000000000000  7.44107827069170e-06 
 125.200000000000  7.67110284819191e-06 
 125.400000000000  7.91500028009230e-06 
 125.600000000000  8.17391178799032e-06 
 125.800000000000  8.44909549199568e-06 
 126.000000000000  8.74194054531080e-06 
 126.200000000000  9.05398320599983e-06 
 126.400000000000  9.38692513459659e-06 
 126.600000000000  9.74265425024411e-06 
 126.800000000000  1.01232685281036e-05 
 127.000000000000  1.05311031771263e-05 
 127.200000000000  1.09687616999565e-05 
 127.400000000000  1.14391514052176e-05 
 127.600000000000  1.19455240153434e-05 
 127.800000000000  1.24915220876912e-05 
 128.000000000000  1.30812320379908e-05 
 128.200000000000  1.37192446149715e-05 
 128.400000000000  1.44107237099332e-05 
 128.600000000000  1.51614843740933e-05 
 128.800000000000  1.59780808273058e-05 
 129.000000000000  1.68679050248128e-05 
 129.200000000000  1.78392959296738e-05 
 129.400000000000  1.89016589066208e-05 
 129.600000000000  2.00655934449968e-05 
 129.800000000000  2.13430254960130e-05 
 130.000000000000  2.27473377303511e-05 
 130.200000000000  2.42934865015837e-05 
 130.400000000000  2.59980875690148e-05 
 130.600000000000  2.78794427931083e-05 
 130.800000000000  2.99574659237685e-05 
 131.000000000000  3.22534459130574e-05 
 131.200000000000  3.47895595596437e-05 
 131.400000000000  3.75880109180788e-05 
 131.600000000000  4.06696336075476e-05 
 131.800000000000  4.40517485105646e-05 
 132.000000000000  4.77450352806493e-05 
 132.200000000000  5.17491761481273e-05 
 132.400000000000  5.60471081716513e-05 
 132.600000000000  6.05979412158903e-05 
 132.800000000000  6.53290437974462e-05 
 133.000000000000  7.01285263633874e-05 
 133.200000000000  7.48403172657706e-05 
 133.400000000000  7.92649580123083e-05 
 133.600000000000  8.31695402915354e-05 
 133.800000000000  8.63090364582888e-05 
 134.000000000000  8.84580729280068e-05 
 134.200000000000  8.94474942925379e-05 
 134.400000000000  8.91959900882857e-05 
 134.600000000000  8.77264969225458e-05 
 134.800000000000  8.51614953663449e-05 
 135.000000000000  8.16989226342683e-05 
 135.200000000000  7.75770663559456e-05 
 135.400000000000  7.30390717334956e-05 
 135.600000000000  6.83052908496264e-05 
 135.800000000000  6.35570065370339e-05 
 136.000000000000  5.89308437572143e-05 
 136.200000000000  5.45208782590297e-05 
 136.400000000000  5.03850187141705e-05 
 136.600000000000  4.65529044109446e-05 
 136.800000000000  4.30335602310901e-05 
 137.000000000000  3.98219300065904e-05 
 137.200000000000  3.69040112393545e-05 
 137.400000000000  3.42606523389499e-05 
 137.600000000000  3.18702230902541e-05 
 137.800000000000  2.97104063491978e-05 
 138.000000000000  2.77593401632589e-05 
 138.200000000000  2.59962991664912e-05 
 138.400000000000  2.44020605441458e-05 
 138.600000000000  2.29590612867035e-05 
 138.800000000000  2.16514224672322e-05 
 139.000000000000  2.04648928048619e-05 
 139.200000000000  1.93867466849025e-05 
 139.400000000000  1.84056597109970e-05 
 139.600000000000  1.75115764968448e-05 
 139.800000000000  1.66955797270031e-05 
 140.000000000000  1.59497657336547e-05 
 140.200000000000  1.52671293649302e-05 
 140.400000000000  1.46414593424595e-05 
 140.600000000000  1.40672443281989e-05 
 140.800000000000  1.35395893407051e-05 
 141.000000000000  1.30541418406514e-05 
 141.200000000000  1.26070266511803e-05 
 141.400000000000  1.21947888282532e-05 
 141.600000000000  1.18143436082750e-05 
 141.800000000000  1.14629326080054e-05 
 142.000000000000  1.11380855178249e-05 
 142.200000000000  1.08375866029328e-05 
 142.400000000000  1.05594454013487e-05 
 142.600000000000  1.03018710788245e-05 
 142.800000000000  1.00632499668419e-05 
 143.000000000000  9.84212586983044e-06 
 143.200000000000  9.63718278133919e-06 
 143.400000000000  9.44722969628656e-06 
 143.600000000000  9.27118724799448e-06 
 143.800000000000  9.10807593499152e-06 
 144.000000000000  8.95700573408716e-06 
 144.200000000000  8.81716692352506e-06 
 144.400000000000  8.68782196362811e-06 
 144.600000000000  8.56829830272727e-06 
 144.800000000000  8.45798199374742e-06 
 145.000000000000  8.35631202198255e-06 
 145.200000000000  8.26277525766563e-06 
 145.400000000000  8.17690195821364e-06 
 145.600000000000  8.09826175475727e-06 
 145.800000000000  8.02646006596683e-06 
 146.000000000000  7.96113488944553e-06 
 146.200000000000  7.90195392724169e-06 
 146.400000000000  7.84861200746868e-06 
 146.600000000000  7.80082876873485e-06 
 146.800000000000  7.75834657817619e-06 
 147.000000000000  7.72092865743820e-06 
 147.200000000000  7.68835739404560e-06 
 147.400000000000  7.66043281829174e-06 
 147.600000000000  7.63697122812881e-06 
 147.800000000000  7.61780394659192e-06 
 148.000000000000  7.60277619808463e-06 
 148.200000000000  7.59174609142507e-06 
 148.400000000000  7.58458369893059e-06 
 148.600000000000  7.58117022202896e-06 
 148.800000000000  7.58139723494905e-06 
 149.000000000000  7.58516599898171e-06 
 149.200000000000  7.59238684062837e-06 
 149.400000000000  7.60297858768552e-06 
 149.600000000000  7.61686805795932e-06 
 149.800000000000  7.63398959587732e-06 
 150.000000000000  7.65428465277172e-06 
 150.200000000000  7.67770140706048e-06 
 150.400000000000  7.70419442095402e-06 
 150.600000000000  7.73372433067373e-06 
 150.800000000000  7.76625756748816e-06 
 151.000000000000  7.80176610715943e-06 
 151.200000000000  7.84022724564882e-06 
 151.400000000000  7.88162339916117e-06 
 151.600000000000  7.92594192681564e-06 
 151.800000000000  7.97317497441717e-06 
 152.000000000000  8.02331933797351e-06 
 152.200000000000  8.07637634575569e-06 
 152.400000000000  8.13235175784040e-06 
 152.600000000000  8.19125568220079e-06 
 152.800000000000  8.25310250652902e-06 
 153.000000000000  8.31791084508251e-06 
 153.200000000000  8.38570349994510e-06 
 153.400000000000  8.45650743618732e-06 
 153.600000000000  8.53035377049697e-06 
 153.800000000000  8.60727777293175e-06 
 154.000000000000  8.68731888152358e-06 
 154.200000000000  8.77052072953690e-06 
 154.400000000000  8.85693118525346e-06 
 154.600000000000  8.94660240422421e-06 
 154.800000000000  9.03959089399431e-06 
 155.000000000000  9.13595759137252e-06 
 155.200000000000  9.23576795237944e-06 
 155.400000000000  9.33909205507330e-06 
 155.600000000000  9.44600471551556e-06 
 155.800000000000  9.55658561720323e-06 
 156.000000000000  9.67091945436102e-06 
 156.200000000000  9.78909608955351e-06 
 156.400000000000  9.91121072614775e-06 
 156.600000000000  1.00373640962296e-05 
 156.800000000000  1.01676626646521e-05 
 157.000000000000  1.03022188499749e-05 
 157.200000000000  1.04411512631371e-05 
 157.400000000000  1.05845849647964e-05 
 157.600000000000  1.07326517423613e-05 
 157.800000000000  1.08854904078440e-05 
 158.000000000000  1.10432471177740e-05 
 158.200000000000  1.12060757165241e-05 
 158.400000000000  1.13741381045318e-05 
 158.600000000000  1.15476046330301e-05 
 158.800000000000  1.17266545270547e-05 
 159.000000000000  1.19114763386476e-05 
 159.200000000000  1.21022684323574e-05 
 159.400000000000  1.22992395053206e-05 
 159.600000000000  1.25026091444150e-05 
 159.800000000000  1.27126084232031e-05 
 160.000000000000  1.29294805416253e-05 
 160.200000000000  1.31534815116735e-05 
 160.400000000000  1.33848808925688e-05 
 160.600000000000  1.36239625792894e-05 
 160.800000000000  1.38710256486488e-05 
 161.000000000000  1.41263852675153e-05 
 161.200000000000  1.43903736681865e-05 
 161.400000000000  1.46633411964130e-05 
 161.600000000000  1.49456574380749e-05 
 161.800000000000  1.52377124310978e-05 
 162.000000000000  1.55399179698232e-05 
 162.200000000000  1.58527090097515e-05 
 162.400000000000  1.61765451813511e-05 
 162.600000000000  1.65119124224901e-05 
 162.800000000000  1.68593247399967e-05 
 163.000000000000  1.72193261119194e-05 
 163.200000000000  1.75924925432333e-05 
 163.400000000000  1.79794342890504e-05 
 163.600000000000  1.83807982608545e-05 
 163.800000000000  1.87972706329083e-05 
 164.000000000000  1.92295796678028e-05 
 164.200000000000  1.96784987821472e-05 
 164.400000000000  2.01448498756796e-05 
 164.600000000000  2.06295069496225e-05 
 164.800000000000  2.11334000429684e-05 
 165.000000000000  2.16575195185915e-05 
 165.200000000000  2.22029207346878e-05 
 165.400000000000  2.27707291411137e-05 
 165.600000000000  2.33621458447627e-05 
 165.800000000000  2.39784536932922e-05 
 166.000000000000  2.46210239323441e-05 
 166.200000000000  2.52913234980018e-05 
 166.400000000000  2.59909230137037e-05 
 166.600000000000  2.67215055693086e-05 
 166.800000000000  2.74848763696310e-05 
 167.000000000000  2.82829733507134e-05 
 167.200000000000  2.91178788745531e-05 
 167.400000000000  2.99918326272081e-05 
 167.600000000000  3.09072458614146e-05 
 167.800000000000  3.18667171433751e-05 
 168.000000000000  3.28730497845837e-05 
 168.200000000000  3.39292711638480e-05 
 168.400000000000  3.50386541725573e-05 
 168.600000000000  3.62047410482735e-05 
 168.800000000000  3.74313698985775e-05 
 169.000000000000  3.87227042595518e-05 
 169.200000000000  4.00832660822198e-05 
 169.400000000000  4.15179725967801e-05 
 169.600000000000  4.30321775697733e-05 
 169.800000000000  4.46317175448726e-05 
 170.000000000000  4.63229637454706e-05 
 170.200000000000  4.81128804185852e-05 
 170.400000000000  5.00090905171499e-05 
 170.600000000000  5.20199497540520e-05 
 170.800000000000  5.41546302194274e-05 
 171.000000000000  5.64232149361472e-05 
 171.200000000000  5.88368049410669e-05 
 171.400000000000  6.14076407259063e-05 
 171.600000000000  6.41492401563974e-05 
 171.800000000000  6.70765553168863e-05 
 172.000000000000  7.02061511053346e-05 
 172.200000000000  7.35564088359870e-05 
 172.400000000000  7.71477585986709e-05 
 172.600000000000  8.10029446779254e-05 
 172.800000000000  8.51473289524184e-05 
 173.000000000000  8.96092378706942e-05 
 173.200000000000  9.44203593202952e-05 
 173.400000000000  9.96161964474280e-05 
 173.600000000000  0.000105236586196290 
 173.800000000000  0.000111326290941430 
 174.000000000000  0.000117935671954129 
 174.200000000000  0.000125121453371521 
 174.400000000000  0.000132947584510379 
 174.600000000000  0.000141486206306026 
 174.800000000000  0.000150818723637146 
 175.000000000000  0.000161036978239654 
 175.200000000000  0.000172244505223623 
 175.400000000000  0.000184557837560468 
 175.600000000000  0.000198107793951534 
 175.800000000000  0.000213040641476074 
 176.000000000000  0.000229518958767469 
 176.200000000000  0.000247721929351769 
 176.400000000000  0.000267844656910577 
 176.600000000000  0.000290095901277218 
 176.800000000000  0.000314693372529986 
 177.000000000000  0.000341855382165136 
 177.200000000000  0.000371787242409116 
 177.400000000000  0.000404660371202315 
 177.600000000000  0.000440581717060232 
 177.800000000000  0.000479551105159714 
 178.000000000000  0.000521404850607644 
 178.200000000000  0.000565746137737560 
 178.400000000000  0.000611867023707614 
 178.600000000000  0.000658674086792827 
 178.800000000000  0.000704639292580623 
 179.000000000000  0.000747806928065528 
 179.200000000000  0.000785890519959290 
 179.400000000000  0.000816482243747458 
 179.600000000000  0.000837365755961282 
 179.800000000000  0.000846876808451175 
 180.000000000000  0.000844215473888676 
 180.200000000000  0.000829608099346028 
 180.400000000000  0.000804260718448197 
 180.600000000000  0.000770121029212236 
 180.800000000000  0.000729531874068274 
 181.000000000000  0.000684881455818498 
 181.200000000000  0.000638331487945971 
 181.400000000000  0.000591657850584672 
 181.600000000000  0.000546196613122795 
 181.800000000000  0.000502865669753314 
 182.000000000000  0.000462228128601786 
 182.200000000000  0.000424570297487004 
 182.400000000000  0.000389977032041744 
 182.600000000000  0.000358395890226912 
 182.800000000000  0.000329687448914357 
 183.000000000000  0.000303662441690736 
 183.200000000000  0.000280107824940014 
 183.400000000000  0.000258804228248300 
 183.600000000000  0.000239537048726839 
 183.800000000000  0.000222103045550580 
 184.000000000000  0.000206313859611936 
 184.200000000000  0.000191997502839521 
 184.400000000000  0.000178998557124937 
 184.600000000000  0.000167177592595894 
 184.800000000000  0.000156410147653366 
 185.000000000000  0.000146585494990870 
 185.200000000000  0.000137605336171255 
 185.400000000000  0.000129382512026406 
 185.600000000000  0.000121839779360905 
 185.800000000000  0.000114908680453221 
 186.000000000000  0.000108528516566263 
 186.200000000000  0.000102645427238201 
 186.400000000000  9.72115715472707e-05 
 186.600000000000  9.21844044836642e-05 
 186.800000000000  8.75260401087134e-05 
 187.000000000000  8.32026927302039e-05 
 187.200000000000  7.91841874725282e-05 
 187.400000000000  7.54435321106344e-05 
 187.600000000000  7.19565427002550e-05 
 187.800000000000  6.87015162686329e-05 
 188.000000000000  6.56589445661440e-05 
 188.200000000000  6.28112635828452e-05 
 188.400000000000  6.01426341852070e-05 
 188.600000000000  5.76387498184415e-05 
 188.800000000000  5.52866677466536e-05 
 189.000000000000  5.30746607684563e-05 
 189.200000000000  5.09920867537170e-05 
 189.400000000000  4.90292737028167e-05 
 189.600000000000  4.71774183387090e-05 
 189.800000000000  4.54284965095251e-05 
 190.000000000000  4.37751839105924e-05 
 190.200000000000  4.22107858342191e-05 
 190.400000000000  4.07291748275987e-05 
 190.600000000000  3.93247352874968e-05 
 190.800000000000  3.79923141482206e-05 
 191.000000000000  3.67271769296137e-05 
 191.200000000000  3.55249685069493e-05 
 191.400000000000  3.43816780467023e-05 
 191.600000000000  3.32936076231562e-05 
 191.800000000000  3.22573440921747e-05 
 192.000000000000  3.12697338516079e-05 
 192.200000000000  3.03278601638807e-05 
 192.400000000000  2.94290227562754e-05 
 192.600000000000  2.85707194491728e-05 
 192.800000000000  2.77506295927225e-05 
 193.000000000000  2.69665991187376e-05 
 193.200000000000  2.62166270375539e-05 
 193.400000000000  2.54988532296113e-05 
 193.600000000000  2.48115473989986e-05 
 193.800000000000  2.41530990714539e-05 
 194.000000000000  2.35220085326261e-05 
 194.200000000000  2.29168786139796e-05 
 194.400000000000  2.23364072437529e-05 
 194.600000000000  2.17793806890086e-05 
 194.800000000000  2.12446674221163e-05 
 195.000000000000  2.07312125510646e-05 
 195.200000000000  2.02380327578106e-05 
 195.400000000000  1.97642116924086e-05 
 195.600000000000  1.93088957728248e-05 
 195.800000000000  1.88712903410004e-05 
 196.000000000000  1.84506561246402e-05 
 196.200000000000  1.80463059511022e-05 
 196.400000000000  1.76576016542523e-05 
 196.600000000000  1.72839511068066e-05 
 196.800000000000  1.69248052989867e-05 
 197.000000000000  1.65796553687754e-05 
 197.200000000000  1.62480294692529e-05 
 197.400000000000  1.59294893342585e-05 
 197.600000000000  1.56236263753435e-05 
 197.800000000000  1.53300571119810e-05 
 198.000000000000  1.50484177062232e-05 
 198.200000000000  1.47783573478123e-05 
 198.400000000000  1.45195302250230e-05 
 198.600000000000  1.42715858336586e-05 
 198.800000000000  1.40341574403465e-05 
 199.000000000000  1.38068486501702e-05 
 199.200000000000  1.35892182585872e-05 
 199.400000000000  1.33807639151401e-05 
 199.600000000000  1.31809055975616e-05 
 199.800000000000  1.29889704630837e-05 
 200.000000000000  1.28041812321981e-05 
 200.200000000000  1.26256507304326e-05 
 200.400000000000  1.24523853757274e-05 
 200.600000000000  1.22833000543951e-05 
 200.800000000000  1.21172458494124e-05 
 201.000000000000  1.19530505016881e-05 
 201.200000000000  1.17895695346617e-05 
 201.400000000000  1.16257440523194e-05 
 201.600000000000  1.14606597481070e-05 
 201.800000000000  1.12936009160382e-05 
 202.000000000000  1.11240933105926e-05 
 202.200000000000  1.09519305084530e-05 
 202.400000000000  1.07771799409089e-05 
 202.600000000000  1.06001669860021e-05 
 202.800000000000  1.04214383227481e-05 
 203.000000000000  1.02417087523627e-05 
 203.200000000000  1.00617981825882e-05 
 203.400000000000  9.88256671790728e-06 
 203.600000000000  9.70485541216992e-06 
 203.800000000000  9.52943839341594e-06 
 204.000000000000  9.35698940512609e-06 
 204.200000000000  9.18806311899439e-06 
 204.400000000000  9.02308948547278e-06 
 204.600000000000  8.86237818478207e-06 
 204.800000000000  8.70612988693555e-06 
 205.000000000000  8.55445129545780e-06 
 205.200000000000  8.40737155451870e-06 
 205.400000000000  8.26485830528992e-06 
 205.600000000000  8.12683232885361e-06 
 205.800000000000  7.99318023394608e-06 
 206.000000000000  7.86376502002394e-06 
 206.200000000000  7.73843458461236e-06 
 206.400000000000  7.61702837750589e-06 
 206.600000000000  7.49938246377753e-06 
 206.800000000000  7.38533326905932e-06 
 207.000000000000  7.27472026425544e-06 
 207.200000000000  7.16738781669794e-06 
 207.400000000000  7.06318639971912e-06 
 207.600000000000  6.96197331797869e-06 
 207.800000000000  6.86361307441752e-06 
 208.000000000000  6.76797747758640e-06 
 208.200000000000  6.67494556554531e-06 
 208.400000000000  6.58440340425897e-06 
 208.600000000000  6.49624380391149e-06 
 208.800000000000  6.41036598523118e-06 
 209.000000000000  6.32667521918065e-06 
 209.200000000000  6.24508245671175e-06 
 209.400000000000  6.16550396026458e-06 
 209.600000000000  6.08786094494561e-06 
 209.800000000000  6.01207923455366e-06 
 210.000000000000  5.93808893560341e-06 
 210.200000000000  5.86582413104187e-06 
 210.400000000000  5.79522259432139e-06 
 210.600000000000  5.72622552377732e-06 
 210.800000000000  5.65877729677497e-06 
 211.000000000000  5.59282524277722e-06 
 211.200000000000  5.52831943429555e-06 
 211.400000000000  5.46521249458531e-06 
 211.600000000000  5.40345942090796e-06 
 211.800000000000  5.34301742218711e-06 
 212.000000000000  5.28384576991766e-06 
 212.200000000000  5.22590566124008e-06 
 212.400000000000  5.16916009315317e-06 
 212.600000000000  5.11357374690829e-06 
 212.800000000000  5.05911288169764e-06 
 213.000000000000  5.00574523681974e-06 
 213.200000000000  4.95343994157292e-06 
 213.400000000000  4.90216743219218e-06 
 213.600000000000  4.85189937520554e-06 
 213.800000000000  4.80260859664250e-06 
 214.000000000000  4.75426901657920e-06 
 214.200000000000  4.70685558855307e-06 
 214.400000000000  4.66034424342320e-06 
 214.600000000000  4.61471183729281e-06 
 214.800000000000  4.56993610314624e-06 
 215.000000000000  4.52599560588557e-06 
 215.200000000000  4.48286970048219e-06 
 215.400000000000  4.44053849298468e-06 
 215.600000000000  4.39898280414936e-06 
 215.800000000000  4.35818413548113e-06 
 216.000000000000  4.31812463749221e-06 
 216.200000000000  4.27878708000422e-06 
 216.400000000000  4.24015482433480e-06 
 216.600000000000  4.20221179722469e-06 
 216.800000000000  4.16494246637411e-06 
 217.000000000000  4.12833181746905e-06 
 217.200000000000  4.09236533258870e-06 
 217.400000000000  4.05702896989503e-06 
 217.600000000000  4.02230914451395e-06 
 217.800000000000  3.98819271052553e-06 
 218.000000000000  3.95466694398783e-06 
 218.200000000000  3.92171952692551e-06 
 218.400000000000  3.88933853221979e-06 
 218.600000000000  3.85751240934237e-06 
 218.800000000000  3.82622997088010e-06 
 219.000000000000  3.79548037980209e-06 
 219.200000000000  3.76525313742469e-06 
 219.400000000000  3.73553807203359e-06 
 219.600000000000  3.70632532812573e-06 
 219.800000000000  3.67760535623657e-06 
 220.000000000000  3.64936890332138e-06 
 220.200000000000  3.62160700366172e-06 
 220.400000000000  3.59431097027055e-06 
 220.600000000000  3.56747238677193e-06 
 220.800000000000  3.54108309973313e-06 
 221.000000000000  3.51513521142888e-06 
 221.200000000000  3.48962107301956e-06 
 221.400000000000  3.46453327812631e-06 
 221.600000000000  3.43986465678821e-06 
 221.800000000000  3.41560826978768e-06 
 222.000000000000  3.39175740333193e-06 
 222.200000000000  3.36830556407950e-06 
 222.400000000000  3.34524647450233e-06 
 222.600000000000  3.32257406857480e-06 
 222.800000000000  3.30028248778274e-06 
 223.000000000000  3.27836607744617e-06 
 223.200000000000  3.25681938335086e-06 
 223.400000000000  3.23563714868495e-06 
 223.600000000000  3.21481431127782e-06 
 223.800000000000  3.19434600113962e-06 
 224.000000000000  3.17422753830083e-06 
 224.200000000000  3.15445443095258e-06 
 224.400000000000  3.13502237388925e-06 
 224.600000000000  3.11592724725625e-06 
 224.800000000000  3.09716511560704e-06 
 225.000000000000  3.07873222727467e-06 
 225.200000000000  3.06062501406422e-06 
 225.400000000000  3.04284009127423e-06 
 225.600000000000  3.02537425805615e-06 
 225.800000000000  3.00822449812292e-06 
 226.000000000000  2.99138798081853e-06 
 226.200000000000  2.97486206256316e-06 
 226.400000000000  2.95864428868921e-06 
 226.600000000000  2.94273239568634e-06 
 226.800000000000  2.92712431387517e-06 
 227.000000000000  2.91181817053176e-06 
 227.200000000000  2.89681229348746e-06 
 227.400000000000  2.88210521523111e-06 
 227.600000000000  2.86769567754380e-06 
 227.800000000000  2.85358263669923e-06 
 228.000000000000  2.83976526926621e-06 
 228.200000000000  2.82624297855363e-06 
 228.400000000000  2.81301540174232e-06 
 228.600000000000  2.80008241775254e-06 
 228.800000000000  2.78744415590111e-06 
 229.000000000000  2.77510100540716e-06 
 229.200000000000  2.76305362581199e-06 
 229.400000000000  2.75130295838473e-06 
 229.600000000000  2.73985023859286e-06 
 229.800000000000  2.72869700972509e-06 
 230.000000000000  2.71784513776250e-06 
 230.200000000000  2.70729682760415e-06 
 230.400000000000  2.69705464076441e-06 
 230.600000000000  2.68712151467124e-06 
 230.800000000000  2.67750078370866e-06 
 231.000000000000  2.66819620216159e-06 
 231.200000000000  2.65921196923844e-06 
 231.400000000000  2.65055275636563e-06 
 231.600000000000  2.64222373696960e-06 
 231.800000000000  2.63423061898561e-06 
 232.000000000000  2.62657968035916e-06 
 232.200000000000  2.61927780783599e-06 
 232.400000000000  2.61233253937015e-06 
 232.600000000000  2.60575211051742e-06 
 232.800000000000  2.59954550522424e-06 
 233.000000000000  2.59372251147006e-06 
 233.200000000000  2.58829378227586e-06 
 233.400000000000  2.58327090265256e-06 
 233.600000000000  2.57866646313302e-06 
 233.800000000000  2.57449414061016e-06 
 234.000000000000  2.57076878729325e-06 
 234.200000000000  2.56750652869658e-06 
 234.400000000000  2.56472487169038e-06 
 234.600000000000  2.56244282377645e-06 
 234.800000000000  2.56068102490167e-06 
 235.000000000000  2.55946189329505e-06 
 235.200000000000  2.55880978701163e-06 
 235.400000000000  2.55875118309243e-06 
 235.600000000000  2.55931487650967e-06 
 235.800000000000  2.56053220136427e-06 
 236.000000000000  2.56243727714614e-06 
 236.200000000000  2.56506728326269e-06 
 236.400000000000  2.56846276549673e-06 
 236.600000000000  2.57266797858126e-06 
 236.800000000000  2.57773126968618e-06 
 237.000000000000  2.58370550831589e-06 
 237.200000000000  2.59064856893054e-06 
 237.400000000000  2.59862387354799e-06 
 237.600000000000  2.60770100267715e-06 
 237.800000000000  2.61795638420267e-06 
 238.000000000000  2.62947407131323e-06 
 238.200000000000  2.64234662227304e-06 
 238.400000000000  2.65667609681621e-06 
 238.600000000000  2.67257518623604e-06 
 238.800000000000  2.69016849689299e-06 
 239.000000000000  2.70959400992316e-06 
 239.200000000000  2.73100474344635e-06 
 239.400000000000  2.75457064759731e-06 
 239.600000000000  2.78048076728113e-06 
 239.800000000000  2.80894571271355e-06 
 240.000000000000  2.84020048355297e-06 
 240.200000000000  2.87450769872015e-06 
 240.400000000000  2.91216129071340e-06 
 240.600000000000  2.95349073011624e-06 
 240.800000000000  2.99886585262159e-06 
 241.000000000000  3.04870236651992e-06 
 241.200000000000  3.10346812201834e-06 
 241.400000000000  3.16369022308093e-06 
 241.600000000000  3.22996305477722e-06 
 241.800000000000  3.30295727992584e-06 
 242.000000000000  3.38342982138553e-06 
 242.200000000000  3.47223478062310e-06 
 242.400000000000  3.57033513434016e-06 
 242.600000000000  3.67881487730610e-06 
 242.800000000000  3.79889100992135e-06 
 243.000000000000  3.93192435921239e-06 
 243.200000000000  4.07942761068602e-06 
 243.400000000000  4.24306803354102e-06 
 243.600000000000  4.42466109801967e-06 
 243.800000000000  4.62614938715491e-06 
 244.000000000000  4.84955877100049e-06 
 244.200000000000  5.09692066108671e-06 
 244.400000000000  5.37014536531477e-06 
 244.600000000000  5.67082752811934e-06 
 244.800000000000  5.99996144610305e-06 
 245.000000000000  6.35754393301569e-06 
 245.200000000000  6.74204934603366e-06 
 245.400000000000  7.14978143724642e-06 
 245.600000000000  7.57414729085194e-06 
 245.800000000000  8.00496529369277e-06 
 246.000000000000  8.42800801914988e-06 
 246.200000000000  8.82506724029880e-06 
 246.400000000000  9.17485676608454e-06 
 246.600000000000  9.45496246976475e-06 
 246.800000000000  9.64475484501386e-06 
 247.000000000000  9.72874584976710e-06 
 247.200000000000  9.69949465716722e-06 
 247.400000000000  9.55911404754608e-06 
 247.600000000000  9.31883543830812e-06 
 247.800000000000  8.99679227073499e-06 
 248.000000000000  8.61479405948893e-06 
 248.200000000000  8.19507065726257e-06 
 248.400000000000  7.75774233006504e-06 
 248.600000000000  7.31933716517398e-06 
 248.800000000000  6.89228916146366e-06 
 249.000000000000  6.48513996609245e-06 
 249.200000000000  6.10312909270056e-06 
 249.400000000000  5.74891988434681e-06 
 249.600000000000  5.42330085194857e-06 
 249.800000000000  5.12578278709300e-06 
 250.000000000000  4.85506706015587e-06 
 250.200000000000  4.60939125214882e-06 
 250.400000000000  4.38677173831378e-06 
 250.600000000000  4.18516608562046e-06 
 250.800000000000  4.00257629576865e-06 
 251.000000000000  3.83711017066811e-06 
 251.200000000000  3.68701406184155e-06 
 251.400000000000  3.55068672509313e-06 
 251.600000000000  3.42668116678276e-06 
 251.800000000000  3.31369922556212e-06 
 252.000000000000  3.21058207622625e-06 
 252.200000000000  3.11629874230297e-06 
 252.400000000000  3.02993394419340e-06 
 252.600000000000  2.95067609494271e-06 
 252.800000000000  2.87780591339156e-06 
 253.000000000000  2.81068590122625e-06 
 253.200000000000  2.74875078823275e-06 
 253.400000000000  2.69149896220165e-06 
 253.600000000000  2.63848484803302e-06 
 253.800000000000  2.58931217210912e-06 
 254.000000000000  2.54362803448541e-06 
 254.200000000000  2.50111770725280e-06 
 254.400000000000  2.46150007882048e-06 
 254.600000000000  2.42452366843403e-06 
 254.800000000000  2.38996314141994e-06 
 255.000000000000  2.35761626245907e-06 
 255.200000000000  2.32730123104457e-06 
 255.400000000000  2.29885434982858e-06 
 255.600000000000  2.27212798262416e-06 
 255.800000000000  2.24698876432149e-06 
 256.000000000000  2.22331602988124e-06 
 256.200000000000  2.20100043389947e-06 
 256.400000000000  2.17994273603654e-06 
 256.600000000000  2.16005273091289e-06 
 256.800000000000  2.14124830394990e-06 
 257.000000000000  2.12345459712315e-06 
 257.200000000000  2.10660327074653e-06 
 257.400000000000  2.09063184926202e-06 
 257.600000000000  2.07548314061064e-06 
 257.800000000000  2.06110472014047e-06 
 258.000000000000  2.04744847119681e-06 
 258.200000000000  2.03447017556557e-06 
 258.400000000000  2.02212914782580e-06 
 258.600000000000  2.01038790843134e-06 
 258.800000000000  1.99921189100144e-06 
 259.000000000000  1.98856917987109e-06 
 259.200000000000  1.97843027444584e-06 
 259.400000000000  1.96876787733411e-06 
 259.600000000000  1.95955670360147e-06 
 259.800000000000  1.95077330881422e-06 
 260.000000000000  1.94239593382002e-06 
 260.200000000000  1.93440436445809e-06 
 260.400000000000  1.92677980460440e-06 
 260.600000000000  1.91950476114347e-06 
 260.800000000000  1.91256293962106e-06 
 261.000000000000  1.90593914947461e-06 
 261.200000000000  1.89961921786288e-06 
 261.400000000000  1.89358991122610e-06 
 261.600000000000  1.88783886380413e-06 
 261.800000000000  1.88235451242483e-06 
 262.000000000000  1.87712603694980e-06 
 262.200000000000  1.87214330583010e-06 
 262.400000000000  1.86739682628335e-06 
 262.600000000000  1.86287769865457e-06 
 262.800000000000  1.85857757456909e-06 
 263.000000000000  1.85448861852624e-06 
 263.200000000000  1.85060347261824e-06 
 263.400000000000  1.84691522409093e-06 
 263.600000000000  1.84341737549115e-06 
 263.800000000000  1.84010381717101e-06 
 264.000000000000  1.83696880194189e-06 
 264.200000000000  1.83400692169104e-06 
 264.400000000000  1.83121308579180e-06 
 264.600000000000  1.82858250115455e-06 
 264.800000000000  1.82611065378006e-06 
 265.000000000000  1.82379329168956e-06 
 265.200000000000  1.82162640911795e-06 
 265.400000000000  1.81960623186670e-06 
 265.600000000000  1.81772920372247e-06 
 265.800000000000  1.81599197385615e-06 
 266.000000000000  1.81439138512428e-06 
 266.200000000000  1.81292446320225e-06 
 266.400000000000  1.81158840648443e-06 
 266.600000000000  1.81038057669215e-06 
 266.800000000000  1.80929849013591e-06 
 267.000000000000  1.80833980958213e-06 
 267.200000000000  1.80750233667967e-06 
 267.400000000000  1.80678400490465e-06 
 267.600000000000  1.80618287298576e-06 
 267.800000000000  1.80569711877540e-06 
 268.000000000000  1.80532503353471e-06 
 268.200000000000  1.80506501660349e-06 
 268.400000000000  1.80491557042779e-06 
 268.600000000000  1.80487529592086e-06 
 268.800000000000  1.80494288813447e-06 
 269.000000000000  1.80511713221987e-06 
 269.200000000000  1.80539689965903e-06 
 269.400000000000  1.80578114474848e-06 
 269.600000000000  1.80626890131943e-06 
 269.800000000000  1.80685927967901e-06 
 270.000000000000  1.80755146375891e-06 
 270.200000000000  1.80834470845830e-06 
 270.400000000000  1.80923833716952e-06 
 270.600000000000  1.81023173947539e-06 
 270.800000000000  1.81132436900807e-06 
 271.000000000000  1.81251574146028e-06 
 271.200000000000  1.81380543274013e-06 
 271.400000000000  1.81519307726168e-06 
 271.600000000000  1.81667836636388e-06 
 271.800000000000  1.81826104685113e-06 
 272.000000000000  1.81994091964918e-06 
 272.200000000000  1.82171783857061e-06 
 272.400000000000  1.82359170918460e-06 
 272.600000000000  1.82556248778613e-06 
 272.800000000000  1.82763018045994e-06 
 273.000000000000  1.82979484223535e-06 
 273.200000000000  1.83205657632792e-06 
 273.400000000000  1.83441553346468e-06 
 273.600000000000  1.83687191128954e-06 
 273.800000000000  1.83942595384612e-06 
 274.000000000000  1.84207795113536e-06 
 274.200000000000  1.84482823874546e-06 
 274.400000000000  1.84767719755198e-06 
 274.600000000000  1.85062525348635e-06 
 274.800000000000  1.85367287737084e-06 
 275.000000000000  1.85682058481859e-06 
 275.200000000000  1.86006893619747e-06 
 275.400000000000  1.86341853665637e-06 
 275.600000000000  1.86687003621329e-06 
 275.800000000000  1.87042412990415e-06 
 276.000000000000  1.87408155799189e-06 
 276.200000000000  1.87784310623525e-06 
 276.400000000000  1.88170960621706e-06 
 276.600000000000  1.88568193573176e-06 
 276.800000000000  1.88976101923220e-06 
 277.000000000000  1.89394782833585e-06 
 277.200000000000  1.89824338239067e-06 
 277.400000000000  1.90264874910112e-06 
 277.600000000000  1.90716504521483e-06 
 277.800000000000  1.91179343727065e-06 
 278.000000000000  1.91653514240894e-06 
 278.200000000000  1.92139142924508e-06 
 278.400000000000  1.92636361880740e-06 
 278.600000000000  1.93145308554075e-06 
 278.800000000000  1.93666125837716e-06 
 279.000000000000  1.94198962187524e-06 
 279.200000000000  1.94743971743005e-06 
 279.400000000000  1.95301314455527e-06 
 279.600000000000  1.95871156223990e-06 
 279.800000000000  1.96453669038164e-06 
 280.000000000000  1.97049031129938e-06 
 280.200000000000  1.97657427132746e-06 
 280.400000000000  1.98279048249445e-06 
 280.600000000000  1.98914092428955e-06 
 280.800000000000  1.99562764551971e-06 
 281.000000000000  2.00225276626096e-06 
 281.200000000000  2.00901847990761e-06 
 281.400000000000  2.01592705532319e-06 
 281.600000000000  2.02298083909737e-06 
 281.800000000000  2.03018225791306e-06 
 282.000000000000  2.03753382102870e-06 
 282.200000000000  2.04503812288042e-06 
 282.400000000000  2.05269784580954e-06 
 282.600000000000  2.06051576292100e-06 
 282.800000000000  2.06849474107863e-06 
 283.000000000000  2.07663774404370e-06 
 283.200000000000  2.08494783576332e-06 
 283.400000000000  2.09342818381596e-06 
 283.600000000000  2.10208206302161e-06 
 283.800000000000  2.11091285922450e-06 
 284.000000000000  2.11992407325710e-06 
 284.200000000000  2.12911932509428e-06 
 284.400000000000  2.13850235820723e-06 
 284.600000000000  2.14807704412744e-06 
 284.800000000000  2.15784738723142e-06 
 285.000000000000  2.16781752975770e-06 
 285.200000000000  2.17799175706835e-06 
 285.400000000000  2.18837450316781e-06 
 285.600000000000  2.19897035649306e-06 
 285.800000000000  2.20978406598951e-06 
 286.000000000000  2.22082054748833e-06 
 286.200000000000  2.23208489040167e-06 
 286.400000000000  2.24358236475355e-06 
 286.600000000000  2.25531842856491e-06 
 286.800000000000  2.26729873561305e-06 
 287.000000000000  2.27952914358649e-06 
 287.200000000000  2.29201572265812e-06 
 287.400000000000  2.30476476450057e-06 
 287.600000000000  2.31778279176970e-06 
 287.800000000000  2.33107656808370e-06 
 288.000000000000  2.34465310852696e-06 
 288.200000000000  2.35851969071016e-06 
 288.400000000000  2.37268386641999e-06 
 288.600000000000  2.38715347389420e-06 
 288.800000000000  2.40193665076021e-06 
 289.000000000000  2.41704184767812e-06 
 289.200000000000  2.43247784273194e-06 
 289.400000000000  2.44825375661569e-06 
 289.600000000000  2.46437906866479e-06 
 289.800000000000  2.48086363378621e-06 
 290.000000000000  2.49771770034522e-06 
 290.200000000000  2.51495192907054e-06 
 290.400000000000  2.53257741304415e-06 
 290.600000000000  2.55060569884726e-06 
 290.800000000000  2.56904880893881e-06 
 291.000000000000  2.58791926534903e-06 
 291.200000000000  2.60723011477656e-06 
 291.400000000000  2.62699495518455e-06 
 291.600000000000  2.64722796399832e-06 
 291.800000000000  2.66794392801545e-06 
 292.000000000000  2.68915827514742e-06 
 292.200000000000  2.71088710812167e-06 
 292.400000000000  2.73314724028303e-06 
 292.600000000000  2.75595623364466e-06 
 292.800000000000  2.77933243935086e-06 
 293.000000000000  2.80329504072714e-06 
 293.200000000000  2.82786409910776e-06 
 293.400000000000  2.85306060264631e-06 
 293.600000000000  2.87890651833262e-06 
 293.800000000000  2.90542484745760e-06 
 294.000000000000  2.93263968478877e-06 
 294.200000000000  2.96057628174151e-06 
 294.400000000000  2.98926111385592e-06 
 294.600000000000  3.01872195291650e-06 
 294.800000000000  3.04898794408131e-06 
 295.000000000000  3.08008968842057e-06 
 295.200000000000  3.11205933130019e-06 
 295.400000000000  3.14493065708571e-06 
 295.600000000000  3.17873919068574e-06 
 295.800000000000  3.21352230650202e-06 
 296.000000000000  3.24931934540658e-06 
 296.200000000000  3.28617174042491e-06 
 296.400000000000  3.32412315186922e-06 
 296.600000000000  3.36321961273746e-06 
 296.800000000000  3.40350968527323e-06 
 297.000000000000  3.44504462967013e-06 
 297.200000000000  3.48787858600156e-06 
 297.400000000000  3.53206877056581e-06 
 297.600000000000  3.57767568795722e-06 
 297.800000000000  3.62476336030821e-06 
 298.000000000000  3.67339957529721e-06 
 298.200000000000  3.72365615468447e-06 
 298.400000000000  3.77560924532412e-06 
 298.600000000000  3.82933963480978e-06 
 298.800000000000  3.88493309414406e-06 
 299.000000000000  3.94248075008368e-06 
 299.200000000000  4.00207949010569e-06 
 299.400000000000  4.06383240326880e-06 
 299.600000000000  4.12784926061466e-06 
 299.800000000000  4.19424703916996e-06 
 300.000000000000  4.26315049408011e-06 
