 10.0000000000000  1.43152320356222e-12  4.04025616022541e-22 
 10.2329299228075  1.43149140236267e-12  4.04016640618435e-22 
 10.4712854805090  1.43145779938000e-12  4.04007156688491e-22 
 10.7151930523761  1.43142226182598e-12  4.03997126755258e-22 
 10.9647819614318  1.43138464501443e-12  4.03986509983262e-22 
 11.2201845430196  1.43134479134328e-12  4.03975261891722e-22 
 11.4815362149688  1.43130252922337e-12  4.03963334052208e-22 
 11.7489755493953  1.43125767194926e-12  4.03950673769957e-22 
 12.0226443461741  1.43121001654984e-12  4.03937223759466e-22 
 12.3026877081238  1.43115934257759e-12  4.03922921802776e-22 
 12.5892541179416  1.43110541089651e-12  4.03907700407400e-22 
 12.8824955169313  1.43104796244340e-12  4.03891486456696e-22 
 13.1825673855640  1.43098671700525e-12  4.03874200864806e-22 
 13.4896288259165  1.43092137202082e-12  4.03855758238432e-22 
 13.8038426460288  1.43085160141134e-12  4.03836066546810e-22 
 14.1253754462275  1.43077705451351e-12  4.03815026820561e-22 
 14.4543977074592  1.43069735507852e-12  4.03792532869199e-22 
 14.7910838816820  1.43061210042834e-12  4.03768471042975e-22 
 15.1356124843620  1.43052086076977e-12  4.03742720039313e-22 
 15.4881661891247  1.43042317870727e-12  4.03715150765284e-22 
 15.8489319246110  1.43031856901658e-12  4.03685626273738e-22 
 16.2181009735891  1.43020651868371e-12  4.03654001774289e-22 
 16.5958690743754  1.43008648728915e-12  4.03620124741760e-22 
 16.9824365246173  1.42995790774799e-12  4.03583835125082e-22 
 17.3780082874936  1.42982018746613e-12  4.03544965673591e-22 
 17.7827941003890  1.42967270992630e-12  4.03503342384686e-22 
 18.1970085860996  1.42951483675389e-12  4.03458785086852e-22 
 18.6208713666284  1.42934591025644e-12  4.03411108156413e-22 
 19.0546071796322  1.42916525647148e-12  4.03360121377734e-22 
 19.4984459975802  1.42897218868898e-12  4.03305630937367e-22 
 19.9526231496885  1.42876601144660e-12  4.03247440551662e-22 
 20.4173794466950  1.42854602494862e-12  4.03185352713935e-22 
 20.8929613085401  1.42831152984027e-12  4.03119170041961e-22 
 21.3796208950220  1.42806183226139e-12  4.03048696704278e-22 
 21.8776162394952  1.42779624906852e-12  4.02973739894052e-22 
 22.3872113856830  1.42751411308545e-12  4.02894111310960e-22 
 22.9086765276774  1.42721477823656e-12  4.02809628610002e-22 
 23.4422881531988  1.42689762438329e-12  4.02720116766519e-22 
 23.9883291901945  1.42656206166043e-12  4.02625409300039e-22 
 24.5470891568499  1.42620753412268e-12  4.02525349303469e-22 
 25.1188643150954  1.42583352246839e-12  4.02419790211834e-22 
 25.7039578276882  1.42543954562627e-12  4.02308596250087e-22 
 26.3026799189533  1.42502516099968e-12  4.02191642502071e-22 
 26.9153480392686  1.42458996315399e-12  4.02068814540038e-22 
 27.5422870333811  1.42413358077288e-12  4.01940007565612e-22 
 28.1838293126440  1.42365567171547e-12  4.01805125014745e-22 
 28.8403150312655  1.42315591606533e-12  4.01664076595894e-22 
 29.5120922666632  1.42263400705551e-12  4.01516775728766e-22 
 30.1995172040195  1.42208963984196e-12  4.01363136375767e-22 
 30.9029543251352  1.42152249810442e-12  4.01203069260327e-22 
 31.6227766016831  1.42093223851516e-12  4.01036477483420e-22 
 32.3593656929621  1.42031847317250e-12  4.00863251565709e-22 
 33.1131121482583  1.41968075012192e-12  4.00683263949916e-22 
 33.8844156139194  1.41901853218423e-12  4.00496363025396e-22 
 34.6736850452523  1.41833117434278e-12  4.00302366746028e-22 
 35.4813389233567  1.41761790005830e-12  4.00101055945433e-22 
 36.3078054770092  1.41687777695985e-12  3.99892167476117e-22 
 37.1535229097163  1.41610969250520e-12  3.99675387339983e-22 
 38.0189396320551  1.41531233039334e-12  3.99450344031125e-22 
 38.9045144994270  1.41448414867259e-12  3.99216602357170e-22 
 39.8107170553486  1.41362336078645e-12  3.98973658089765e-22 
 40.7380277804101  1.41272792107597e-12  3.98720933872834e-22 
 41.6869383470324  1.41179551650659e-12  3.98457776887612e-22 
 42.6579518801581  1.41082356674728e-12  3.98183458874972e-22 
 43.6515832240153  1.40980923483655e-12  3.97897179145756e-22 
 44.6683592150950  1.40874945076290e-12  3.97598071235985e-22 
 45.7088189614861  1.40764094997242e-12  3.97285213775051e-22 
 46.7735141287184  1.40648032822532e-12  3.96957645968132e-22 
 47.8630092322624  1.40526411297478e-12  3.96614387741795e-22 
 48.9778819368431  1.40398884972894e-12  3.96254464118336e-22 
 50.1187233627256  1.40265119947871e-12  3.95876932713309e-22 
 51.2861383991348  1.40124804058433e-12  3.95480912491443e-22 
 52.4807460249756  1.39977656575770e-12  3.95065611138442e-22 
 53.7031796370235  1.39823436263180e-12  3.94630347800465e-22 
 54.9540873857606  1.39661946549096e-12  3.94174567684212e-22 
 56.2341325190330  1.39493036674582e-12  3.93697845295550e-22 
 57.5439937337137  1.39316598014734e-12  3.93199874057235e-22 
 58.8843655355569  1.39132555322759e-12  3.92680441596660e-22 
 60.2559586074336  1.38940853376791e-12  3.92139392058519e-22 
 61.6595001861460  1.38741440247214e-12  3.91576578879384e-22 
 63.0957344480170  1.38534249044215e-12  3.90991813272947e-22 
 64.5654229034632  1.38319180377222e-12  3.90384814724458e-22 
 66.0693448007572  1.38096087793001e-12  3.89755169891976e-22 
 67.6082975391956  1.37864768150176e-12  3.89102305439916e-22 
 69.1830970918910  1.37624958303040e-12  3.88425478679607e-22 
 70.7945784384110  1.37376338714939e-12  3.87723787767523e-22 
 72.4435960074962  1.37118543840510e-12  3.86996201007564e-22 
 74.1310241300888  1.36851178386113e-12  3.86241602743652e-22 
 75.8577575029153  1.36573837945723e-12  3.85458851601388e-22 
 77.6247116628660  1.36286132036815e-12  3.84646845503332e-22 
 79.4328234724249  1.35987707217331e-12  3.83804586913125e-22 
 81.2830516164066  1.35678267777446e-12  3.82931241234827e-22 
 83.1763771102637  1.35357591477830e-12  3.82026181231792e-22 
 85.1138038202340  1.35025538020506e-12  3.81089010934350e-22 
 87.0963589956044  1.34682048428213e-12  3.80119563888167e-22 
 89.1250938133707  1.34327134335221e-12  3.79117872929200e-22 
 91.2010839355870  1.33960857330602e-12  3.78084111883218e-22 
 93.3254300796950  1.33583299880977e-12  3.77018513499699e-22 
 95.4992586021393  1.33194530831346e-12  3.75921272083165e-22 
 97.7237220955767  1.32794569825902e-12  3.74792443076362e-22 
 99.9999999999954  1.32383355942143e-12  3.73631854534802e-22 
 102.329299228071  1.31960726124677e-12  3.72439046259490e-22 
 104.712854805085  1.31526408362205e-12  3.71213250539968e-22 
 107.151930523756  1.31080032740497e-12  3.69953423349678e-22 
 109.647819614313  1.30621160347492e-12  3.68658325926188e-22 
 112.201845430191  1.30149325617023e-12  3.67326644279925e-22 
 114.815362149683  1.29664082765014e-12  3.65957120253241e-22 
 117.489755493947  1.29165043113368e-12  3.64548656861419e-22 
 120.226443461735  1.28651889636340e-12  3.63100359347593e-22 
 123.026877081232  1.28124359907956e-12  3.61611487054430e-22 
 125.892541179410  1.27582198472165e-12  3.60081318996140e-22 
 128.824955169307  1.27025090906778e-12  3.58508967763997e-22 
 131.825673855634  1.26452599053726e-12  3.56893196723599e-22 
 134.896288259158  1.25864116135648e-12  3.55232293338287e-22 
 138.038426460281  1.25258852383663e-12  3.53524028605703e-22 
 141.253754462268  1.24635850937343e-12  3.51765701933066e-22 
 144.543977074585  1.23994025396898e-12  3.49954247122470e-22 
 147.910838816813  1.23332207183100e-12  3.48086366037067e-22 
 151.356124843613  1.22649192248263e-12  3.46158660435695e-22 
 154.881661891240  1.21943780395914e-12  3.44167742946649e-22 
 158.489319246103  1.21214804350301e-12  3.42110319111943e-22 
 162.181009735884  1.20461148654766e-12  3.39983240725089e-22 
 165.958690743747  1.19681760255852e-12  3.37783535703134e-22 
 169.824365246165  1.18875653384620e-12  3.35508421863423e-22 
 173.780082874928  1.18041911254083e-12  3.33155311714345e-22 
 177.827941003882  1.17179686443244e-12  3.30721813539237e-22 
 181.970085860988  1.16288201063566e-12  3.28205731866211e-22 
 186.208713666276  1.15366747243436e-12  3.25605068835476e-22 
 190.546071796314  1.14414688193820e-12  3.22918027206994e-22 
 194.984459975793  1.13431460022219e-12  3.20143015480093e-22 
 199.526231496876  1.12416574422320e-12  3.17278655484592e-22 
 204.173794466941  1.11369622330896e-12  3.14323792701849e-22 
 208.929613085391  1.10290278606455e-12  3.11277509469539e-22 
 213.796208950210  1.09178307755468e-12  3.08139141143052e-22 
 218.776162394942  1.08033570715151e-12  3.04908295238866e-22 
 223.872113856820  1.06856032697551e-12  3.01584873573279e-22 
 229.086765276763  1.05645772103895e-12  2.98169097421812e-22 
 234.422881531978  1.04402990528660e-12  2.94661535754170e-22 
 239.883291901934  1.03128023886699e-12  2.91063136638845e-22 
 245.470891568488  1.01821354712545e-12  2.87375261956050e-22 
 251.188643150942  1.00483625698384e-12  2.83599725606568e-22 
 257.039578276870  9.91156545547076e-13  2.79738835453689e-22 
 263.026799189521  9.77184502958775e-13  2.75795439286736e-22 
 269.153480392674  9.62932310705972e-13  2.71772975144848e-22 
 275.422870333798  9.48414436742423e-13  2.67675526387563e-22 
 281.838293126427  9.33647848951182e-13  2.63507881941381e-22 
 288.403150312642  9.18652248583688e-13  2.59275602184386e-22 
 295.120922666619  9.03450325371132e-13  2.54985090947546e-22 
 301.995172040181  8.88068035975461e-13  2.50643674103266e-22 
 309.029543251338  8.72534907284311e-13  2.46259685165761e-22 
 316.227766016816  8.56884365699714e-13  2.41842558227777e-22 
 323.593656929606  8.41154092944343e-13  2.37402928381487e-22 
 331.131121482568  8.25386407911064e-13  2.32952739489706e-22 
 338.844156139179  8.09628672584285e-13  2.28505358751008e-22 
 346.736850452507  7.93933717910031e-13  2.24075696895069e-22 
 354.813389233550  7.78360282508873e-13  2.19680332002706e-22 
 363.078054770076  7.62973453117103e-13  2.15337633813690e-22 
 371.535229097146  7.47845090419328e-13  2.11067883911508e-22 
 380.189396320534  7.33054217360068e-13  2.06893385318395e-22 
 389.045144994252  7.18687339053757e-13  2.02838552785060e-22 
 398.107170553468  7.04838654224173e-13  1.98929972466242e-22 
 407.380277804083  6.91610108186332e-13  1.95196416874044e-22 
 416.869383470305  6.79111227717139e-13  1.91668798272689e-22 
 426.579518801561  6.67458670357670e-13  1.88380041475955e-22 
 436.515832240133  6.56775417094171e-13  1.85364855993688e-22 
 446.683592150930  6.47189541008919e-13  1.82659388502261e-22 
 457.088189614841  6.38832498769708e-13  1.80300740643518e-22 
 467.735141287163  6.31836919804013e-13  1.78326345052852e-22 
 478.630092322602  6.26333911279551e-13  1.76773204731032e-22 
 489.778819368408  6.22449954308913e-13  1.75677017045242e-22 
 501.187233627234  6.20303532663900e-13  1.75071222235063e-22 
 512.861383991325  6.20001699624776e-13  1.74986034457970e-22 
 524.807460249731  6.21636837708160e-13  1.75447527271902e-22 
 537.031796370211  6.25283885641312e-13  1.76476850990993e-22 
 549.540873857581  6.30998286649003e-13  1.78089653620798e-22 
 562.341325190304  6.38814849741144e-13  1.80295759474075e-22 
 575.439937337111  6.48747619675111e-13  1.83099132469633e-22 
 588.843655355542  6.60790739394711e-13  1.86498119542590e-22 
 602.559586074309  6.74920183296611e-13  1.90485939832415e-22 
 616.595001861432  6.91096160881428e-13  1.95051363076837e-22 
 630.957344480142  7.09265950886498e-13  2.00179509502638e-22 
 645.654229034602  7.29366928598401e-13  2.05852704238495e-22 
 660.693448007541  7.51329587679659e-13  2.12051330179533e-22 
 676.082975391926  7.75080421132318e-13  2.18754641095403e-22 
 691.830970918878  8.00544600651700e-13  2.25941517837062e-22 
 707.945784384078  8.27648465629928e-13  2.33591170820101e-22 
 724.435960074928  8.56321885689278e-13  2.41683806813793e-22 
 741.310241300854  8.86500569046578e-13  2.50201280441773e-22 
 758.577575029119  9.18128316243243e-13  2.59127730263012e-22 
 776.247116628625  9.51159024749498e-13  2.68450144540819e-22 
 794.328234724213  9.85557935038087e-13  2.78158712928161e-22 
 812.830516164028  1.02130130141904e-12  2.88246733565793e-22 
 831.763771102598  1.05837369567580e-12  2.98709852074627e-22 
 851.138038202302  1.09676288848980e-12  3.09544616915803e-22 
 870.963589956004  1.13645365681048e-12  3.20746731615215e-22 
 891.250938133667  1.17742303601636e-12  3.32309714758293e-22 
 912.010839355828  1.21963924061705e-12  3.44224595374608e-22 
 933.254300796907  1.26306456825166e-12  3.56480732547163e-22 
 954.992586021350  1.30766052828986e-12  3.69067262881922e-22 
 977.237220955722  1.35339277329866e-12  3.81974492339186e-22 
 999.999999999909  1.40023426771145e-12  3.95194790542143e-22 
 1023.29299228066  1.44816643340760e-12  4.08722914099269e-22 
 1047.12854805080  1.49717884273427e-12  4.22555919964406e-22 
 1071.51930523751  1.54726821421559e-12  4.36692881990983e-22 
 1096.47819614308  1.59843728448079e-12  4.51134572550906e-22 
 1122.01845430186  1.65069387508777e-12  4.65883199159742e-22 
 1148.15362149677  1.70405028688865e-12  4.80942233545603e-22 
 1174.89755493942  1.75852306136873e-12  4.96316344290721e-22 
 1202.26443461730  1.81413312564299e-12  5.12011437754489e-22 
 1230.26877081226  1.87090636003776e-12  5.28034818264747e-22 
 1258.92541179405  1.92887468041371e-12  5.44395493586952e-22 
 1288.24955169301  1.98807781058646e-12  5.61104675162902e-22 
 1318.25673855628  2.04856604372882e-12  5.78176557474446e-22 
 1348.96288259152  2.11040447633066e-12  5.95629513014150e-22 
 1380.38426460275  2.17367947399515e-12  6.13487917157794e-22 
 1412.53754462262  2.23850852502463e-12  6.31784929188871e-22 
 1445.43977074578  2.30505514663418e-12  6.50566699350271e-22 
 1479.10838816806  2.37355094723496e-12  6.69898595587666e-22 
 1513.56124843606  2.44432654511952e-12  6.89873929877405e-22 
 1548.81661891233  2.51784929509436e-12  7.10624605993822e-22 
 1584.89319246096  2.59475180095040e-12  7.32329166719660e-22 
 1621.81009735877  2.67579603658811e-12  7.55202667580228e-22 
 1659.58690743739  2.76163733407362e-12  7.79430066067694e-22 
 1698.24365246157  2.85218231664557e-12  8.04985008013692e-22 
 1737.80082874920  2.94558721169478e-12  8.31347116687777e-22 
 1778.27941003874  3.03794246517541e-12  8.57412980019629e-22 
 1819.70085860980  3.12520747421849e-12  8.82042199405042e-22 
 1862.08713666268  3.20617714123278e-12  9.04894654407644e-22 
 1905.46071796305  3.28281948835430e-12  9.26525789293990e-22 
 1949.84459975784  3.35809066762684e-12  9.47769932943672e-22 
 1995.26231496867  3.43431318511007e-12  9.69282577310398e-22 
 2041.73794466931  3.51306965389107e-12  9.91510390828071e-22 
 2089.29613085382  3.59564783156486e-12  1.01481682345986e-21 
 2137.96208950200  3.68291678813115e-12  1.03944715697357e-21 
 2187.76162394932  3.77453839798271e-12  1.06530596056763e-21 
 2238.72113856810  3.86913553348668e-12  1.09200456094717e-21 
 2290.86765276753  3.96556909650355e-12  1.11922146501564e-21 
 2344.22881531967  4.06344196780374e-12  1.14684459192030e-21 
 2398.83291901923  4.16275644571821e-12  1.17487459033003e-21 
 2454.70891568476  4.26357826057697e-12  1.20333001162915e-21 
 2511.88643150931  4.36590542429857e-12  1.23221029471194e-21 
 2570.39578276858  4.46963666238852e-12  1.26148685639517e-21 
 2630.26799189509  4.57456680413522e-12  1.29110179037113e-21 
 2691.53480392662  4.68040007069804e-12  1.32097161756800e-21 
 2754.22870333786  4.78683841692624e-12  1.35101221928250e-21 
 2818.38293126414  4.89395615905596e-12  1.38124457014011e-21 
 2884.03150312628  5.00346687582386e-12  1.41215230163417e-21 
 2951.20922666605  5.12180464940620e-12  1.44555133544051e-21 
 3019.95172040167  5.26188903998346e-12  1.48508802060027e-21 
 3090.29543251324  5.42846250511273e-12  1.53210084351113e-21 
 3162.27766016802  5.60125577930953e-12  1.58086911277717e-21 
 3235.93656929592  5.76260850852282e-12  1.62640846250975e-21 
 3311.31121482553  5.91356842723661e-12  1.66901459980552e-21 
 3388.44156139163  6.06020897740479e-12  1.71040166113163e-21 
 3467.36850452492  6.20660370851282e-12  1.75171934377289e-21 
 3548.13389233534  6.35477639346136e-12  1.79353882679983e-21 
 3630.78054770059  6.50568450886708e-12  1.83613034340108e-21 
 3715.35229097129  6.65981485619773e-12  1.87963128587486e-21 
 3801.89396320516  6.81743213174864e-12  1.92411636071806e-21 
 3890.45144994235  6.97869374304257e-12  1.96962999380601e-21 
 3981.07170553450  7.14370568860653e-12  2.01620210160815e-21 
 4073.80277804064  7.31254963242567e-12  2.06385573254019e-21 
 4168.69383470285  7.48530527914545e-12  2.11261338202407e-21 
 4265.79518801542  7.66211322923847e-12  2.16251473240124e-21 
 4365.15832240114  7.84322282364281e-12  2.21363015635296e-21 
 4466.83592150909  8.02862536681303e-12  2.26595719969399e-21 
 4570.88189614819  8.21818565781428e-12  2.31945770402016e-21 
 4677.35141287141  8.41200815209452e-12  2.37416115029036e-21 
 4786.30092322580  8.61023250197724e-12  2.43010695324538e-21 
 4897.78819368386  8.81297378697923e-12  2.48732759232569e-21 
 5011.87233627211  9.02033584775631e-12  2.54585237497447e-21 
 5128.61383991301  9.23241995258936e-12  2.60570988262125e-21 
 5248.07460249707  9.44932803283780e-12  2.66692888383937e-21 
 5370.31796370186  9.67116382756850e-12  2.72953865740007e-21 
 5495.40873857556  9.89803329076875e-12  2.79356910720214e-21 
 5623.41325190279  1.01300447313657e-11  2.85905080179025e-21 
 5754.39937337084  1.03673088526371e-11  2.92601498547807e-21 
 5888.43655355514  1.06099387529820e-11  2.99449357856576e-21 
 6025.59586074281  1.08580499120969e-11  3.06451917343843e-21 
 6165.95001861404  1.11117601720534e-11  3.13612502922553e-21 
 6309.57344480113  1.13711897168991e-11  3.20934506604361e-21 
 6456.54229034572  1.16364610519384e-11  3.28421385914850e-21 
 6606.93448007511  1.19076989827894e-11  3.36076663302466e-21 
 6760.82975391895  1.21850305938601e-11  3.43903925531016e-21 
 6918.30970918847  1.24685852256886e-11  3.51906823040149e-21 
 7079.45784384047  1.27584944505234e-11  3.60089069256140e-21 
 7244.35960074895  1.30548920454934e-11  3.68454439834651e-21 
 7413.10241300820  1.33579139627099e-11  3.77006771816911e-21 
 7585.77575029084  1.36676982956470e-11  3.85749962680853e-21 
 7762.47116628590  1.39843852411455e-11  3.94687969268724e-21 
 7943.28234724177  1.43081170563775e-11  4.03824806572495e-21 
 8128.30516163991  1.46390380101045e-11  4.13164546358173e-21 
 8317.63771102560  1.49772943275396e-11  4.22711315609635e-21 
 8511.38038202263  1.53230341281091e-11  4.32469294772042e-21 
 8709.63589955964  1.56764073553775e-11  4.42442715774071e-21 
 8912.50938133626  1.60375656983711e-11  4.52635859807402e-21 
 9120.10839355786  1.64066625034962e-11  4.63053054840745e-21 
 9332.54300796864  1.67838526762082e-11  4.73698672844588e-21 
 9549.92586021306  1.71692925715376e-11  4.84577126701475e-21 
 9772.37220955678  1.75631398725326e-11  4.95692866775220e-21 
 10000.0000000000  1.79655534556177e-11  5.07050377110868e-21 