 0.00000000000000  0.00000000000000  0.00854859885521802 
 0.00000000000000  10.0000000000000  0.00141312498820312 
 0.00000000000000  20.0000000000000 -0.00576528596650258 
 0.00000000000000  30.0000000000000 -0.0127685216244916 
 0.00000000000000  40.0000000000000 -0.0193837922141041 
 0.00000000000000  50.0000000000000 -0.0254100960859632 
 0.00000000000000  60.0000000000000 -0.0306643270463793 
 0.00000000000000  70.0000000000000 -0.0349868379463894 
 0.00000000000000  80.0000000000000 -0.0382462914795927 
 0.00000000000000  90.0000000000000 -0.0403436507997459 
 0.00000000000000  100.000000000000 -0.0412151887052211 
 0.00000000000000  110.000000000000 -0.0408344239577800 
 0.00000000000000  120.000000000000 -0.0392129259015973 
 0.00000000000000  130.000000000000 -0.0363999629345925 
 0.00000000000000  140.000000000000 -0.0324810055130901 
 0.00000000000000  150.000000000000 -0.0275751291752543 
 0.00000000000000  160.000000000000 -0.0218313964911171 
 0.00000000000000  170.000000000000 -0.0154243278718169 
 0.00000000000000  180.000000000000 -0.00854859885521802 
 0.00000000000000  190.000000000000 -0.00141312498820311 
 0.00000000000000  200.000000000000  0.00576528596650258 
 0.00000000000000  210.000000000000  0.0127685216244916 
 0.00000000000000  220.000000000000  0.0193837922141041 
 0.00000000000000  230.000000000000  0.0254100960859632 
 0.00000000000000  240.000000000000  0.0306643270463793 
 0.00000000000000  250.000000000000  0.0349868379463894 
 0.00000000000000  260.000000000000  0.0382462914795927 
 0.00000000000000  270.000000000000  0.0403436507997459 
 0.00000000000000  280.000000000000  0.0412151887052211 
 0.00000000000000  290.000000000000  0.0408344239577800 
 0.00000000000000  300.000000000000  0.0392129259015973 
 0.00000000000000  310.000000000000  0.0363999629345925 
 0.00000000000000  320.000000000000  0.0324810055130901 
 0.00000000000000  330.000000000000  0.0275751291752543 
 0.00000000000000  340.000000000000  0.0218313964911170 
 0.00000000000000  350.000000000000  0.0154243278718169 
 0.00000000000000  360.000000000000  0.00854859885521803 

 10.0000000000000  0.00000000000000  0.00786060730386324 
 10.0000000000000  10.0000000000000  0.00119118037818748 
 10.0000000000000  20.0000000000000 -0.00551443996051314 
 10.0000000000000  30.0000000000000 -0.0120525068314548 
 10.0000000000000  40.0000000000000 -0.0182243643811855 
 10.0000000000000  50.0000000000000 -0.0238424838411672 
 10.0000000000000  60.0000000000000 -0.0287361614945140 
 10.0000000000000  70.0000000000000 -0.0327567054220493 
 10.0000000000000  80.0000000000000 -0.0357819534310284 
 10.0000000000000  90.0000000000000 -0.0377199848915478 
 10.0000000000000  100.000000000000 -0.0385119136983709 
 10.0000000000000  110.000000000000 -0.0381336774954375 
 10.0000000000000  120.000000000000 -0.0365967687983772 
 10.0000000000000  130.000000000000 -0.0339478858002368 
 10.0000000000000  140.000000000000 -0.0302675134705153 
 10.0000000000000  150.000000000000 -0.0256674780600930 
 10.0000000000000  160.000000000000 -0.0202875493171853 
 10.0000000000000  170.000000000000 -0.0142911936542703 
 10.0000000000000  180.000000000000 -0.00786060730386324 
 10.0000000000000  190.000000000000 -0.00119118037818748 
 10.0000000000000  200.000000000000  0.00551443996051314 
 10.0000000000000  210.000000000000  0.0120525068314548 
 10.0000000000000  220.000000000000  0.0182243643811855 
 10.0000000000000  230.000000000000  0.0238424838411672 
 10.0000000000000  240.000000000000  0.0287361614945140 
 10.0000000000000  250.000000000000  0.0327567054220493 
 10.0000000000000  260.000000000000  0.0357819534310284 
 10.0000000000000  270.000000000000  0.0377199848915478 
 10.0000000000000  280.000000000000  0.0385119136983709 
 10.0000000000000  290.000000000000  0.0381336774954375 
 10.0000000000000  300.000000000000  0.0365967687983772 
 10.0000000000000  310.000000000000  0.0339478858002368 
 10.0000000000000  320.000000000000  0.0302675134705153 
 10.0000000000000  330.000000000000  0.0256674780600930 
 10.0000000000000  340.000000000000  0.0202875493171853 
 10.0000000000000  350.000000000000  0.0142911936542703 
 10.0000000000000  360.000000000000  0.00786060730386325 

 20.0000000000000  0.00000000000000  0.00693377517723980 
 20.0000000000000  10.0000000000000  0.000933042355146976 
 20.0000000000000  20.0000000000000 -0.00509604048676478 
 20.0000000000000  30.0000000000000 -0.0109702827172071 
 20.0000000000000  40.0000000000000 -0.0165111984585180 
 20.0000000000000  50.0000000000000 -0.0215504297897364 
 20.0000000000000  60.0000000000000 -0.0259348622168372 
 20.0000000000000  70.0000000000000 -0.0295312769791530 
 20.0000000000000  80.0000000000000 -0.0322303988340045 
 20.0000000000000  90.0000000000000 -0.0339502163296534 
 20.0000000000000  100.000000000000 -0.0346384736817642 
 20.0000000000000  110.000000000000 -0.0342742585389681 
 20.0000000000000  120.000000000000 -0.0328686373940770 
 20.0000000000000  130.000000000000 -0.0304643193343000 
 20.0000000000000  140.000000000000 -0.0271343583472397 
 20.0000000000000  150.000000000000 -0.0229799336124463 
 20.0000000000000  160.000000000000 -0.0181272752232463 
 20.0000000000000  170.000000000000 -0.0127238287492317 
 20.0000000000000  180.000000000000 -0.00693377517723980 
 20.0000000000000  190.000000000000 -0.000933042355146970 
 20.0000000000000  200.000000000000  0.00509604048676477 
 20.0000000000000  210.000000000000  0.0109702827172071 
 20.0000000000000  220.000000000000  0.0165111984585180 
 20.0000000000000  230.000000000000  0.0215504297897363 
 20.0000000000000  240.000000000000  0.0259348622168372 
 20.0000000000000  250.000000000000  0.0295312769791530 
 20.0000000000000  260.000000000000  0.0322303988340045 
 20.0000000000000  270.000000000000  0.0339502163296534 
 20.0000000000000  280.000000000000  0.0346384736817642 
 20.0000000000000  290.000000000000  0.0342742585389681 
 20.0000000000000  300.000000000000  0.0328686373940770 
 20.0000000000000  310.000000000000  0.0304643193343000 
 20.0000000000000  320.000000000000  0.0271343583472397 
 20.0000000000000  330.000000000000  0.0229799336124463 
 20.0000000000000  340.000000000000  0.0181272752232463 
 20.0000000000000  350.000000000000  0.0127238287492317 
 20.0000000000000  360.000000000000  0.00693377517723981 

 30.0000000000000  0.00000000000000  0.00579626380051546 
 30.0000000000000  10.0000000000000  0.000646554312287538 
 30.0000000000000  20.0000000000000 -0.00452280040154697 
 30.0000000000000  30.0000000000000 -0.00955473211382791 
 30.0000000000000  40.0000000000000 -0.0142963481257579 
 30.0000000000000  50.0000000000000 -0.0186035768341880 
 30.0000000000000  60.0000000000000 -0.0223455452743754 
 30.0000000000000  70.0000000000000 -0.0254085556287924 
 30.0000000000000  80.0000000000000 -0.0276995398777780 
 30.0000000000000  90.0000000000000 -0.0291488876242209 
 30.0000000000000  100.000000000000 -0.0297125611702506 
 30.0000000000000  110.000000000000 -0.0293734335804037 
 30.0000000000000  120.000000000000 -0.0281418090748909 
 30.0000000000000  130.000000000000 -0.0260551099410799 
 30.0000000000000  140.000000000000 -0.0231767394762311 
 30.0000000000000  150.000000000000 -0.0195941555103930 
 30.0000000000000  160.000000000000 -0.0154162130444927 
 30.0000000000000  170.000000000000 -0.0107698567462157 
 30.0000000000000  180.000000000000 -0.00579626380051547 
 30.0000000000000  190.000000000000 -0.000646554312287534 
 30.0000000000000  200.000000000000  0.00452280040154697 
 30.0000000000000  210.000000000000  0.00955473211382792 
 30.0000000000000  220.000000000000  0.0142963481257579 
 30.0000000000000  230.000000000000  0.0186035768341880 
 30.0000000000000  240.000000000000  0.0223455452743754 
 30.0000000000000  250.000000000000  0.0254085556287924 
 30.0000000000000  260.000000000000  0.0276995398777780 
 30.0000000000000  270.000000000000  0.0291488876242209 
 30.0000000000000  280.000000000000  0.0297125611702506 
 30.0000000000000  290.000000000000  0.0293734335804037 
 30.0000000000000  300.000000000000  0.0281418090748909 
 30.0000000000000  310.000000000000  0.0260551099410799 
 30.0000000000000  320.000000000000  0.0231767394762311 
 30.0000000000000  330.000000000000  0.0195941555103930 
 30.0000000000000  340.000000000000  0.0154162130444927 
 30.0000000000000  350.000000000000  0.0107698567462157 
 30.0000000000000  360.000000000000  0.00579626380051547 

 40.0000000000000  0.00000000000000  0.00448263588126347 
 40.0000000000000  10.0000000000000  0.000340421043821515 
 40.0000000000000  20.0000000000000 -0.00381213731477560 
 40.0000000000000  30.0000000000000 -0.00784886581009781 
 40.0000000000000  40.0000000000000 -0.0116471104894979 
 40.0000000000000  50.0000000000000 -0.0150914636103970 
 40.0000000000000  60.0000000000000 -0.0180772702461431 
 40.0000000000000  70.0000000000000 -0.0205138081730004 
 40.0000000000000  80.0000000000000 -0.0223270444190088 
 40.0000000000000  90.0000000000000 -0.0234618847183752 
 40.0000000000000  100.000000000000 -0.0238838475228604 
 40.0000000000000  110.000000000000 -0.0235801117061734 
 40.0000000000000  120.000000000000 -0.0225599061274066 
 40.0000000000000  130.000000000000 -0.0208542292168219 
 40.0000000000000  140.000000000000 -0.0185149071042332 
 40.0000000000000  150.000000000000 -0.0156130189082774 
 40.0000000000000  160.000000000000 -0.0122367370333624 
 40.0000000000000  170.000000000000 -0.00848864809577644 
 40.0000000000000  180.000000000000 -0.00448263588126347 
 40.0000000000000  190.000000000000 -0.000340421043821512 
 40.0000000000000  200.000000000000  0.00381213731477559 
 40.0000000000000  210.000000000000  0.00784886581009781 
 40.0000000000000  220.000000000000  0.0116471104894979 
 40.0000000000000  230.000000000000  0.0150914636103970 
 40.0000000000000  240.000000000000  0.0180772702461431 
 40.0000000000000  250.000000000000  0.0205138081730004 
 40.0000000000000  260.000000000000  0.0223270444190088 
 40.0000000000000  270.000000000000  0.0234618847183752 
 40.0000000000000  280.000000000000  0.0238838475228604 
 40.0000000000000  290.000000000000  0.0235801117061734 
 40.0000000000000  300.000000000000  0.0225599061274066 
 40.0000000000000  310.000000000000  0.0208542292168219 
 40.0000000000000  320.000000000000  0.0185149071042332 
 40.0000000000000  330.000000000000  0.0156130189082774 
 40.0000000000000  340.000000000000  0.0122367370333624 
 40.0000000000000  350.000000000000  0.00848864809577644 
 40.0000000000000  360.000000000000  0.00448263588126347 

 50.0000000000000  0.00000000000000  0.00303280533908249 
 50.0000000000000  10.0000000000000  2.39442542003341e-05 
 50.0000000000000  20.0000000000000 -0.00298564436472932 
 50.0000000000000  30.0000000000000 -0.00590451569044562 
 50.0000000000000  40.0000000000000 -0.00864398129473684 
 50.0000000000000  50.0000000000000 -0.0111208039014531 
 50.0000000000000  60.0000000000000 -0.0132597265090219 
 50.0000000000000  70.0000000000000 -0.0149957590363595 
 50.0000000000000  80.0000000000000 -0.0162761530135976 
 50.0000000000000  90.0000000000000 -0.0170620043176483 
 50.0000000000000  100.000000000000 -0.0173294352542980 
 50.0000000000000  110.000000000000 -0.0170703200698632 
 50.0000000000000  120.000000000000 -0.0162925318481044 
 50.0000000000000  130.000000000000 -0.0150197032905599 
 50.0000000000000  140.000000000000 -0.0132905086488683 
 50.0000000000000  150.000000000000 -0.0111574886272027 
 50.0000000000000  160.000000000000 -0.00868545395956117 
 50.0000000000000  170.000000000000 -0.00594951616841018 
 50.0000000000000  180.000000000000 -0.00303280533908249 
 50.0000000000000  190.000000000000 -2.39442542003319e-05 
 50.0000000000000  200.000000000000  0.00298564436472932 
 50.0000000000000  210.000000000000  0.00590451569044563 
 50.0000000000000  220.000000000000  0.00864398129473684 
 50.0000000000000  230.000000000000  0.0111208039014531 
 50.0000000000000  240.000000000000  0.0132597265090219 
 50.0000000000000  250.000000000000  0.0149957590363596 
 50.0000000000000  260.000000000000  0.0162761530135976 
 50.0000000000000  270.000000000000  0.0170620043176483 
 50.0000000000000  280.000000000000  0.0173294352542980 
 50.0000000000000  290.000000000000  0.0170703200698632 
 50.0000000000000  300.000000000000  0.0162925318481044 
 50.0000000000000  310.000000000000  0.0150197032905599 
 50.0000000000000  320.000000000000  0.0132905086488683 
 50.0000000000000  330.000000000000  0.0111574886272027 
 50.0000000000000  340.000000000000  0.00868545395956116 
 50.0000000000000  350.000000000000  0.00594951616841018 
 50.0000000000000  360.000000000000  0.00303280533908250 

 60.0000000000000  0.00000000000000  0.00149082454134704 
 60.0000000000000  10.0000000000000 -0.000293260069468347 
 60.0000000000000  20.0000000000000 -0.00206843412146969 
 60.0000000000000  30.0000000000000 -0.00378075984936835 
 60.0000000000000  40.0000000000000 -0.00537820910240075 
 60.0000000000000  50.0000000000000 -0.00681224419336182 
 60.0000000000000  60.0000000000000 -0.00803929269166949 
 60.0000000000000  70.0000000000000 -0.00902207134961916 
 60.0000000000000  80.0000000000000 -0.00973071893499905 
 60.0000000000000  90.0000000000000 -0.0101437035495204 
 60.0000000000000  100.000000000000 -0.0102484768646512 
 60.0000000000000  110.000000000000 -0.0100418553962290 
 60.0000000000000  120.000000000000 -0.00953011723301653 
 60.0000000000000  130.000000000000 -0.00872881128015082 
 60.0000000000000  140.000000000000 -0.00766228481352936 
 60.0000000000000  150.000000000000 -0.00636294370015200 
 60.0000000000000  160.000000000000 -0.00487026776225040 
 60.0000000000000  170.000000000000 -0.00322961120286722 
 60.0000000000000  180.000000000000 -0.00149082454134704 
 60.0000000000000  190.000000000000  0.000293260069468348 
 60.0000000000000  200.000000000000  0.00206843412146969 
 60.0000000000000  210.000000000000  0.00378075984936836 
 60.0000000000000  220.000000000000  0.00537820910240075 
 60.0000000000000  230.000000000000  0.00681224419336182 
 60.0000000000000  240.000000000000  0.00803929269166949 
 60.0000000000000  250.000000000000  0.00902207134961916 
 60.0000000000000  260.000000000000  0.00973071893499905 
 60.0000000000000  270.000000000000  0.0101437035495204 
 60.0000000000000  280.000000000000  0.0102484768646512 
 60.0000000000000  290.000000000000  0.0100418553962290 
 60.0000000000000  300.000000000000  0.00953011723301653 
 60.0000000000000  310.000000000000  0.00872881128015082 
 60.0000000000000  320.000000000000  0.00766228481352936 
 60.0000000000000  330.000000000000  0.00636294370015200 
 60.0000000000000  340.000000000000  0.00487026776225040 
 60.0000000000000  350.000000000000  0.00322961120286722 
 60.0000000000000  360.000000000000  0.00149082454134704 

 70.0000000000000  0.00000000000000 -9.64542056836187e-05 
 70.0000000000000  10.0000000000000 -0.000601553834322987 
 70.0000000000000  20.0000000000000 -0.00108837555410738 
 70.0000000000000  30.0000000000000 -0.00154212753342482 
 70.0000000000000  40.0000000000000 -0.00194902274799334 
 70.0000000000000  50.0000000000000 -0.00229669789261717 
 70.0000000000000  60.0000000000000 -0.00257458903395904 
 70.0000000000000  70.0000000000000 -0.00277425259030898 
 70.0000000000000  80.0000000000000 -0.00288962188554193 
 70.0000000000000  90.0000000000000 -0.00291719148200192 
 70.0000000000000  100.000000000000 -0.00285612369145139 
 70.0000000000000  110.000000000000 -0.00270827402780444 
 70.0000000000000  120.000000000000 -0.00247813482827543 
 70.0000000000000  130.000000000000 -0.00217269875598600 
 70.0000000000000  140.000000000000 -0.00180124633143455 
 70.0000000000000  150.000000000000 -0.00137506394857710 
 70.0000000000000  160.000000000000 -0.000907100943458053 
 70.0000000000000  170.000000000000 -0.000411576135187263 
 70.0000000000000  180.000000000000  9.64542056836184e-05 
 70.0000000000000  190.000000000000  0.000601553834322987 
 70.0000000000000  200.000000000000  0.00108837555410738 
 70.0000000000000  210.000000000000  0.00154212753342482 
 70.0000000000000  220.000000000000  0.00194902274799334 
 70.0000000000000  230.000000000000  0.00229669789261717 
 70.0000000000000  240.000000000000  0.00257458903395904 
 70.0000000000000  250.000000000000  0.00277425259030898 
 70.0000000000000  260.000000000000  0.00288962188554193 
 70.0000000000000  270.000000000000  0.00291719148200192 
 70.0000000000000  280.000000000000  0.00285612369145139 
 70.0000000000000  290.000000000000  0.00270827402780443 
 70.0000000000000  300.000000000000  0.00247813482827543 
 70.0000000000000  310.000000000000  0.00217269875598600 
 70.0000000000000  320.000000000000  0.00180124633143456 
 70.0000000000000  330.000000000000  0.00137506394857710 
 70.0000000000000  340.000000000000  0.000907100943458053 
 70.0000000000000  350.000000000000  0.000411576135187263 
 70.0000000000000  360.000000000000 -9.64542056836180e-05 

 80.0000000000000  0.00000000000000 -0.00168080224048277 
 80.0000000000000  10.0000000000000 -0.000891569690322652 
 80.0000000000000  20.0000000000000 -7.52472462781149e-05 
 80.0000000000000  30.0000000000000  0.000743361547267639 
 80.0000000000000  40.0000000000000  0.00153938367635876 
 80.0000000000000  50.0000000000000  0.00228863241140944 
 80.0000000000000  60.0000000000000  0.00296834220874333 
 80.0000000000000  70.0000000000000  0.00355786043011819 
 80.0000000000000  80.0000000000000  0.00403927486268815 
 80.0000000000000  90.0000000000000  0.00439795797252703 
 80.0000000000000  100.000000000000  0.00462301135484480 
 80.0000000000000  110.000000000000  0.00470759687650223 
 80.0000000000000  120.000000000000  0.00464914444922610 
 80.0000000000000  130.000000000000  0.00444943012044084 
 80.0000000000000  140.000000000000  0.00411452210896626 
 80.0000000000000  150.000000000000  0.00365459642525939 
 80.0000000000000  160.000000000000  0.00308362767848604 
 80.0000000000000  170.000000000000  0.00241896446509279 
 80.0000000000000  180.000000000000  0.00168080224048277 
 80.0000000000000  190.000000000000  0.000891569690322652 
 80.0000000000000  200.000000000000  7.52472462781151e-05 
 80.0000000000000  210.000000000000 -0.000743361547267640 
 80.0000000000000  220.000000000000 -0.00153938367635876 
 80.0000000000000  230.000000000000 -0.00228863241140944 
 80.0000000000000  240.000000000000 -0.00296834220874333 
 80.0000000000000  250.000000000000 -0.00355786043011819 
 80.0000000000000  260.000000000000 -0.00403927486268815 
 80.0000000000000  270.000000000000 -0.00439795797252703 
 80.0000000000000  280.000000000000 -0.00462301135484480 
 80.0000000000000  290.000000000000 -0.00470759687650223 
 80.0000000000000  300.000000000000 -0.00464914444922610 
 80.0000000000000  310.000000000000 -0.00444943012044084 
 80.0000000000000  320.000000000000 -0.00411452210896626 
 80.0000000000000  330.000000000000 -0.00365459642525940 
 80.0000000000000  340.000000000000 -0.00308362767848604 
 80.0000000000000  350.000000000000 -0.00241896446509279 
 80.0000000000000  360.000000000000 -0.00168080224048277 

 90.0000000000000  0.00000000000000 -0.00321407994973182 
 90.0000000000000  10.0000000000000 -0.00115449565243789 
 90.0000000000000  20.0000000000000  0.000940167411052366 
 90.0000000000000  30.0000000000000  0.00300626396350547 
 90.0000000000000  40.0000000000000  0.00498101670667042 
 90.0000000000000  50.0000000000000  0.00680442377771926 
 90.0000000000000  60.0000000000000  0.00842108187548668 
 90.0000000000000  70.0000000000000  0.00978186966174046 
 90.0000000000000  80.0000000000000  0.0108454402881872 
 90.0000000000000  90.0000000000000  0.0115794776995349 
 90.0000000000000  100.000000000000  0.0119616785404807 
 90.0000000000000  110.000000000000  0.0119804298318753 
 90.0000000000000  120.000000000000  0.0116351618252185 
 90.0000000000000  130.000000000000  0.0109363653141784 
 90.0000000000000  140.000000000000  0.00990527287713479 
 90.0000000000000  150.000000000000  0.00857321373602940 
 90.0000000000000  160.000000000000  0.00698066183381024 
 90.0000000000000  170.000000000000  0.00517600605415607 
 90.0000000000000  180.000000000000  0.00321407994973182 
 90.0000000000000  190.000000000000  0.00115449565243789 
 90.0000000000000  200.000000000000 -0.000940167411052365 
 90.0000000000000  210.000000000000 -0.00300626396350547 
 90.0000000000000  220.000000000000 -0.00498101670667042 
 90.0000000000000  230.000000000000 -0.00680442377771926 
 90.0000000000000  240.000000000000 -0.00842108187548667 
 90.0000000000000  250.000000000000 -0.00978186966174047 
 90.0000000000000  260.000000000000 -0.0108454402881872 
 90.0000000000000  270.000000000000 -0.0115794776995349 
 90.0000000000000  280.000000000000 -0.0119616785404807 
 90.0000000000000  290.000000000000 -0.0119804298318753 
 90.0000000000000  300.000000000000 -0.0116351618252185 
 90.0000000000000  310.000000000000 -0.0109363653141784 
 90.0000000000000  320.000000000000 -0.00990527287713479 
 90.0000000000000  330.000000000000 -0.00857321373602941 
 90.0000000000000  340.000000000000 -0.00698066183381023 
 90.0000000000000  350.000000000000 -0.00517600605415607 
 90.0000000000000  360.000000000000 -0.00321407994973182 

 100.000000000000  0.00000000000000 -0.00464969946611120 
 100.000000000000  10.0000000000000 -0.00138234284835680 
 100.000000000000  20.0000000000000  0.00192701555734569 
 100.000000000000  30.0000000000000  0.00517782257045515 
 100.000000000000  40.0000000000000  0.00827130406486597 
 100.000000000000  50.0000000000000  0.0111134661707477 
 100.000000000000  60.0000000000000  0.0136179512307164 
 100.000000000000  70.0000000000000  0.0157086617335556 
 100.000000000000  80.0000000000000  0.0173220724985872 
 100.000000000000  90.0000000000000  0.0184091608561408 
 100.000000000000  100.000000000000  0.0189368961765654 
 100.000000000000  110.000000000000  0.0188892434891969 
 100.000000000000  120.000000000000  0.0182676506968276 
 100.000000000000  130.000000000000  0.0170910045819124 
 100.000000000000  140.000000000000  0.0153950569412415 
 100.000000000000  150.000000000000  0.0132313382856856 
 100.000000000000  160.000000000000  0.0106655921116994 
 100.000000000000  170.000000000000  0.00777577731844926 
 100.000000000000  180.000000000000  0.00464969946611120 
 100.000000000000  190.000000000000  0.00138234284835680 
 100.000000000000  200.000000000000 -0.00192701555734569 
 100.000000000000  210.000000000000 -0.00517782257045515 
 100.000000000000  220.000000000000 -0.00827130406486597 
 100.000000000000  230.000000000000 -0.0111134661707476 
 100.000000000000  240.000000000000 -0.0136179512307164 
 100.000000000000  250.000000000000 -0.0157086617335556 
 100.000000000000  260.000000000000 -0.0173220724985872 
 100.000000000000  270.000000000000 -0.0184091608561408 
 100.000000000000  280.000000000000 -0.0189368961765654 
 100.000000000000  290.000000000000 -0.0188892434891969 
 100.000000000000  300.000000000000 -0.0182676506968276 
 100.000000000000  310.000000000000 -0.0170910045819124 
 100.000000000000  320.000000000000 -0.0153950569412415 
 100.000000000000  330.000000000000 -0.0132313382856856 
 100.000000000000  340.000000000000 -0.0106655921116994 
 100.000000000000  350.000000000000 -0.00777577731844927 
 100.000000000000  360.000000000000 -0.00464969946611120 

 110.000000000000  0.00000000000000 -0.00594404021707425 
 110.000000000000  10.0000000000000 -0.00156818825632762 
 110.000000000000  20.0000000000000  0.00285531231104598 
 110.000000000000  30.0000000000000  0.00719205565870619 
 110.000000000000  40.0000000000000  0.0113102720345324 
 110.000000000000  50.0000000000000  0.0150848315178631 
 110.000000000000  60.0000000000000  0.0184010460288166 
 110.000000000000  70.0000000000000  0.0211581540675631 
 110.000000000000  80.0000000000000  0.0232723823015093 
 110.000000000000  90.0000000000000  0.0246794909756177 
 110.000000000000  100.000000000000  0.0253367258048570 
 110.000000000000  110.000000000000  0.0252241170415177 
 110.000000000000  120.000000000000  0.0243450862458909 
 110.000000000000  130.000000000000  0.0227263423238907 
 110.000000000000  140.000000000000  0.0204170699904633 
 110.000000000000  150.000000000000  0.0174874353169115 
 110.000000000000  160.000000000000  0.0140264537703247 
 110.000000000000  170.000000000000  0.0101392855236546 
 110.000000000000  180.000000000000  0.00594404021707425 
 110.000000000000  190.000000000000  0.00156818825632761 
 110.000000000000  200.000000000000 -0.00285531231104598 
 110.000000000000  210.000000000000 -0.00719205565870620 
 110.000000000000  220.000000000000 -0.0113102720345324 
 110.000000000000  230.000000000000 -0.0150848315178631 
 110.000000000000  240.000000000000 -0.0184010460288166 
 110.000000000000  250.000000000000 -0.0211581540675631 
 110.000000000000  260.000000000000 -0.0232723823015093 
 110.000000000000  270.000000000000 -0.0246794909756177 
 110.000000000000  280.000000000000 -0.0253367258048570 
 110.000000000000  290.000000000000 -0.0252241170415177 
 110.000000000000  300.000000000000 -0.0243450862458909 
 110.000000000000  310.000000000000 -0.0227263423238907 
 110.000000000000  320.000000000000 -0.0204170699904633 
 110.000000000000  330.000000000000 -0.0174874353169115 
 110.000000000000  340.000000000000 -0.0140264537703247 
 110.000000000000  350.000000000000 -0.0101392855236546 
 110.000000000000  360.000000000000 -0.00594404021707425 

 120.000000000000  0.00000000000000 -0.00705777431387097 
 120.000000000000  10.0000000000000 -0.00170638505767147 
 120.000000000000  20.0000000000000  0.00369685184503289 
 120.000000000000  30.0000000000000  0.00898776177512321 
 120.000000000000  40.0000000000000  0.0140055831117033 
 120.000000000000  50.0000000000000  0.0185978518926013 
 120.000000000000  60.0000000000000  0.0226250343547098 
 120.000000000000  70.0000000000000  0.0259647665967702 
 120.000000000000  80.0000000000000  0.0285155725445936 
 120.000000000000  90.0000000000000  0.0301999472502255 
 120.000000000000  100.000000000000  0.0309667118405700 
 120.000000000000  110.000000000000  0.0307925685615510 
 120.000000000000  120.000000000000  0.0296828086685808 
 120.000000000000  130.000000000000  0.0276711516544417 
 120.000000000000  140.000000000000  0.0248187206995608 
 120.000000000000  150.000000000000  0.0212121854751023 
 120.000000000000  160.000000000000  0.0169611287288667 
 120.000000000000  170.000000000000  0.0121947166689496 
 120.000000000000  180.000000000000  0.00705777431387098 
 120.000000000000  190.000000000000  0.00170638505767146 
 120.000000000000  200.000000000000 -0.00369685184503288 
 120.000000000000  210.000000000000 -0.00898776177512321 
 120.000000000000  220.000000000000 -0.0140055831117033 
 120.000000000000  230.000000000000 -0.0185978518926013 
 120.000000000000  240.000000000000 -0.0226250343547098 
 120.000000000000  250.000000000000 -0.0259647665967702 
 120.000000000000  260.000000000000 -0.0285155725445936 
 120.000000000000  270.000000000000 -0.0301999472502255 
 120.000000000000  280.000000000000 -0.0309667118405700 
 120.000000000000  290.000000000000 -0.0307925685615510 
 120.000000000000  300.000000000000 -0.0296828086685808 
 120.000000000000  310.000000000000 -0.0276711516544417 
 120.000000000000  320.000000000000 -0.0248187206995608 
 120.000000000000  330.000000000000 -0.0212121854751023 
 120.000000000000  340.000000000000 -0.0169611287288666 
 120.000000000000  350.000000000000 -0.0121947166689496 
 120.000000000000  360.000000000000 -0.00705777431387098 

 130.000000000000  0.00000000000000 -0.00795706150954686 
 130.000000000000  10.0000000000000 -0.00179273421251047 
 130.000000000000  20.0000000000000  0.00442606440640577 
 130.000000000000  30.0000000000000  0.0105103792980300 
 130.000000000000  40.0000000000000  0.0162753416331922 
 130.000000000000  50.0000000000000  0.0215457859485500 
 130.000000000000  60.0000000000000  0.0261615724605550 
 130.000000000000  70.0000000000000  0.0299824528317404 
 130.000000000000  80.0000000000000  0.0328923315454865 
 130.000000000000  90.0000000000000  0.0348027934095459 
 130.000000000000  100.000000000000  0.0356557900069195 
 130.000000000000  110.000000000000  0.0354254034676331 
 130.000000000000  120.000000000000  0.0341186339701018 
 130.000000000000  130.000000000000  0.0317751870442508 
 130.000000000000  140.000000000000  0.0284662671390807 
 130.000000000000  150.000000000000  0.0242924141115159 
 130.000000000000  160.000000000000  0.0193804483737273 
 130.000000000000  170.000000000000  0.0138796175190831 
 130.000000000000  180.000000000000  0.00795706150954686 
 130.000000000000  190.000000000000  0.00179273421251046 
 130.000000000000  200.000000000000 -0.00442606440640577 
 130.000000000000  210.000000000000 -0.0105103792980300 
 130.000000000000  220.000000000000 -0.0162753416331922 
 130.000000000000  230.000000000000 -0.0215457859485500 
 130.000000000000  240.000000000000 -0.0261615724605550 
 130.000000000000  250.000000000000 -0.0299824528317404 
 130.000000000000  260.000000000000 -0.0328923315454865 
 130.000000000000  270.000000000000 -0.0348027934095459 
 130.000000000000  280.000000000000 -0.0356557900069195 
 130.000000000000  290.000000000000 -0.0354254034676331 
 130.000000000000  300.000000000000 -0.0341186339701018 
 130.000000000000  310.000000000000 -0.0317751870442508 
 130.000000000000  320.000000000000 -0.0284662671390807 
 130.000000000000  330.000000000000 -0.0242924141115159 
 130.000000000000  340.000000000000 -0.0193804483737273 
 130.000000000000  350.000000000000 -0.0138796175190831 
 130.000000000000  360.000000000000 -0.00795706150954687 

 140.000000000000  0.00000000000000 -0.00861457741772256 
 140.000000000000  10.0000000000000 -0.00182461204546962 
 140.000000000000  20.0000000000000  0.00502079324048666 
 140.000000000000  30.0000000000000  0.0117136442644747 
 140.000000000000  40.0000000000000  0.0180505821348767 
 140.000000000000  50.0000000000000  0.0238390622011458 
 140.000000000000  60.0000000000000  0.0289032044255806 
 140.000000000000  70.0000000000000  0.0330891374092712 
 140.000000000000  80.0000000000000  0.0362696736966926 
 140.000000000000  90.0000000000000  0.0383481743021804 
 140.000000000000  100.000000000000  0.0392614850366090 
 140.000000000000  110.000000000000  0.0389818554154703 
 140.000000000000  120.000000000000  0.0375177818433031 
 140.000000000000  130.000000000000  0.0349137494547409 
 140.000000000000  140.000000000000  0.0312488804562060 
 140.000000000000  150.000000000000  0.0266345300377057 
 140.000000000000  160.000000000000  0.0212109029017323 
 140.000000000000  170.000000000000  0.0151427932143245 
 140.000000000000  180.000000000000  0.00861457741772257 
 140.000000000000  190.000000000000  0.00182461204546962 
 140.000000000000  200.000000000000 -0.00502079324048666 
 140.000000000000  210.000000000000 -0.0117136442644747 
 140.000000000000  220.000000000000 -0.0180505821348767 
 140.000000000000  230.000000000000 -0.0238390622011458 
 140.000000000000  240.000000000000 -0.0289032044255806 
 140.000000000000  250.000000000000 -0.0330891374092712 
 140.000000000000  260.000000000000 -0.0362696736966926 
 140.000000000000  270.000000000000 -0.0383481743021804 
 140.000000000000  280.000000000000 -0.0392614850366090 
 140.000000000000  290.000000000000 -0.0389818554154703 
 140.000000000000  300.000000000000 -0.0375177818433031 
 140.000000000000  310.000000000000 -0.0349137494547409 
 140.000000000000  320.000000000000 -0.0312488804562060 
 140.000000000000  330.000000000000 -0.0266345300377057 
 140.000000000000  340.000000000000 -0.0212109029017323 
 140.000000000000  350.000000000000 -0.0151427932143245 
 140.000000000000  360.000000000000 -0.00861457741772257 

 150.000000000000  0.00000000000000 -0.00901034375024728 
 150.000000000000  10.0000000000000 -0.00180104996472543 
 150.000000000000  20.0000000000000  0.00546296781259934 
 150.000000000000  30.0000000000000  0.0125609960773334 
 150.000000000000  40.0000000000000  0.0192773648324284 
 150.000000000000  50.0000000000000  0.0254080006119073 
 150.000000000000  60.0000000000000  0.0307666271498621 
 150.000000000000  70.0000000000000  0.0351904252905328 
 150.000000000000  80.0000000000000  0.0385449801659652 
 150.000000000000  90.0000000000000  0.0407283653237558 
 150.000000000000  100.000000000000  0.0416742397107313 
 150.000000000000  110.000000000000  0.0413538634122791 
 150.000000000000  120.000000000000  0.0397769709001093 
 150.000000000000  130.000000000000  0.0369914752552583 
 150.000000000000  140.000000000000  0.0330820123533658 
 150.000000000000  150.000000000000  0.0281673692464224 
 150.000000000000  160.000000000000  0.0223968748783029 
 150.000000000000  170.000000000000  0.0159458628003718 
 150.000000000000  180.000000000000  0.00901034375024729 
 150.000000000000  190.000000000000  0.00180104996472543 
 150.000000000000  200.000000000000 -0.00546296781259934 
 150.000000000000  210.000000000000 -0.0125609960773334 
 150.000000000000  220.000000000000 -0.0192773648324284 
 150.000000000000  230.000000000000 -0.0254080006119073 
 150.000000000000  240.000000000000 -0.0307666271498620 
 150.000000000000  250.000000000000 -0.0351904252905328 
 150.000000000000  260.000000000000 -0.0385449801659652 
 150.000000000000  270.000000000000 -0.0407283653237558 
 150.000000000000  280.000000000000 -0.0416742397107313 
 150.000000000000  290.000000000000 -0.0413538634122791 
 150.000000000000  300.000000000000 -0.0397769709001093 
 150.000000000000  310.000000000000 -0.0369914752552583 
 150.000000000000  320.000000000000 -0.0330820123533658 
 150.000000000000  330.000000000000 -0.0281673692464224 
 150.000000000000  340.000000000000 -0.0223968748783029 
 150.000000000000  350.000000000000 -0.0159458628003718 
 150.000000000000  360.000000000000 -0.00901034375024729 

 160.000000000000  0.00000000000000 -0.00913233534737467 
 160.000000000000  10.0000000000000 -0.00172276389217832 
 160.000000000000  20.0000000000000  0.00573915287212128 
 160.000000000000  30.0000000000000  0.0130266883805530 
 160.000000000000  40.0000000000000  0.0199184145543639 
 160.000000000000  50.0000000000000  0.0262049297811446 
 160.000000000000  60.0000000000000  0.0316952214768595 
 160.000000000000  70.0000000000000  0.0362224699065560 
 160.000000000000  80.0000000000000  0.0396491169175960 
 160.000000000000  90.0000000000000  0.0418710455745160 
 160.000000000000  100.000000000000  0.0428207436994258 
 160.000000000000  110.000000000000  0.0424693551953703 
 160.000000000000  120.000000000000  0.0408275568242342 
 160.000000000000  130.000000000000  0.0379452337987343 
 160.000000000000  140.000000000000  0.0339099640454747 
 160.000000000000  150.000000000000  0.0288443571939631 
 160.000000000000  160.000000000000  0.0229023291450619 
 160.000000000000  170.000000000000  0.0162644254142257 
 160.000000000000  180.000000000000  0.00913233534737467 
 160.000000000000  190.000000000000  0.00172276389217831 
 160.000000000000  200.000000000000 -0.00573915287212128 
 160.000000000000  210.000000000000 -0.0130266883805530 
 160.000000000000  220.000000000000 -0.0199184145543639 
 160.000000000000  230.000000000000 -0.0262049297811446 
 160.000000000000  240.000000000000 -0.0316952214768595 
 160.000000000000  250.000000000000 -0.0362224699065560 
 160.000000000000  260.000000000000 -0.0396491169175960 
 160.000000000000  270.000000000000 -0.0418710455745160 
 160.000000000000  280.000000000000 -0.0428207436994258 
 160.000000000000  290.000000000000 -0.0424693551953703 
 160.000000000000  300.000000000000 -0.0408275568242342 
 160.000000000000  310.000000000000 -0.0379452337987343 
 160.000000000000  320.000000000000 -0.0339099640454747 
 160.000000000000  330.000000000000 -0.0288443571939631 
 160.000000000000  340.000000000000 -0.0229023291450619 
 160.000000000000  350.000000000000 -0.0162644254142257 
 160.000000000000  360.000000000000 -0.00913233534737468 

 170.000000000000  0.00000000000000 -0.00897684555615674 
 170.000000000000  10.0000000000000 -0.00159213251052795 
 170.000000000000  20.0000000000000  0.00584095667577530 
 170.000000000000  30.0000000000000  0.0130965713491518 
 170.000000000000  40.0000000000000  0.0199542533292692 
 170.000000000000  50.0000000000000  0.0262056354193162 
 170.000000000000  60.0000000000000  0.0316607725378386 
 170.000000000000  70.0000000000000  0.0361539131039227 
 170.000000000000  80.0000000000000  0.0395485353151068 
 170.000000000000  90.0000000000000  0.0417414952932660 
 170.000000000000  100.000000000000  0.0426661610591550 
 170.000000000000  110.000000000000  0.0422944371113809 
 170.000000000000  120.000000000000  0.0406376180939953 
 170.000000000000  130.000000000000  0.0377460456144506 
 170.000000000000  140.000000000000  0.0337075786393315 
 170.000000000000  150.000000000000  0.0286449239441142 
 170.000000000000  160.000000000000  0.0227119077298858 
 170.000000000000  170.000000000000  0.0160888016920647 
 170.000000000000  180.000000000000  0.00897684555615674 
 170.000000000000  190.000000000000  0.00159213251052794 
 170.000000000000  200.000000000000 -0.00584095667577530 
 170.000000000000  210.000000000000 -0.0130965713491518 
 170.000000000000  220.000000000000 -0.0199542533292692 
 170.000000000000  230.000000000000 -0.0262056354193162 
 170.000000000000  240.000000000000 -0.0316607725378385 
 170.000000000000  250.000000000000 -0.0361539131039227 
 170.000000000000  260.000000000000 -0.0395485353151068 
 170.000000000000  270.000000000000 -0.0417414952932660 
 170.000000000000  280.000000000000 -0.0426661610591550 
 170.000000000000  290.000000000000 -0.0422944371113809 
 170.000000000000  300.000000000000 -0.0406376180939953 
 170.000000000000  310.000000000000 -0.0377460456144506 
 170.000000000000  320.000000000000 -0.0337075786393316 
 170.000000000000  330.000000000000 -0.0286449239441142 
 170.000000000000  340.000000000000 -0.0227119077298858 
 170.000000000000  350.000000000000 -0.0160888016920647 
 170.000000000000  360.000000000000 -0.00897684555615675 

 180.000000000000  0.00000000000000 -0.00854859885521802 
 180.000000000000  10.0000000000000 -0.00141312498820312 
 180.000000000000  20.0000000000000  0.00576528596650258 
 180.000000000000  30.0000000000000  0.0127685216244916 
 180.000000000000  40.0000000000000  0.0193837922141041 
 180.000000000000  50.0000000000000  0.0254100960859632 
 180.000000000000  60.0000000000000  0.0306643270463793 
 180.000000000000  70.0000000000000  0.0349868379463894 
 180.000000000000  80.0000000000000  0.0382462914795927 
 180.000000000000  90.0000000000000  0.0403436507997459 
 180.000000000000  100.000000000000  0.0412151887052211 
 180.000000000000  110.000000000000  0.0408344239577800 
 180.000000000000  120.000000000000  0.0392129259015973 
 180.000000000000  130.000000000000  0.0363999629345925 
 180.000000000000  140.000000000000  0.0324810055130901 
 180.000000000000  150.000000000000  0.0275751291752543 
 180.000000000000  160.000000000000  0.0218313964911171 
 180.000000000000  170.000000000000  0.0154243278718169 
 180.000000000000  180.000000000000  0.00854859885521802 
 180.000000000000  190.000000000000  0.00141312498820311 
 180.000000000000  200.000000000000 -0.00576528596650258 
 180.000000000000  210.000000000000 -0.0127685216244916 
 180.000000000000  220.000000000000 -0.0193837922141041 
 180.000000000000  230.000000000000 -0.0254100960859632 
 180.000000000000  240.000000000000 -0.0306643270463793 
 180.000000000000  250.000000000000 -0.0349868379463894 
 180.000000000000  260.000000000000 -0.0382462914795927 
 180.000000000000  270.000000000000 -0.0403436507997459 
 180.000000000000  280.000000000000 -0.0412151887052211 
 180.000000000000  290.000000000000 -0.0408344239577800 
 180.000000000000  300.000000000000 -0.0392129259015973 
 180.000000000000  310.000000000000 -0.0363999629345925 
 180.000000000000  320.000000000000 -0.0324810055130901 
 180.000000000000  330.000000000000 -0.0275751291752543 
 180.000000000000  340.000000000000 -0.0218313964911170 
 180.000000000000  350.000000000000 -0.0154243278718169 
 180.000000000000  360.000000000000 -0.00854859885521803 

 190.000000000000  0.00000000000000 -0.00786060730386324 
 190.000000000000  10.0000000000000 -0.00119118037818748 
 190.000000000000  20.0000000000000  0.00551443996051315 
 190.000000000000  30.0000000000000  0.0120525068314548 
 190.000000000000  40.0000000000000  0.0182243643811855 
 190.000000000000  50.0000000000000  0.0238424838411672 
 190.000000000000  60.0000000000000  0.0287361614945140 
 190.000000000000  70.0000000000000  0.0327567054220493 
 190.000000000000  80.0000000000000  0.0357819534310284 
 190.000000000000  90.0000000000000  0.0377199848915478 
 190.000000000000  100.000000000000  0.0385119136983709 
 190.000000000000  110.000000000000  0.0381336774954375 
 190.000000000000  120.000000000000  0.0365967687983772 
 190.000000000000  130.000000000000  0.0339478858002368 
 190.000000000000  140.000000000000  0.0302675134705153 
 190.000000000000  150.000000000000  0.0256674780600930 
 190.000000000000  160.000000000000  0.0202875493171853 
 190.000000000000  170.000000000000  0.0142911936542703 
 190.000000000000  180.000000000000  0.00786060730386324 
 190.000000000000  190.000000000000  0.00119118037818748 
 190.000000000000  200.000000000000 -0.00551443996051314 
 190.000000000000  210.000000000000 -0.0120525068314548 
 190.000000000000  220.000000000000 -0.0182243643811855 
 190.000000000000  230.000000000000 -0.0238424838411672 
 190.000000000000  240.000000000000 -0.0287361614945140 
 190.000000000000  250.000000000000 -0.0327567054220493 
 190.000000000000  260.000000000000 -0.0357819534310284 
 190.000000000000  270.000000000000 -0.0377199848915478 
 190.000000000000  280.000000000000 -0.0385119136983709 
 190.000000000000  290.000000000000 -0.0381336774954375 
 190.000000000000  300.000000000000 -0.0365967687983772 
 190.000000000000  310.000000000000 -0.0339478858002368 
 190.000000000000  320.000000000000 -0.0302675134705153 
 190.000000000000  330.000000000000 -0.0256674780600930 
 190.000000000000  340.000000000000 -0.0202875493171853 
 190.000000000000  350.000000000000 -0.0142911936542703 
 190.000000000000  360.000000000000 -0.00786060730386324 

 200.000000000000  0.00000000000000 -0.00693377517723980 
 200.000000000000  10.0000000000000 -0.000933042355146974 
 200.000000000000  20.0000000000000  0.00509604048676478 
 200.000000000000  30.0000000000000  0.0109702827172071 
 200.000000000000  40.0000000000000  0.0165111984585180 
 200.000000000000  50.0000000000000  0.0215504297897364 
 200.000000000000  60.0000000000000  0.0259348622168372 
 200.000000000000  70.0000000000000  0.0295312769791530 
 200.000000000000  80.0000000000000  0.0322303988340045 
 200.000000000000  90.0000000000000  0.0339502163296534 
 200.000000000000  100.000000000000  0.0346384736817642 
 200.000000000000  110.000000000000  0.0342742585389681 
 200.000000000000  120.000000000000  0.0328686373940770 
 200.000000000000  130.000000000000  0.0304643193343000 
 200.000000000000  140.000000000000  0.0271343583472397 
 200.000000000000  150.000000000000  0.0229799336124463 
 200.000000000000  160.000000000000  0.0181272752232463 
 200.000000000000  170.000000000000  0.0127238287492317 
 200.000000000000  180.000000000000  0.00693377517723980 
 200.000000000000  190.000000000000  0.000933042355146969 
 200.000000000000  200.000000000000 -0.00509604048676478 
 200.000000000000  210.000000000000 -0.0109702827172071 
 200.000000000000  220.000000000000 -0.0165111984585180 
 200.000000000000  230.000000000000 -0.0215504297897363 
 200.000000000000  240.000000000000 -0.0259348622168372 
 200.000000000000  250.000000000000 -0.0295312769791530 
 200.000000000000  260.000000000000 -0.0322303988340045 
 200.000000000000  270.000000000000 -0.0339502163296534 
 200.000000000000  280.000000000000 -0.0346384736817642 
 200.000000000000  290.000000000000 -0.0342742585389681 
 200.000000000000  300.000000000000 -0.0328686373940770 
 200.000000000000  310.000000000000 -0.0304643193343000 
 200.000000000000  320.000000000000 -0.0271343583472397 
 200.000000000000  330.000000000000 -0.0229799336124463 
 200.000000000000  340.000000000000 -0.0181272752232463 
 200.000000000000  350.000000000000 -0.0127238287492317 
 200.000000000000  360.000000000000 -0.00693377517723981 

 210.000000000000  0.00000000000000 -0.00579626380051546 
 210.000000000000  10.0000000000000 -0.000646554312287540 
 210.000000000000  20.0000000000000  0.00452280040154697 
 210.000000000000  30.0000000000000  0.00955473211382791 
 210.000000000000  40.0000000000000  0.0142963481257579 
 210.000000000000  50.0000000000000  0.0186035768341880 
 210.000000000000  60.0000000000000  0.0223455452743754 
 210.000000000000  70.0000000000000  0.0254085556287924 
 210.000000000000  80.0000000000000  0.0276995398777780 
 210.000000000000  90.0000000000000  0.0291488876242209 
 210.000000000000  100.000000000000  0.0297125611702506 
 210.000000000000  110.000000000000  0.0293734335804037 
 210.000000000000  120.000000000000  0.0281418090748908 
 210.000000000000  130.000000000000  0.0260551099410799 
 210.000000000000  140.000000000000  0.0231767394762310 
 210.000000000000  150.000000000000  0.0195941555103930 
 210.000000000000  160.000000000000  0.0154162130444927 
 210.000000000000  170.000000000000  0.0107698567462157 
 210.000000000000  180.000000000000  0.00579626380051547 
 210.000000000000  190.000000000000  0.000646554312287536 
 210.000000000000  200.000000000000 -0.00452280040154697 
 210.000000000000  210.000000000000 -0.00955473211382791 
 210.000000000000  220.000000000000 -0.0142963481257579 
 210.000000000000  230.000000000000 -0.0186035768341880 
 210.000000000000  240.000000000000 -0.0223455452743754 
 210.000000000000  250.000000000000 -0.0254085556287924 
 210.000000000000  260.000000000000 -0.0276995398777780 
 210.000000000000  270.000000000000 -0.0291488876242209 
 210.000000000000  280.000000000000 -0.0297125611702506 
 210.000000000000  290.000000000000 -0.0293734335804037 
 210.000000000000  300.000000000000 -0.0281418090748908 
 210.000000000000  310.000000000000 -0.0260551099410799 
 210.000000000000  320.000000000000 -0.0231767394762311 
 210.000000000000  330.000000000000 -0.0195941555103930 
 210.000000000000  340.000000000000 -0.0154162130444927 
 210.000000000000  350.000000000000 -0.0107698567462157 
 210.000000000000  360.000000000000 -0.00579626380051547 

 220.000000000000  0.00000000000000 -0.00448263588126347 
 220.000000000000  10.0000000000000 -0.000340421043821515 
 220.000000000000  20.0000000000000  0.00381213731477560 
 220.000000000000  30.0000000000000  0.00784886581009781 
 220.000000000000  40.0000000000000  0.0116471104894979 
 220.000000000000  50.0000000000000  0.0150914636103970 
 220.000000000000  60.0000000000000  0.0180772702461431 
 220.000000000000  70.0000000000000  0.0205138081730004 
 220.000000000000  80.0000000000000  0.0223270444190088 
 220.000000000000  90.0000000000000  0.0234618847183752 
 220.000000000000  100.000000000000  0.0238838475228604 
 220.000000000000  110.000000000000  0.0235801117061734 
 220.000000000000  120.000000000000  0.0225599061274066 
 220.000000000000  130.000000000000  0.0208542292168219 
 220.000000000000  140.000000000000  0.0185149071042332 
 220.000000000000  150.000000000000  0.0156130189082774 
 220.000000000000  160.000000000000  0.0122367370333624 
 220.000000000000  170.000000000000  0.00848864809577644 
 220.000000000000  180.000000000000  0.00448263588126347 
 220.000000000000  190.000000000000  0.000340421043821512 
 220.000000000000  200.000000000000 -0.00381213731477559 
 220.000000000000  210.000000000000 -0.00784886581009781 
 220.000000000000  220.000000000000 -0.0116471104894979 
 220.000000000000  230.000000000000 -0.0150914636103970 
 220.000000000000  240.000000000000 -0.0180772702461431 
 220.000000000000  250.000000000000 -0.0205138081730004 
 220.000000000000  260.000000000000 -0.0223270444190088 
 220.000000000000  270.000000000000 -0.0234618847183752 
 220.000000000000  280.000000000000 -0.0238838475228604 
 220.000000000000  290.000000000000 -0.0235801117061734 
 220.000000000000  300.000000000000 -0.0225599061274066 
 220.000000000000  310.000000000000 -0.0208542292168219 
 220.000000000000  320.000000000000 -0.0185149071042332 
 220.000000000000  330.000000000000 -0.0156130189082774 
 220.000000000000  340.000000000000 -0.0122367370333624 
 220.000000000000  350.000000000000 -0.00848864809577644 
 220.000000000000  360.000000000000 -0.00448263588126347 

 230.000000000000  0.00000000000000 -0.00303280533908249 
 230.000000000000  10.0000000000000 -2.39442542003328e-05 
 230.000000000000  20.0000000000000  0.00298564436472932 
 230.000000000000  30.0000000000000  0.00590451569044563 
 230.000000000000  40.0000000000000  0.00864398129473685 
 230.000000000000  50.0000000000000  0.0111208039014531 
 230.000000000000  60.0000000000000  0.0132597265090219 
 230.000000000000  70.0000000000000  0.0149957590363596 
 230.000000000000  80.0000000000000  0.0162761530135976 
 230.000000000000  90.0000000000000  0.0170620043176483 
 230.000000000000  100.000000000000  0.0173294352542980 
 230.000000000000  110.000000000000  0.0170703200698633 
 230.000000000000  120.000000000000  0.0162925318481044 
 230.000000000000  130.000000000000  0.0150197032905599 
 230.000000000000  140.000000000000  0.0132905086488683 
 230.000000000000  150.000000000000  0.0111574886272027 
 230.000000000000  160.000000000000  0.00868545395956117 
 230.000000000000  170.000000000000  0.00594951616841018 
 230.000000000000  180.000000000000  0.00303280533908249 
 230.000000000000  190.000000000000  2.39442542003306e-05 
 230.000000000000  200.000000000000 -0.00298564436472932 
 230.000000000000  210.000000000000 -0.00590451569044563 
 230.000000000000  220.000000000000 -0.00864398129473685 
 230.000000000000  230.000000000000 -0.0111208039014531 
 230.000000000000  240.000000000000 -0.0132597265090219 
 230.000000000000  250.000000000000 -0.0149957590363596 
 230.000000000000  260.000000000000 -0.0162761530135976 
 230.000000000000  270.000000000000 -0.0170620043176483 
 230.000000000000  280.000000000000 -0.0173294352542980 
 230.000000000000  290.000000000000 -0.0170703200698633 
 230.000000000000  300.000000000000 -0.0162925318481044 
 230.000000000000  310.000000000000 -0.0150197032905599 
 230.000000000000  320.000000000000 -0.0132905086488683 
 230.000000000000  330.000000000000 -0.0111574886272027 
 230.000000000000  340.000000000000 -0.00868545395956117 
 230.000000000000  350.000000000000 -0.00594951616841018 
 230.000000000000  360.000000000000 -0.00303280533908250 

 240.000000000000  0.00000000000000 -0.00149082454134705 
 240.000000000000  10.0000000000000  0.000293260069468343 
 240.000000000000  20.0000000000000  0.00206843412146970 
 240.000000000000  30.0000000000000  0.00378075984936836 
 240.000000000000  40.0000000000000  0.00537820910240076 
 240.000000000000  50.0000000000000  0.00681224419336183 
 240.000000000000  60.0000000000000  0.00803929269166950 
 240.000000000000  70.0000000000000  0.00902207134961918 
 240.000000000000  80.0000000000000  0.00973071893499907 
 240.000000000000  90.0000000000000  0.0101437035495204 
 240.000000000000  100.000000000000  0.0102484768646512 
 240.000000000000  110.000000000000  0.0100418553962291 
 240.000000000000  120.000000000000  0.00953011723301655 
 240.000000000000  130.000000000000  0.00872881128015084 
 240.000000000000  140.000000000000  0.00766228481352937 
 240.000000000000  150.000000000000  0.00636294370015201 
 240.000000000000  160.000000000000  0.00487026776225041 
 240.000000000000  170.000000000000  0.00322961120286723 
 240.000000000000  180.000000000000  0.00149082454134705 
 240.000000000000  190.000000000000 -0.000293260069468344 
 240.000000000000  200.000000000000 -0.00206843412146969 
 240.000000000000  210.000000000000 -0.00378075984936836 
 240.000000000000  220.000000000000 -0.00537820910240076 
 240.000000000000  230.000000000000 -0.00681224419336183 
 240.000000000000  240.000000000000 -0.00803929269166950 
 240.000000000000  250.000000000000 -0.00902207134961918 
 240.000000000000  260.000000000000 -0.00973071893499907 
 240.000000000000  270.000000000000 -0.0101437035495204 
 240.000000000000  280.000000000000 -0.0102484768646512 
 240.000000000000  290.000000000000 -0.0100418553962291 
 240.000000000000  300.000000000000 -0.00953011723301655 
 240.000000000000  310.000000000000 -0.00872881128015084 
 240.000000000000  320.000000000000 -0.00766228481352937 
 240.000000000000  330.000000000000 -0.00636294370015202 
 240.000000000000  340.000000000000 -0.00487026776225041 
 240.000000000000  350.000000000000 -0.00322961120286723 
 240.000000000000  360.000000000000 -0.00149082454134705 

 250.000000000000  0.00000000000000  9.64542056836257e-05 
 250.000000000000  10.0000000000000  0.000601553834322991 
 250.000000000000  20.0000000000000  0.00108837555410738 
 250.000000000000  30.0000000000000  0.00154212753342482 
 250.000000000000  40.0000000000000  0.00194902274799333 
 250.000000000000  50.0000000000000  0.00229669789261717 
 250.000000000000  60.0000000000000  0.00257458903395904 
 250.000000000000  70.0000000000000  0.00277425259030897 
 250.000000000000  80.0000000000000  0.00288962188554192 
 250.000000000000  90.0000000000000  0.00291719148200190 
 250.000000000000  100.000000000000  0.00285612369145137 
 250.000000000000  110.000000000000  0.00270827402780442 
 250.000000000000  120.000000000000  0.00247813482827541 
 250.000000000000  130.000000000000  0.00217269875598598 
 250.000000000000  140.000000000000  0.00180124633143454 
 250.000000000000  150.000000000000  0.00137506394857708 
 250.000000000000  160.000000000000  0.000907100943458042 
 250.000000000000  170.000000000000  0.000411576135187253 
 250.000000000000  180.000000000000 -9.64542056836253e-05 
 250.000000000000  190.000000000000 -0.000601553834322991 
 250.000000000000  200.000000000000 -0.00108837555410738 
 250.000000000000  210.000000000000 -0.00154212753342482 
 250.000000000000  220.000000000000 -0.00194902274799333 
 250.000000000000  230.000000000000 -0.00229669789261717 
 250.000000000000  240.000000000000 -0.00257458903395904 
 250.000000000000  250.000000000000 -0.00277425259030897 
 250.000000000000  260.000000000000 -0.00288962188554192 
 250.000000000000  270.000000000000 -0.00291719148200190 
 250.000000000000  280.000000000000 -0.00285612369145138 
 250.000000000000  290.000000000000 -0.00270827402780442 
 250.000000000000  300.000000000000 -0.00247813482827541 
 250.000000000000  310.000000000000 -0.00217269875598598 
 250.000000000000  320.000000000000 -0.00180124633143454 
 250.000000000000  330.000000000000 -0.00137506394857708 
 250.000000000000  340.000000000000 -0.000907100943458041 
 250.000000000000  350.000000000000 -0.000411576135187254 
 250.000000000000  360.000000000000  9.64542056836250e-05 

 260.000000000000  0.00000000000000  0.00168080224048277 
 260.000000000000  10.0000000000000  0.000891569690322652 
 260.000000000000  20.0000000000000  7.52472462781138e-05 
 260.000000000000  30.0000000000000 -0.000743361547267640 
 260.000000000000  40.0000000000000 -0.00153938367635876 
 260.000000000000  50.0000000000000 -0.00228863241140945 
 260.000000000000  60.0000000000000 -0.00296834220874334 
 260.000000000000  70.0000000000000 -0.00355786043011819 
 260.000000000000  80.0000000000000 -0.00403927486268815 
 260.000000000000  90.0000000000000 -0.00439795797252704 
 260.000000000000  100.000000000000 -0.00462301135484480 
 260.000000000000  110.000000000000 -0.00470759687650223 
 260.000000000000  120.000000000000 -0.00464914444922610 
 260.000000000000  130.000000000000 -0.00444943012044084 
 260.000000000000  140.000000000000 -0.00411452210896627 
 260.000000000000  150.000000000000 -0.00365459642525940 
 260.000000000000  160.000000000000 -0.00308362767848604 
 260.000000000000  170.000000000000 -0.00241896446509279 
 260.000000000000  180.000000000000 -0.00168080224048277 
 260.000000000000  190.000000000000 -0.000891569690322651 
 260.000000000000  200.000000000000 -7.52472462781140e-05 
 260.000000000000  210.000000000000  0.000743361547267642 
 260.000000000000  220.000000000000  0.00153938367635876 
 260.000000000000  230.000000000000  0.00228863241140945 
 260.000000000000  240.000000000000  0.00296834220874333 
 260.000000000000  250.000000000000  0.00355786043011819 
 260.000000000000  260.000000000000  0.00403927486268815 
 260.000000000000  270.000000000000  0.00439795797252704 
 260.000000000000  280.000000000000  0.00462301135484481 
 260.000000000000  290.000000000000  0.00470759687650223 
 260.000000000000  300.000000000000  0.00464914444922610 
 260.000000000000  310.000000000000  0.00444943012044084 
 260.000000000000  320.000000000000  0.00411452210896627 
 260.000000000000  330.000000000000  0.00365459642525940 
 260.000000000000  340.000000000000  0.00308362767848604 
 260.000000000000  350.000000000000  0.00241896446509279 
 260.000000000000  360.000000000000  0.00168080224048277 

 270.000000000000  0.00000000000000  0.00321407994973182 
 270.000000000000  10.0000000000000  0.00115449565243789 
 270.000000000000  20.0000000000000 -0.000940167411052367 
 270.000000000000  30.0000000000000 -0.00300626396350547 
 270.000000000000  40.0000000000000 -0.00498101670667042 
 270.000000000000  50.0000000000000 -0.00680442377771926 
 270.000000000000  60.0000000000000 -0.00842108187548667 
 270.000000000000  70.0000000000000 -0.00978186966174046 
 270.000000000000  80.0000000000000 -0.0108454402881872 
 270.000000000000  90.0000000000000 -0.0115794776995349 
 270.000000000000  100.000000000000 -0.0119616785404806 
 270.000000000000  110.000000000000 -0.0119804298318753 
 270.000000000000  120.000000000000 -0.0116351618252185 
 270.000000000000  130.000000000000 -0.0109363653141784 
 270.000000000000  140.000000000000 -0.00990527287713478 
 270.000000000000  150.000000000000 -0.00857321373602939 
 270.000000000000  160.000000000000 -0.00698066183381023 
 270.000000000000  170.000000000000 -0.00517600605415607 
 270.000000000000  180.000000000000 -0.00321407994973182 
 270.000000000000  190.000000000000 -0.00115449565243789 
 270.000000000000  200.000000000000  0.000940167411052367 
 270.000000000000  210.000000000000  0.00300626396350547 
 270.000000000000  220.000000000000  0.00498101670667042 
 270.000000000000  230.000000000000  0.00680442377771926 
 270.000000000000  240.000000000000  0.00842108187548667 
 270.000000000000  250.000000000000  0.00978186966174046 
 270.000000000000  260.000000000000  0.0108454402881872 
 270.000000000000  270.000000000000  0.0115794776995349 
 270.000000000000  280.000000000000  0.0119616785404806 
 270.000000000000  290.000000000000  0.0119804298318753 
 270.000000000000  300.000000000000  0.0116351618252185 
 270.000000000000  310.000000000000  0.0109363653141784 
 270.000000000000  320.000000000000  0.00990527287713478 
 270.000000000000  330.000000000000  0.00857321373602940 
 270.000000000000  340.000000000000  0.00698066183381023 
 270.000000000000  350.000000000000  0.00517600605415607 
 270.000000000000  360.000000000000  0.00321407994973182 

 280.000000000000  0.00000000000000  0.00464969946611120 
 280.000000000000  10.0000000000000  0.00138234284835680 
 280.000000000000  20.0000000000000 -0.00192701555734568 
 280.000000000000  30.0000000000000 -0.00517782257045514 
 280.000000000000  40.0000000000000 -0.00827130406486596 
 280.000000000000  50.0000000000000 -0.0111134661707476 
 280.000000000000  60.0000000000000 -0.0136179512307164 
 280.000000000000  70.0000000000000 -0.0157086617335556 
 280.000000000000  80.0000000000000 -0.0173220724985872 
 280.000000000000  90.0000000000000 -0.0184091608561408 
 280.000000000000  100.000000000000 -0.0189368961765654 
 280.000000000000  110.000000000000 -0.0188892434891969 
 280.000000000000  120.000000000000 -0.0182676506968276 
 280.000000000000  130.000000000000 -0.0170910045819124 
 280.000000000000  140.000000000000 -0.0153950569412415 
 280.000000000000  150.000000000000 -0.0132313382856856 
 280.000000000000  160.000000000000 -0.0106655921116994 
 280.000000000000  170.000000000000 -0.00777577731844926 
 280.000000000000  180.000000000000 -0.00464969946611120 
 280.000000000000  190.000000000000 -0.00138234284835680 
 280.000000000000  200.000000000000  0.00192701555734568 
 280.000000000000  210.000000000000  0.00517782257045514 
 280.000000000000  220.000000000000  0.00827130406486596 
 280.000000000000  230.000000000000  0.0111134661707476 
 280.000000000000  240.000000000000  0.0136179512307164 
 280.000000000000  250.000000000000  0.0157086617335556 
 280.000000000000  260.000000000000  0.0173220724985872 
 280.000000000000  270.000000000000  0.0184091608561408 
 280.000000000000  280.000000000000  0.0189368961765654 
 280.000000000000  290.000000000000  0.0188892434891969 
 280.000000000000  300.000000000000  0.0182676506968276 
 280.000000000000  310.000000000000  0.0170910045819124 
 280.000000000000  320.000000000000  0.0153950569412415 
 280.000000000000  330.000000000000  0.0132313382856856 
 280.000000000000  340.000000000000  0.0106655921116994 
 280.000000000000  350.000000000000  0.00777577731844926 
 280.000000000000  360.000000000000  0.00464969946611120 

 290.000000000000  0.00000000000000  0.00594404021707425 
 290.000000000000  10.0000000000000  0.00156818825632761 
 290.000000000000  20.0000000000000 -0.00285531231104599 
 290.000000000000  30.0000000000000 -0.00719205565870620 
 290.000000000000  40.0000000000000 -0.0113102720345324 
 290.000000000000  50.0000000000000 -0.0150848315178631 
 290.000000000000  60.0000000000000 -0.0184010460288166 
 290.000000000000  70.0000000000000 -0.0211581540675631 
 290.000000000000  80.0000000000000 -0.0232723823015093 
 290.000000000000  90.0000000000000 -0.0246794909756177 
 290.000000000000  100.000000000000 -0.0253367258048570 
 290.000000000000  110.000000000000 -0.0252241170415177 
 290.000000000000  120.000000000000 -0.0243450862458909 
 290.000000000000  130.000000000000 -0.0227263423238907 
 290.000000000000  140.000000000000 -0.0204170699904633 
 290.000000000000  150.000000000000 -0.0174874353169115 
 290.000000000000  160.000000000000 -0.0140264537703247 
 290.000000000000  170.000000000000 -0.0101392855236546 
 290.000000000000  180.000000000000 -0.00594404021707425 
 290.000000000000  190.000000000000 -0.00156818825632761 
 290.000000000000  200.000000000000  0.00285531231104598 
 290.000000000000  210.000000000000  0.00719205565870620 
 290.000000000000  220.000000000000  0.0113102720345324 
 290.000000000000  230.000000000000  0.0150848315178631 
 290.000000000000  240.000000000000  0.0184010460288166 
 290.000000000000  250.000000000000  0.0211581540675631 
 290.000000000000  260.000000000000  0.0232723823015093 
 290.000000000000  270.000000000000  0.0246794909756177 
 290.000000000000  280.000000000000  0.0253367258048570 
 290.000000000000  290.000000000000  0.0252241170415177 
 290.000000000000  300.000000000000  0.0243450862458909 
 290.000000000000  310.000000000000  0.0227263423238907 
 290.000000000000  320.000000000000  0.0204170699904633 
 290.000000000000  330.000000000000  0.0174874353169115 
 290.000000000000  340.000000000000  0.0140264537703247 
 290.000000000000  350.000000000000  0.0101392855236546 
 290.000000000000  360.000000000000  0.00594404021707425 

 300.000000000000  0.00000000000000  0.00705777431387098 
 300.000000000000  10.0000000000000  0.00170638505767147 
 300.000000000000  20.0000000000000 -0.00369685184503289 
 300.000000000000  30.0000000000000 -0.00898776177512321 
 300.000000000000  40.0000000000000 -0.0140055831117033 
 300.000000000000  50.0000000000000 -0.0185978518926013 
 300.000000000000  60.0000000000000 -0.0226250343547098 
 300.000000000000  70.0000000000000 -0.0259647665967702 
 300.000000000000  80.0000000000000 -0.0285155725445937 
 300.000000000000  90.0000000000000 -0.0301999472502255 
 300.000000000000  100.000000000000 -0.0309667118405700 
 300.000000000000  110.000000000000 -0.0307925685615510 
 300.000000000000  120.000000000000 -0.0296828086685808 
 300.000000000000  130.000000000000 -0.0276711516544417 
 300.000000000000  140.000000000000 -0.0248187206995608 
 300.000000000000  150.000000000000 -0.0212121854751023 
 300.000000000000  160.000000000000 -0.0169611287288667 
 300.000000000000  170.000000000000 -0.0121947166689496 
 300.000000000000  180.000000000000 -0.00705777431387098 
 300.000000000000  190.000000000000 -0.00170638505767146 
 300.000000000000  200.000000000000  0.00369685184503288 
 300.000000000000  210.000000000000  0.00898776177512322 
 300.000000000000  220.000000000000  0.0140055831117033 
 300.000000000000  230.000000000000  0.0185978518926013 
 300.000000000000  240.000000000000  0.0226250343547098 
 300.000000000000  250.000000000000  0.0259647665967702 
 300.000000000000  260.000000000000  0.0285155725445937 
 300.000000000000  270.000000000000  0.0301999472502255 
 300.000000000000  280.000000000000  0.0309667118405700 
 300.000000000000  290.000000000000  0.0307925685615510 
 300.000000000000  300.000000000000  0.0296828086685808 
 300.000000000000  310.000000000000  0.0276711516544417 
 300.000000000000  320.000000000000  0.0248187206995608 
 300.000000000000  330.000000000000  0.0212121854751023 
 300.000000000000  340.000000000000  0.0169611287288667 
 300.000000000000  350.000000000000  0.0121947166689496 
 300.000000000000  360.000000000000  0.00705777431387098 

 310.000000000000  0.00000000000000  0.00795706150954686 
 310.000000000000  10.0000000000000  0.00179273421251047 
 310.000000000000  20.0000000000000 -0.00442606440640577 
 310.000000000000  30.0000000000000 -0.0105103792980300 
 310.000000000000  40.0000000000000 -0.0162753416331922 
 310.000000000000  50.0000000000000 -0.0215457859485500 
 310.000000000000  60.0000000000000 -0.0261615724605550 
 310.000000000000  70.0000000000000 -0.0299824528317403 
 310.000000000000  80.0000000000000 -0.0328923315454865 
 310.000000000000  90.0000000000000 -0.0348027934095459 
 310.000000000000  100.000000000000 -0.0356557900069195 
 310.000000000000  110.000000000000 -0.0354254034676331 
 310.000000000000  120.000000000000 -0.0341186339701018 
 310.000000000000  130.000000000000 -0.0317751870442508 
 310.000000000000  140.000000000000 -0.0284662671390807 
 310.000000000000  150.000000000000 -0.0242924141115159 
 310.000000000000  160.000000000000 -0.0193804483737273 
 310.000000000000  170.000000000000 -0.0138796175190831 
 310.000000000000  180.000000000000 -0.00795706150954686 
 310.000000000000  190.000000000000 -0.00179273421251047 
 310.000000000000  200.000000000000  0.00442606440640576 
 310.000000000000  210.000000000000  0.0105103792980300 
 310.000000000000  220.000000000000  0.0162753416331922 
 310.000000000000  230.000000000000  0.0215457859485500 
 310.000000000000  240.000000000000  0.0261615724605549 
 310.000000000000  250.000000000000  0.0299824528317404 
 310.000000000000  260.000000000000  0.0328923315454865 
 310.000000000000  270.000000000000  0.0348027934095459 
 310.000000000000  280.000000000000  0.0356557900069195 
 310.000000000000  290.000000000000  0.0354254034676331 
 310.000000000000  300.000000000000  0.0341186339701018 
 310.000000000000  310.000000000000  0.0317751870442508 
 310.000000000000  320.000000000000  0.0284662671390807 
 310.000000000000  330.000000000000  0.0242924141115159 
 310.000000000000  340.000000000000  0.0193804483737273 
 310.000000000000  350.000000000000  0.0138796175190831 
 310.000000000000  360.000000000000  0.00795706150954687 

 320.000000000000  0.00000000000000  0.00861457741772256 
 320.000000000000  10.0000000000000  0.00182461204546962 
 320.000000000000  20.0000000000000 -0.00502079324048666 
 320.000000000000  30.0000000000000 -0.0117136442644747 
 320.000000000000  40.0000000000000 -0.0180505821348767 
 320.000000000000  50.0000000000000 -0.0238390622011458 
 320.000000000000  60.0000000000000 -0.0289032044255806 
 320.000000000000  70.0000000000000 -0.0330891374092712 
 320.000000000000  80.0000000000000 -0.0362696736966926 
 320.000000000000  90.0000000000000 -0.0383481743021804 
 320.000000000000  100.000000000000 -0.0392614850366090 
 320.000000000000  110.000000000000 -0.0389818554154703 
 320.000000000000  120.000000000000 -0.0375177818433031 
 320.000000000000  130.000000000000 -0.0349137494547409 
 320.000000000000  140.000000000000 -0.0312488804562060 
 320.000000000000  150.000000000000 -0.0266345300377057 
 320.000000000000  160.000000000000 -0.0212109029017323 
 320.000000000000  170.000000000000 -0.0151427932143245 
 320.000000000000  180.000000000000 -0.00861457741772257 
 320.000000000000  190.000000000000 -0.00182461204546962 
 320.000000000000  200.000000000000  0.00502079324048666 
 320.000000000000  210.000000000000  0.0117136442644747 
 320.000000000000  220.000000000000  0.0180505821348767 
 320.000000000000  230.000000000000  0.0238390622011458 
 320.000000000000  240.000000000000  0.0289032044255806 
 320.000000000000  250.000000000000  0.0330891374092712 
 320.000000000000  260.000000000000  0.0362696736966926 
 320.000000000000  270.000000000000  0.0383481743021804 
 320.000000000000  280.000000000000  0.0392614850366090 
 320.000000000000  290.000000000000  0.0389818554154703 
 320.000000000000  300.000000000000  0.0375177818433031 
 320.000000000000  310.000000000000  0.0349137494547409 
 320.000000000000  320.000000000000  0.0312488804562060 
 320.000000000000  330.000000000000  0.0266345300377057 
 320.000000000000  340.000000000000  0.0212109029017323 
 320.000000000000  350.000000000000  0.0151427932143245 
 320.000000000000  360.000000000000  0.00861457741772257 

 330.000000000000  0.00000000000000  0.00901034375024728 
 330.000000000000  10.0000000000000  0.00180104996472543 
 330.000000000000  20.0000000000000 -0.00546296781259934 
 330.000000000000  30.0000000000000 -0.0125609960773334 
 330.000000000000  40.0000000000000 -0.0192773648324283 
 330.000000000000  50.0000000000000 -0.0254080006119073 
 330.000000000000  60.0000000000000 -0.0307666271498621 
 330.000000000000  70.0000000000000 -0.0351904252905328 
 330.000000000000  80.0000000000000 -0.0385449801659652 
 330.000000000000  90.0000000000000 -0.0407283653237557 
 330.000000000000  100.000000000000 -0.0416742397107313 
 330.000000000000  110.000000000000 -0.0413538634122791 
 330.000000000000  120.000000000000 -0.0397769709001093 
 330.000000000000  130.000000000000 -0.0369914752552583 
 330.000000000000  140.000000000000 -0.0330820123533658 
 330.000000000000  150.000000000000 -0.0281673692464224 
 330.000000000000  160.000000000000 -0.0223968748783029 
 330.000000000000  170.000000000000 -0.0159458628003718 
 330.000000000000  180.000000000000 -0.00901034375024729 
 330.000000000000  190.000000000000 -0.00180104996472543 
 330.000000000000  200.000000000000  0.00546296781259934 
 330.000000000000  210.000000000000  0.0125609960773334 
 330.000000000000  220.000000000000  0.0192773648324283 
 330.000000000000  230.000000000000  0.0254080006119073 
 330.000000000000  240.000000000000  0.0307666271498620 
 330.000000000000  250.000000000000  0.0351904252905328 
 330.000000000000  260.000000000000  0.0385449801659652 
 330.000000000000  270.000000000000  0.0407283653237557 
 330.000000000000  280.000000000000  0.0416742397107313 
 330.000000000000  290.000000000000  0.0413538634122791 
 330.000000000000  300.000000000000  0.0397769709001093 
 330.000000000000  310.000000000000  0.0369914752552583 
 330.000000000000  320.000000000000  0.0330820123533658 
 330.000000000000  330.000000000000  0.0281673692464224 
 330.000000000000  340.000000000000  0.0223968748783029 
 330.000000000000  350.000000000000  0.0159458628003718 
 330.000000000000  360.000000000000  0.00901034375024729 

 340.000000000000  0.00000000000000  0.00913233534737467 
 340.000000000000  10.0000000000000  0.00172276389217831 
 340.000000000000  20.0000000000000 -0.00573915287212128 
 340.000000000000  30.0000000000000 -0.0130266883805530 
 340.000000000000  40.0000000000000 -0.0199184145543639 
 340.000000000000  50.0000000000000 -0.0262049297811446 
 340.000000000000  60.0000000000000 -0.0316952214768595 
 340.000000000000  70.0000000000000 -0.0362224699065560 
 340.000000000000  80.0000000000000 -0.0396491169175960 
 340.000000000000  90.0000000000000 -0.0418710455745160 
 340.000000000000  100.000000000000 -0.0428207436994258 
 340.000000000000  110.000000000000 -0.0424693551953703 
 340.000000000000  120.000000000000 -0.0408275568242342 
 340.000000000000  130.000000000000 -0.0379452337987343 
 340.000000000000  140.000000000000 -0.0339099640454747 
 340.000000000000  150.000000000000 -0.0288443571939631 
 340.000000000000  160.000000000000 -0.0229023291450619 
 340.000000000000  170.000000000000 -0.0162644254142257 
 340.000000000000  180.000000000000 -0.00913233534737467 
 340.000000000000  190.000000000000 -0.00172276389217831 
 340.000000000000  200.000000000000  0.00573915287212128 
 340.000000000000  210.000000000000  0.0130266883805530 
 340.000000000000  220.000000000000  0.0199184145543639 
 340.000000000000  230.000000000000  0.0262049297811446 
 340.000000000000  240.000000000000  0.0316952214768595 
 340.000000000000  250.000000000000  0.0362224699065560 
 340.000000000000  260.000000000000  0.0396491169175960 
 340.000000000000  270.000000000000  0.0418710455745160 
 340.000000000000  280.000000000000  0.0428207436994258 
 340.000000000000  290.000000000000  0.0424693551953703 
 340.000000000000  300.000000000000  0.0408275568242342 
 340.000000000000  310.000000000000  0.0379452337987343 
 340.000000000000  320.000000000000  0.0339099640454747 
 340.000000000000  330.000000000000  0.0288443571939631 
 340.000000000000  340.000000000000  0.0229023291450619 
 340.000000000000  350.000000000000  0.0162644254142257 
 340.000000000000  360.000000000000  0.00913233534737468 

 350.000000000000  0.00000000000000  0.00897684555615674 
 350.000000000000  10.0000000000000  0.00159213251052795 
 350.000000000000  20.0000000000000 -0.00584095667577530 
 350.000000000000  30.0000000000000 -0.0130965713491518 
 350.000000000000  40.0000000000000 -0.0199542533292692 
 350.000000000000  50.0000000000000 -0.0262056354193162 
 350.000000000000  60.0000000000000 -0.0316607725378386 
 350.000000000000  70.0000000000000 -0.0361539131039227 
 350.000000000000  80.0000000000000 -0.0395485353151068 
 350.000000000000  90.0000000000000 -0.0417414952932660 
 350.000000000000  100.000000000000 -0.0426661610591550 
 350.000000000000  110.000000000000 -0.0422944371113809 
 350.000000000000  120.000000000000 -0.0406376180939953 
 350.000000000000  130.000000000000 -0.0377460456144506 
 350.000000000000  140.000000000000 -0.0337075786393315 
 350.000000000000  150.000000000000 -0.0286449239441142 
 350.000000000000  160.000000000000 -0.0227119077298858 
 350.000000000000  170.000000000000 -0.0160888016920647 
 350.000000000000  180.000000000000 -0.00897684555615674 
 350.000000000000  190.000000000000 -0.00159213251052794 
 350.000000000000  200.000000000000  0.00584095667577530 
 350.000000000000  210.000000000000  0.0130965713491518 
 350.000000000000  220.000000000000  0.0199542533292692 
 350.000000000000  230.000000000000  0.0262056354193162 
 350.000000000000  240.000000000000  0.0316607725378385 
 350.000000000000  250.000000000000  0.0361539131039227 
 350.000000000000  260.000000000000  0.0395485353151068 
 350.000000000000  270.000000000000  0.0417414952932660 
 350.000000000000  280.000000000000  0.0426661610591550 
 350.000000000000  290.000000000000  0.0422944371113809 
 350.000000000000  300.000000000000  0.0406376180939953 
 350.000000000000  310.000000000000  0.0377460456144506 
 350.000000000000  320.000000000000  0.0337075786393316 
 350.000000000000  330.000000000000  0.0286449239441142 
 350.000000000000  340.000000000000  0.0227119077298858 
 350.000000000000  350.000000000000  0.0160888016920647 
 350.000000000000  360.000000000000  0.00897684555615675 

 360.000000000000  0.00000000000000  0.00854859885521802 
 360.000000000000  10.0000000000000  0.00141312498820312 
 360.000000000000  20.0000000000000 -0.00576528596650258 
 360.000000000000  30.0000000000000 -0.0127685216244916 
 360.000000000000  40.0000000000000 -0.0193837922141041 
 360.000000000000  50.0000000000000 -0.0254100960859632 
 360.000000000000  60.0000000000000 -0.0306643270463793 
 360.000000000000  70.0000000000000 -0.0349868379463894 
 360.000000000000  80.0000000000000 -0.0382462914795927 
 360.000000000000  90.0000000000000 -0.0403436507997459 
 360.000000000000  100.000000000000 -0.0412151887052211 
 360.000000000000  110.000000000000 -0.0408344239577800 
 360.000000000000  120.000000000000 -0.0392129259015973 
 360.000000000000  130.000000000000 -0.0363999629345925 
 360.000000000000  140.000000000000 -0.0324810055130901 
 360.000000000000  150.000000000000 -0.0275751291752543 
 360.000000000000  160.000000000000 -0.0218313964911171 
 360.000000000000  170.000000000000 -0.0154243278718169 
 360.000000000000  180.000000000000 -0.00854859885521802 
 360.000000000000  190.000000000000 -0.00141312498820311 
 360.000000000000  200.000000000000  0.00576528596650258 
 360.000000000000  210.000000000000  0.0127685216244916 
 360.000000000000  220.000000000000  0.0193837922141041 
 360.000000000000  230.000000000000  0.0254100960859632 
 360.000000000000  240.000000000000  0.0306643270463793 
 360.000000000000  250.000000000000  0.0349868379463894 
 360.000000000000  260.000000000000  0.0382462914795927 
 360.000000000000  270.000000000000  0.0403436507997459 
 360.000000000000  280.000000000000  0.0412151887052211 
 360.000000000000  290.000000000000  0.0408344239577800 
 360.000000000000  300.000000000000  0.0392129259015973 
 360.000000000000  310.000000000000  0.0363999629345925 
 360.000000000000  320.000000000000  0.0324810055130901 
 360.000000000000  330.000000000000  0.0275751291752543 
 360.000000000000  340.000000000000  0.0218313964911170 
 360.000000000000  350.000000000000  0.0154243278718169 
 360.000000000000  360.000000000000  0.00854859885521803 
