 1.00000000000000  4.53997483335570e-10  0.000322311385456479 
 1.00693166885180  4.53996851293086e-10  0.000324544636040301 
 1.01391138573668  4.53996210459807e-10  0.000326793349885217 
 1.02093948370768  4.53995560713491e-10  0.000329057632111093 
 1.02801629812647  4.53994901930206e-10  0.000331337589400147 
 1.03514216667934  4.53994233984291e-10  0.000333633328831975 
 1.04231742939330  4.53993556748325e-10  0.000335944962238313 
 1.04954242865232  4.53992870093131e-10  0.000338272597721792 
 1.05681750921366  4.53992173887739e-10  0.000340616345363236 
 1.06414301822431  4.53991467999331e-10  0.000342976319721577 
 1.07151930523760  4.53990752293281e-10  0.000345352629083657 
 1.07894672222983  4.53990026633076e-10  0.000347745387882390 
 1.08642562361706  4.53989290880304e-10  0.000350154707817816 
 1.09395636627209  4.53988544894619e-10  0.000352580705995079 
 1.10153930954141  4.53987788533753e-10  0.000355023494901839 
 1.10917481526240  4.53987021653411e-10  0.000357483194346890 
 1.11686324778056  4.53986244107377e-10  0.000359959913374642 
 1.12460497396692  4.53985455747322e-10  0.000362453777776397 
 1.13240036323555  4.53984656422860e-10  0.000364964902188881 
 1.14024978756117  4.53983845981563e-10  0.000367493405866944 
 1.14815362149688  4.53983024268851e-10  0.000370039409639308 
 1.15611224219210  4.53982191128026e-10  0.000372603031341106 
 1.16412602941049  4.53981346400172e-10  0.000375184396889546 
 1.17219536554813  4.53980489924204e-10  0.000377783623100303 
 1.18032063565173  4.53979621536748e-10  0.000380400840934386 
 1.18850222743701  4.53978741072233e-10  0.000383036167347418 
 1.19674053130724  4.53977848362711e-10  0.000385689730540935 
 1.20503594037179  4.53976943237941e-10  0.000388361656576532 
 1.21338885046497  4.53976025525327e-10  0.000391052068847050 
 1.22179966016487  4.53975095049844e-10  0.000393761097521436 
 1.23026877081238  4.53974151634052e-10  0.000396488871168464 
 1.23879658653036  4.53973195098047e-10  0.000399235517581634 
 1.24738351424294  4.53972225259401e-10  0.000402001169612789 
 1.25602996369487  4.53971241933202e-10  0.000404785953271997 
 1.26473634747115  4.53970244931916e-10  0.000407590004016623 
 1.27350308101666  4.53969234065431e-10  0.000410413454872769 
 1.28233058265602  4.53968209140992e-10  0.000413256438725736 
 1.29121927361353  4.53967169963153e-10  0.000416119090734023 
 1.30016957803328  4.53966116333770e-10  0.000419001544381299 
 1.30918192299940  4.53965048051932e-10  0.000421903939036265 
 1.31825673855640  4.53963964913957e-10  0.000424826408644033 
 1.32739445772973  4.53962866713294e-10  0.000427769095543268 
 1.33659551654643  4.53961753240583e-10  0.000430732136805887 
 1.34586035405594  4.53960624283480e-10  0.000433715673090345 
 1.35518941235103  4.53959479626767e-10  0.000436719842054559 
 1.36458313658892  4.53958319052180e-10  0.000439744790199397 
 1.37404197501251  4.53957142338453e-10  0.000442790658391719 
 1.38356637897177  4.53955949261233e-10  0.000445857593299907 
 1.39315680294529  4.53954739593055e-10  0.000448945737836610 
 1.40281370456195  4.53953513103304e-10  0.000452055237125191 
 1.41253754462274  4.53952269558147e-10  0.000455186239600492 
 1.42232878712281  4.53951008720506e-10  0.000458338893147439 
 1.43218789927353  4.53949730350014e-10  0.000461513346931029 
 1.44211535152486  4.53948434202970e-10  0.000464709750731269 
 1.45211161758773  4.53947120032282e-10  0.000467928255028906 
 1.46217717445671  4.53945787587434e-10  0.000471169011011178 
 1.47231250243271  4.53944436614416e-10  0.000474432176367905 
 1.48251808514594  4.53943066855697e-10  0.000477717898776475 
 1.49279440957898  4.53941678050182e-10  0.000481026336477322 
 1.50314196609001  4.53940269933124e-10  0.000484357645715975 
 1.51356124843620  4.53938842236143e-10  0.000487711982839897 
 1.52405275379728  4.53937394687063e-10  0.000491089510344465 
 1.53461698279928  4.53935927010012e-10  0.000494490380721561 
 1.54525443953840  4.53934438925222e-10  0.000497914759098301 
 1.55596563160506  4.53932930149072e-10  0.000501362807202431 
 1.56675107010814  4.53931400394004e-10  0.000504834682851897 
 1.57761126969933  4.53929849368438e-10  0.000508330555412274 
 1.58854674859776  4.53928276776780e-10  0.000511850587373372 
 1.59955802861465  4.53926682319317e-10  0.000515394944576960 
 1.61064563517826  4.53925065692177e-10  0.000518963793967737 
 1.62181009735891  4.53923426587260e-10  0.000522557306325821 
 1.63305194789432  4.53921764692227e-10  0.000526175645744631 
 1.64437172321492  4.53920079690352e-10  0.000529818985950076 
 1.65576996346951  4.53918371260537e-10  0.000533487498622402 
 1.66724721255105  4.53916639077215e-10  0.000537181357057766 
 1.67880401812254  4.53914882810349e-10  0.000540900732514129 
 1.69044093164325  4.53913102125222e-10  0.000544645803576858 
 1.70215850839493  4.53911296682572e-10  0.000548416742899666 
 1.71395730750841  4.53909466138381e-10  0.000552213730855396 
 1.72583789199018  4.53907610143847e-10  0.000556036945486727 
 1.73780082874936  4.53905728345360e-10  0.000559886564853450 
 1.74984668862464  4.53903820384368e-10  0.000563762773518409 
 1.76197604641161  4.53901885897382e-10  0.000567665749053528 
 1.77418948089015  4.53899924515833e-10  0.000571595678661400 
 1.78648757485203  4.53897935866043e-10  0.000575552746983396 
 1.79887091512877  4.53895919569188e-10  0.000579537136790368 
 1.81134009261958  4.53893875241127e-10  0.000583549037389252 
 1.82389570231962  4.53891802492451e-10  0.000587588639299353 
 1.83653834334832  4.53889700928285e-10  0.000591656126770433 
 1.84926861897806  4.53887570148312e-10  0.000595751695430145 
 1.86208713666284  4.53885409746649e-10  0.000599875538731064 
 1.87499450806740  4.53883219311826e-10  0.000604027843758532 
 1.88799134909627  4.53880998426603e-10  0.000608208807915377 
 1.90107827992328  4.53878746667966e-10  0.000612418631779319 
 1.91425592502106  4.53876463607053e-10  0.000616657510209743 
 1.92752491319091  4.53874148809063e-10  0.000620925641375984 
 1.94088587759275  4.53871801833126e-10  0.000625223222880925 
 1.95433945577537  4.53869422232300e-10  0.000629550459823495 
 1.96788628970682  4.53867009553380e-10  0.000633907553709979 
 1.98152702580507  4.53864563336947e-10  0.000638294706972648 
 1.99526231496885  4.53862083117174e-10  0.000642712126888469 
 2.00909281260870  4.53859568421780e-10  0.000647160020410244 
 2.02301917867824  4.53857018771940e-10  0.000651638595252695 
 2.03704207770569  4.53854433682183e-10  0.000656148060345112 
 2.05116217882554  4.53851812660316e-10  0.000660688627918387 
 2.06538015581050  4.53849155207310e-10  0.000665260507865397 
 2.07969668710367  4.53846460817227e-10  0.000669863915535329 
 2.09411245585086  4.53843728977100e-10  0.000674499067134546 
 2.10862814993326  4.53840959166874e-10  0.000679166178252260 
 2.12324446200019  4.53838150859270e-10  0.000683865464590757 
 2.13796208950220  4.53835303519689e-10  0.000688597148592448 
 2.15278173472434  4.53832416606134e-10  0.000693361452407616 
 2.16770410481966  4.53829489569124e-10  0.000698158593742278 
 2.18272991184297  4.53826521851510e-10  0.000702988801122933 
 2.19785987278479  4.53823512888477e-10  0.000707852295880382 
 2.21309470960560  4.53820462107333e-10  0.000712749303311789 
 2.22843514927027  4.53817368927463e-10  0.000717680058284731 
 2.24388192378273  4.53814232760226e-10  0.000722644785849425 
 2.25943577022094  4.53811053008800e-10  0.000727643719468731 
 2.27509743077203  4.53807829068121e-10  0.000732677089836813 
 2.29086765276773  4.53804560324742e-10  0.000737745128554604 
 2.30674718872003  4.53801246156698e-10  0.000742848077502854 
 2.32273679635707  4.53797885933376e-10  0.000747986172571678 
 2.33883723865932  4.53794479015514e-10  0.000753159648924405 
 2.35504928389597  4.53791024754920e-10  0.000758368750771523 
 2.37137370566161  4.53787522494473e-10  0.000763613716710985 
 2.38781128291314  4.53783971567916e-10  0.000768894794001262 
 2.40436280000689  4.53780371299782e-10  0.000774212229108570 
 2.42102904673614  4.53776721005274e-10  0.000779566260205493 
 2.43781081836871  4.53773019990050e-10  0.000784957144141048 
 2.45470891568499  4.53769267550231e-10  0.000790385127172640 
 2.47172414501609  4.53765462972114e-10  0.000795850462400966 
 2.48885731828235  4.53761605532196e-10  0.000801353399252845 
 2.50610925303207  4.53757694496893e-10  0.000806894197412014 
 2.52348077248053  4.53753729122507e-10  0.000812473113038374 
 2.54097270554926  4.53749708655018e-10  0.000818090400682050 
 2.55858588690560  4.53745632329997e-10  0.000823746322513256 
 2.57632115700253  4.53741499372422e-10  0.000829441138358542 
 2.59417936211876  4.53737308996544e-10  0.000835175113870778 
 2.61216135439916  4.53733060405760e-10  0.000840948511602984 
 2.63026799189533  4.53728752792432e-10  0.000846761597719213 
 2.64850013860665  4.53724385337719e-10  0.000852614644382301 
 2.66685866452143  4.53719957211502e-10  0.000858507916396944 
 2.68534444565845  4.53715467572161e-10  0.000864441688355884 
 2.70395836410879  4.53710915566421e-10  0.000870416233303444 
 2.72270130807786  4.53706300329238e-10  0.000876431828497864 
 2.74157417192783  4.53701620983567e-10  0.000882488745267341 
 2.76057785622029  4.53696876640259e-10  0.000888587265976815 
 2.77971326775923  4.53692066397854e-10  0.000894727671228147 
 2.79898131963431  4.53687189342455e-10  0.000900910243758299 
 2.81838293126440  4.53682244547511e-10  0.000907135265817132 
 2.83791902844150  4.53677231073672e-10  0.000913403021561411 
 2.85759054337489  4.53672147968575e-10  0.000919713802841701 
 2.87739841473561  4.53666994266736e-10  0.000926067896605937 
 2.89734358770126  4.53661768989316e-10  0.000932465594148746 
 2.91742701400110  4.53656471143927e-10  0.000938907188852968 
 2.93764965196147  4.53651099724490e-10  0.000945392975888302 
 2.95801246655148  4.53645653711036e-10  0.000951923250372911 
 2.97851642942913  4.53640132069497e-10  0.000958498313716034 
 2.99916251898759  4.53634533751480e-10  0.000965118464782986 
 3.01995172040195  4.53628857694189e-10  0.000971784004849491 
 3.04088502567621  4.53623102820081e-10  0.000978495240222091 
 3.06196343369061  4.53617268036800e-10  0.000985252474767053 
 3.08318795024929  4.53611352236834e-10  0.000992056016063586 
 3.10455958812829  4.53605354297400e-10  0.000998906180662693 
 3.12607936712388  4.53599273080285e-10  0.00100580326994100 
 3.14774831410124  4.53593107431483e-10  0.00101274760596282 
 3.16956746304342  4.53586856181093e-10  0.00101973950107902 
 3.19153785510069  4.53580518143042e-10  0.00102677927398349 
 3.21366053864024  4.53574092114946e-10  0.00103386724192352 
 3.23593656929621  4.53567576877788e-10  0.00104100373040486 
 3.25836701002001  4.53560971195745e-10  0.00104818905921344 
 3.28095293113111  4.53554273815951e-10  0.00105542355390352 
 3.30369541036807  4.53547483468258e-10  0.00106270754646559 
 3.32659553293997  4.53540598865004e-10  0.00107004136137696 
 3.34965439157820  4.53533618700754e-10  0.00107742533165033 
 3.37287308658861  4.53526541652128e-10  0.00108485978920347 
 3.39625272590400  4.53519366377411e-10  0.00109234507389064 
 3.41979442513700  4.53512091516472e-10  0.00109988152083845 
 3.44349930763330  4.53504715690432e-10  0.00110746947006349 
 3.46736850452523  4.53497237501386e-10  0.00111510925738790 
 3.49140315478577  4.53489655532138e-10  0.00112280123811571 
 3.51560440528289  4.53481968346041e-10  0.00113054574667576 
 3.53997341083426  4.53474174486608e-10  0.00113834313617063 
 3.56451133426235  4.53466272477285e-10  0.00114619375829257 
 3.58921934644996  4.53458260821235e-10  0.00115409795869036 
 3.61409862639604  4.53450138000974e-10  0.00116205609730739 
 3.63915036127198  4.53441902478126e-10  0.00117006852486648 
 3.66437574647824  4.53433552693162e-10  0.00117813560732894 
 3.68977598570141  4.53425087065059e-10  0.00118625769641349 
 3.71535229097163  4.53416503991066e-10  0.00119443515719644 
 3.74110588272044  4.53407801846385e-10  0.00120266835567220 
 3.76703798983899  4.53398978983827e-10  0.00121095765953241 
 3.79314984973672  4.53390033733567e-10  0.00121930343681329 
 3.81944270840036  4.53380964402877e-10  0.00122770605240136 
 3.84591782045343  4.53371769275635e-10  0.00123616588831485 
 3.87257644921607  4.53362446612250e-10  0.00124468331261942 
 3.89941986676533  4.53352994649091e-10  0.00125325870777923 
 3.92644935399589  4.53343411598432e-10  0.00126189244888317 
 3.95366620068117  4.53333695647864e-10  0.00127058492422579 
 3.98107170553486  4.53323844960146e-10  0.00127933650800064 
 4.00866717627292  4.53313857672778e-10  0.00128814759453954 
 4.03645392967594  4.53303731897684e-10  0.00129701856635166 
 4.06443329165201  4.53293465720856e-10  0.00130594981923172 
 4.09260659729999  4.53283057202030e-10  0.00131494174023723 
 4.12097519097319  4.53272504374297e-10  0.00132399472811772 
 4.14954042634351  4.53261805243747e-10  0.00133310917460804 
 4.17830366646610  4.53250957789147e-10  0.00134228548490825 
 4.20726628384432  4.53239959961470e-10  0.00135152405926967 
 4.23642966049529  4.53228809683675e-10  0.00136082529840906 
 4.26579518801580  4.53217504850172e-10  0.00137018960730938 
 4.29536426764875  4.53206043326512e-10  0.00137961740028689 
 4.32513831034996  4.53194422949037e-10  0.00138910908051933 
 4.35511873685556  4.53182641524392e-10  0.00139866506378551 
 4.38530697774973  4.53170696829158e-10  0.00140828576384191 
 4.41570447353299  4.53158586609516e-10  0.00141797159914637 
 4.44631267469096  4.53146308580743e-10  0.00142772298653279 
 4.47713304176349  4.53133860426829e-10  0.00143754034901116 
 4.50816704541447  4.53121239800072e-10  0.00144742410900610 
 4.53941616650190  4.53108444320651e-10  0.00145737469337803 
 4.57088189614861  4.53095471576166e-10  0.00146739252844413 
 4.60256573581342  4.53082319121202e-10  0.00147747804640945 
 4.63446919736274  4.53068984476925e-10  0.00148763167960209 
 4.66659380314274  4.53055465130616e-10  0.00149785386048788 
 4.69894108605201  4.53041758535165e-10  0.00150814502986489 
 4.73151258961466  4.53027862108679e-10  0.00151850562382413 
 4.76430986805401  4.53013773234020e-10  0.00152893608294282 
 4.79733448636674  4.52999489258248e-10  0.00153943685426034 
 4.83058802039758  4.52985007492182e-10  0.00155000838215031 
 4.86407205691446  4.52970325210004e-10  0.00156065111386707 
 4.89778819368431  4.52955439648608e-10  0.00157136550401237 
 4.93173803954920  4.52940348007272e-10  0.00158215199886143 
 4.96592321450320  4.52925047446982e-10  0.00159301105722023 
 5.00034534976963  4.52909535090044e-10  0.00160394313329514 
 5.03500608787889  4.52893808019552e-10  0.00161494869216511 
 5.06990708274688  4.52877863278808e-10  0.00162602818810807 
 5.10504999975390  4.52861697870828e-10  0.00163718208992698 
 5.14043651582409  4.52845308757800e-10  0.00164841086052387 
 5.17606831950551  4.52828692860578e-10  0.00165971497050468 
 5.21194711105063  4.52811847058073e-10  0.00167109488755256 
 5.24807460249755  4.52794768186699e-10  0.00168255108583146 
 5.28445251775163  4.52777453039869e-10  0.00169408404028022 
 5.32108259266777  4.52759898367346e-10  0.00170569422488809 
 5.35796657513324  4.52742100874723e-10  0.00171738211961226 
 5.39510622515110  4.52724057222772e-10  0.00172914820853731 
 5.43250331492415  4.52705764026935e-10  0.00174099297275938 
 5.47015962893953  4.52687217856689e-10  0.00175291689677784 
 5.50807696405385  4.52668415234873e-10  0.00176492046944945 
 5.54625712957892  4.52649352637173e-10  0.00177700418005629 
 5.58470194736812  4.52630026491413e-10  0.00178916852130011 
 5.62341325190330  4.52610433176990e-10  0.00180141398557776 
 5.66239289038234  4.52590569024211e-10  0.00181374106700358 
 5.70164272280728  4.52570430313602e-10  0.00182615026636213 
 5.74116462207308  4.52550013275327e-10  0.00183864208493144 
 5.78096047405698  4.52529314088453e-10  0.00185121702110559 
 5.82103217770851  4.52508328880335e-10  0.00186387557903646 
 5.86138164514008  4.52487053725903e-10  0.00187661826830986 
 5.90201080171823  4.52465484646969e-10  0.00188944559496020 
 5.94292158615552  4.52443617611576e-10  0.00190235806940907 
 5.98411595060298  4.52421448533237e-10  0.00191535620097074 
 6.02559586074336  4.52398973270231e-10  0.00192844050746887 
 6.06736329588484  4.52376187624915e-10  0.00194161150086326 
 6.10942024905550  4.52353087342959e-10  0.00195486970099770 
 6.15176872709846  4.52329668112593e-10  0.00196821562905062 
 6.19441075076759  4.52305925563919e-10  0.00198164980263093 
 6.23734835482396  4.52281855268060e-10  0.00199517274830722 
 6.28058358813295  4.52257452736506e-10  0.00200878498848383 
 6.32411851376196  4.52232713420216e-10  0.00202248705200215 
 6.36795520907892  4.52207632708907e-10  0.00203627946718697 
 6.41209576585138  4.52182205930266e-10  0.00205016276248300 
 6.45654229034632  4.52156428349063e-10  0.00206413747123341 
 6.50129690343067  4.52130295166457e-10  0.00207820412616895 
 6.54636174067251  4.52103801519017e-10  0.00209236326597821 
 6.59173895244297  4.52076942478060e-10  0.00210661542318197 
 6.63743070401884  4.52049713048672e-10  0.00212096113692812 
 6.68343917568589  4.52022108168896e-10  0.00213540095133473 
 6.72976656284292  4.51994122708920e-10  0.00214993540017327 
 6.77641507610649  4.51965751470086e-10  0.00216456503367113 
 6.82338694141644  4.51936989184107e-10  0.00217929039219536 
 6.87068440014206  4.51907830512150e-10  0.00219411202298678 
 6.91830970918910  4.51878270043880e-10  0.00220903047419718 
 6.96626514110742  4.51848302296578e-10  0.00222404629523029 
 7.01455298419944  4.51817921714287e-10  0.00223916002998955 
 7.06317554262935  4.51787122666704e-10  0.00225437223518638 
 7.11213513653301  4.51755899448359e-10  0.00226968346049147 
 7.16143410212874  4.51724246277654e-10  0.00228509426042641 
 7.21107479182871  4.51692157295855e-10  0.00230060519013766 
 7.26105957435126  4.51659626566071e-10  0.00231621680177176 
 7.31139083483388  4.51626648072354e-10  0.00233192965493534 
 7.36207097494707  4.51593215718596e-10  0.00234774430899248 
 7.41310241300888  4.51559323327653e-10  0.00236366131514250 
 7.46448758410037  4.51524964640114e-10  0.00237968123923169 
 7.51622894018175  4.51490133313475e-10  0.00239580464086925 
 7.56832895020944  4.51454822920927e-10  0.00241203207533887 
 7.62079010025381  4.51419026950384e-10  0.00242836411006960 
 7.67361489361788  4.51382738803352e-10  0.00244480130332973 
 7.72680585095671  4.51345951793941e-10  0.00246134422001320 
 7.78036551039772  4.51308659147603e-10  0.00247799342397138 
 7.83429642766180  4.51270854000188e-10  0.00249474947476758 
 7.88860117618522  4.51232529396741e-10  0.00251161293862123 
 7.94328234724249  4.51193678290342e-10  0.00252858438226709 
 7.99834255006995  4.51154293541045e-10  0.00254566436558360 
 8.05378441199033  4.51114367914618e-10  0.00256285345584308 
 8.10961057853807  4.51073894081483e-10  0.00258015221647386 
 8.16582371358558  4.51032864615405e-10  0.00259756121410575 
 8.22242649947037  4.50991271992419e-10  0.00261508101119453 
 8.27942163712299  4.50949108589567e-10  0.00263271217122139 
 8.33681184619599  4.50906366683593e-10  0.00265045526175480 
 8.39459986519362  4.50863038449885e-10  0.00266831084551289 
 8.45278845160254  4.50819115961109e-10  0.00268627948211828 
 8.51138038202340  4.50774591185915e-10  0.00270436174070763 
 8.57037845230333  4.50729455987802e-10  0.00272255817859059 
 8.62978547766933  4.50683702123684e-10  0.00274086935907519 
 8.68960429286265  4.50637321242700e-10  0.00275929584242148 
 8.74983775227398  4.50590304884817e-10  0.00277783819188913 
 8.81048873007976  4.50542644479605e-10  0.00279649696038515 
 8.87156012037923  4.50494331344751e-10  0.00281527271135605 
 8.93305483733256  4.50445356684856e-10  0.00283416599739875 
 8.99497581529996  4.50395711590001e-10  0.00285317737818459 
 9.05732600898160  4.50345387034357e-10  0.00287230740226661 
 9.12010839355870  4.50294373874804e-10  0.00289155662578715 
 9.18332596483541  4.50242662849544e-10  0.00291092560055991 
 9.24698173938182  4.50190244576657e-10  0.00293041487087389 
 9.31107875467789  4.50137109552676e-10  0.00295002498575391 
 9.37562006925838  4.50083248151114e-10  0.00296975649425536 
 9.44060876285881  4.50028650621095e-10  0.00298960993280021 
 9.50604793656239  4.49973307085751e-10  0.00300958584782185 
 9.57194071294801  4.49917207540833e-10  0.00302968477302039 
 9.63829023623927  4.49860341853158e-10  0.00304990724815402 
 9.70509967245446  4.49802699759109e-10  0.00307025380027191 
 9.77237220955766  4.49744270863138e-10  0.00309072496566360 
 9.84011105761089  4.49685044636153e-10  0.00311132126580029 
 9.90831944892722  4.49625010414004e-10  0.00313204323232979 
 9.97700063822508  4.49564157395958e-10  0.00315289137816556 
 10.0461579027835  4.49502474643026e-10  0.00317386622297194 
 10.1157945425985  4.49439951076412e-10  0.00319496828079840 
 10.1859138805407  4.49376575475929e-10  0.00321619806223511 
 10.2565192625136  4.49312336478309e-10  0.00323755607577349 
 10.3276140576135  4.49247222575652e-10  0.00325904281702633 
 10.3992016582901  4.49181222113686e-10  0.00328065878549451 
 10.4712854805085  4.49114323290154e-10  0.00330240447409098 
 10.5438689639121  4.49046514153126e-10  0.00332428037434584 
 10.6169555719867  4.48977782599322e-10  0.00334628696361352 
 10.6905487922261  4.48908116372369e-10  0.00336842472595443 
 10.7646521362978  4.48837503061142e-10  0.00339069412975006 
 10.8392691402115  4.48765930097995e-10  0.00341309564576128 
 10.9144033644870  4.48693384756990e-10  0.00343562973546132 
 10.9900583943247  4.48619854152207e-10  0.00345829685416874 
 11.0662378397761  4.48545325235954e-10  0.00348109745077443 
 11.1429453359168  4.48469784796984e-10  0.00350403196821011 
 11.2201845430191  4.48393219458615e-10  0.00352710084890365 
 11.2979591467274  4.48315615677114e-10  0.00355030451752693 
 11.3762728582338  4.48236959739710e-10  0.00357364339851968 
 11.4551294144548  4.48157237762833e-10  0.00359711790836684 
 11.5345325782104  4.48076435690255e-10  0.00362072845597351 
 11.6144861384029  4.47994539291284e-10  0.00364447544026736 
 11.6949939101981  4.47911534158796e-10  0.00366835925726693 
 11.7760597352075  4.47827405707462e-10  0.00369238028908592 
 11.8576874816710  4.47742139171854e-10  0.00371653891156257 
 11.9398810446421  4.47655719604460e-10  0.00374083549051119 
 12.0226443461735  4.47568131873844e-10  0.00376527038746323 
 12.1059813355042  4.47479360662732e-10  0.00378984394937245 
 12.1898959892481  4.47389390466059e-10  0.00381455651293245 
 12.2743923115835  4.47298205589016e-10  0.00383940840782667 
 12.3594743344445  4.47205790145159e-10  0.00386439995390019 
 12.4451461177132  4.47112128054398e-10  0.00388953146109207 
 12.5314117494135  4.47017203041060e-10  0.00391480322127849 
 12.6182753459061  4.46920998631856e-10  0.00394021552657039 
 12.7057410520848  4.46823498153992e-10  0.00396576864777347 
 12.7938130415746  4.46724684733133e-10  0.00399146284605183 
 12.8824955169307  4.46624541291340e-10  0.00401729837696853 
 12.9717927098389  4.46523050545227e-10  0.00404327547235916 
 13.0617088813177  4.46420195003755e-10  0.00406939436078961 
 13.1522483219217  4.46315956966330e-10  0.00409565525312898 
 13.2434153519460  4.46210318520795e-10  0.00412205834298398 
 13.3352143216326  4.46103261541295e-10  0.00414860382148240 
 13.4276496113779  4.45994767686358e-10  0.00417529185203206 
 13.5207256319421  4.45884818396771e-10  0.00420212259240430 
 13.6144468246588  4.45773394893574e-10  0.00422909618099058 
 13.7088176616478  4.45660478176019e-10  0.00425621274430104 
 13.8038426460281  4.45546049019506e-10  0.00428347238416313 
 13.8995263121328  4.45430087973531e-10  0.00431087519732284 
 13.9958732257254  4.45312575359649e-10  0.00433842125277950 
 14.0928879842180  4.45193491269355e-10  0.00436611061093289 
 14.1905752168902  4.45072815562133e-10  0.00439394331516270 
 14.2889395851103  4.44950527863351e-10  0.00442191937979448 
 14.3879857825577  4.44826607562165e-10  0.00445003880678360 
 14.4877185354468  4.44701033809504e-10  0.00447830158598057 
 14.5881426027527  4.44573785516075e-10  0.00450670767513686 
 14.6892627764379  4.44444841350193e-10  0.00453525702086708 
 14.7910838816813  4.44314179735868e-10  0.00456394954311525 
 14.8936107771083  4.44181778850649e-10  0.00459278514439697 
 14.9968483550229  4.44047616623670e-10  0.00462176370757473 
 15.1008015416407  4.43911670733626e-10  0.00465088508489427 
 15.2054752973241  4.43773918606663e-10  0.00468014911662452 
 15.3108746168195  4.43634337414500e-10  0.00470955561375969 
 15.4170045294948  4.43492904072289e-10  0.00473910436259022 
 15.5238700995800  4.43349595236771e-10  0.00476879512412770 
 15.6314764264087  4.43204387304120e-10  0.00479862764155002 
 15.7398286446613  4.43057256408137e-10  0.00482860162592710 
 15.8489319246103  4.42908178418212e-10  0.00485871676234533 
 15.9587914723664  4.42757128937343e-10  0.00488897271616110 
 16.0694125301279  4.42604083300342e-10  0.00491936911329753 
 16.1808003764298  4.42449016571785e-10  0.00494990556159622 
 16.2929603263963  4.42291903544181e-10  0.00498058164034610 
 16.4058977319945  4.42132718736128e-10  0.00501139688838727 
 16.5196179822892  4.41971436390395e-10  0.00504235082926495 
 16.6341265037008  4.41808030472116e-10  0.00507344294781680 
 16.7494287602634  4.41642474667027e-10  0.00510467269573086 
 16.8655302538865  4.41474742379590e-10  0.00513603949990194 
 16.9824365246165  4.41304806731313e-10  0.00516754274689152 
 17.1001531509019  4.41132640558970e-10  0.00519918179356916 
 17.2186857498591  4.40958216412953e-10  0.00523095596281613 
 17.3380399775404  4.40781506555486e-10  0.00526286454245358 
 17.4582215292040  4.40602482959115e-10  0.00529490678444185 
 17.5792361395859  4.40421117305012e-10  0.00532708190587951 
 17.7010895831732  4.40237380981428e-10  0.00535938908106113 
 17.8237876744799  4.40051245082178e-10  0.00539182745289853 
 17.9473362683242  4.39862680405043e-10  0.00542439612162322 
 18.0717412601082  4.39671657450479e-10  0.00545709415005675 
 18.1970085860988  4.39478146420028e-10  0.00548992055473905 
 18.3231442237111  4.39282117215017e-10  0.00552287432179614 
 18.4501541917937  4.39083539435248e-10  0.00555595438743065 
 18.5780445509159  4.38882382377717e-10  0.00558915964290244 
 18.7068214036569  4.38678615035271e-10  0.00562248894281147 
 18.8364908948969  4.38472206095592e-10  0.00565594109021998 
 18.9670592121104  4.38263123939974e-10  0.00568951484791906 
 19.0985325856613  4.38051336642220e-10  0.00572320892711895 
 19.2309172891005  4.37836811967696e-10  0.00575702199969446 
 19.3642196394649  4.37619517372352e-10  0.00579095267680557 
 19.4984459975793  4.37399420001823e-10  0.00582499952833752 
 19.6336027683593  4.37176486690615e-10  0.00585916107059400 
 19.7696964011174  4.36950683961277e-10  0.00589343577541656 
 19.9067333898707  4.36721978023819e-10  0.00592782205060242 
 20.0447202736504  4.36490334775010e-10  0.00596231825934327 
 20.1836636368144  4.36255719797854e-10  0.00599692270705641 
 20.3235701093610  4.36018098361118e-10  0.00603163364228033 
 20.4644463672455  4.35777435418945e-10  0.00606644926215325 
 20.6062991326988  4.35533695610548e-10  0.00610136770017807 
 20.7491351745478  4.35286843259957e-10  0.00613638703345051 
 20.8929613085391  4.35036842375929e-10  0.00617150528328212 
 21.0377843976635  4.34783656651847e-10  0.00620672040188967 
 21.1836113524837  4.34527249465838e-10  0.00624203028731464 
 21.3304491314645  4.34267583880834e-10  0.00627743276464648 
 21.4783047413040  4.34004622644905e-10  0.00631292560747884 
 21.6271852372689  4.33738328191467e-10  0.00634850651384437 
 21.7770977235303  4.33468662639891e-10  0.00638417311977848 
 21.9280493535031  4.33195587795955e-10  0.00641992298969556 
 22.0800473301876  4.32919065152514e-10  0.00645575362187591 
 22.2330989065127  4.32639055890356e-10  0.00649166244634906 
 22.3872113856820  4.32355520879003e-10  0.00652764681185848 
 22.5423921215229  4.32068420677833e-10  0.00656370400568258 
 22.6986485188368  4.31777715537114e-10  0.00659983123687108 
 22.8559880337529  4.31483365399386e-10  0.00663602563878880 
 23.0144181740837  4.31185329900831e-10  0.00667228426032807 
 23.1739464996833  4.30883568372724e-10  0.00670860408783678 
 23.3345806228086  4.30578039843265e-10  0.00674498201887729 
 23.4963282084816  4.30268703039283e-10  0.00678141486665181 
 23.6591969748561  4.29955516388257e-10  0.00681789937109722 
 23.8231946935854  4.29638438020395e-10  0.00685443218395317 
 23.9883291901934  4.29317425770927e-10  0.00689100987250114 
 24.1546083444479  4.28992437182519e-10  0.00692762892098483 
 24.3220400907366  4.28663429507873e-10  0.00696428572122199 
 24.4906324184459  4.28330359712447e-10  0.00700097657669186 
 24.6603933723418  4.27993184477394e-10  0.00703769770506377 
 24.8313310529541  4.27651860202677e-10  0.00707444522687819 
 25.0034536169627  4.27306343010252e-10  0.00711121517461704 
 25.1767692775869  4.26956588747613e-10  0.00714800347982620 
 25.3512863049774  4.26602552991352e-10  0.00718480598447068 
 25.5270130266108  4.26244191051057e-10  0.00722161842398633 
 25.7039578276870  4.25881457973188e-10  0.00725843644543423 
 25.8821291515292  4.25514308545425e-10  0.00729525558740038 
 26.0615354999873  4.25142697301017e-10  0.00733207128821255 
 26.2421854338427  4.24766578523356e-10  0.00736887888563455 
 26.4240875732177  4.24385906250885e-10  0.00740567360710459 
 26.6072505979864  4.24000634282068e-10  0.00744245057235176 
 26.7916832481886  4.23610716180634e-10  0.00747920480447914 
 26.9773943244474  4.23216105281124e-10  0.00751593120070575 
 27.1643926883890  4.22816754694520e-10  0.00755262455762660 
 27.3526872630653  4.22412617314158e-10  0.00758927955748864 
 27.5422870333798  4.22003645822013e-10  0.00762589075983207 
 27.7332010465166  4.21589792694947e-10  0.00766245261984415 
 27.9254384123715  4.21171010211434e-10  0.00769895946771106 
 28.1190083039875  4.20747250458454e-10  0.00773540551503743 
 28.3139199579919  4.20318465338614e-10  0.00777178485562784 
 28.5101826750372  4.19884606577529e-10  0.00780809145675297 
 28.7078058202450  4.19445625731503e-10  0.00784431916325556 
 28.9067988236528  4.19001474195456e-10  0.00788046169275991 
 29.1071711806641  4.18552103211054e-10  0.00791651264201666 
 29.3089324525012  4.18097463875220e-10  0.00795246547113026 
 29.5120922666619  4.17637507148868e-10  0.00798831351159366 
 29.7166603173783  4.17172183865840e-10  0.00802404996790260 
 29.9226463660799  4.16701444742307e-10  0.00805966790257001 
 30.1300602418592  4.16225240386258e-10  0.00809516024915021 
 30.3389118419406  4.15743521307423e-10  0.00813051980101226 
 30.5492111321531  4.15256237927404e-10  0.00816573921420551 
 30.7609681474050  4.14763340590179e-10  0.00820081100544431 
 30.9741929921637  4.14264779572798e-10  0.00823572754982232 
 31.1888958409372  4.13760505096550e-10  0.00827048107687943 
 31.4050869387600  4.13250467338261e-10  0.00830506367545312 
 31.6227766016816  4.12734616441984e-10  0.00833946728583814 
 31.8419752172590  4.12212902531062e-10  0.00837368369562812 
 32.0626932450524  4.11685275720385e-10  0.00840770455163162 
 32.2849412171241  4.11151686129055e-10  0.00844152134405719 
 32.5087297385412  4.10612083893357e-10  0.00847512541667729 
 32.7340694878815  4.10066419180038e-10  0.00850850794967744 
 32.9609712177435  4.09514642199941e-10  0.00854165997536322 
 33.1894457552587  4.08956703221903e-10  0.00857457236937751 
 33.4195040026091  4.08392552587116e-10  0.00860723584522245 
 33.6511569375467  4.07822140723667e-10  0.00863964095842049 
 33.8844156139179  4.07245418161522e-10  0.00867177810407944 
 34.1192911621905  4.06662335547811e-10  0.00870363751583156 
 34.3557947899850  4.06072843662478e-10  0.00873520925765530 
 34.5939377826098  4.05476893434208e-10  0.00876648323594911 
 34.8337315035987  4.04874435956758e-10  0.00879744918945657 
 35.0751873952543  4.04265422505645e-10  0.00882809668105891 
 35.3183169791932  4.03649804555054e-10  0.00885841511472236 
 35.5631318568960  4.03027533795272e-10  0.00888839372221128 
 35.8096437102611  4.02398562150329e-10  0.00891802155786834 
 36.0578643021617  4.01762841796000e-10  0.00894728751083406 
 36.3078054770075  4.01120325178227e-10  0.00897618029342788 
 36.5594791613099  4.00470965031762e-10  0.00900468844301969 
 36.8128973642505  3.99814714399285e-10  0.00903280032100660 
 37.0680721782549  3.99151526650743e-10  0.00906050410989579 
 37.3250157795694  3.98481355503107e-10  0.00908778782214828 
 37.5837404288417  3.97804155040414e-10  0.00911463928647122 
 37.8442584717066  3.97119879734178e-10  0.00914104614953407 
 38.1065823393745  3.96428484464103e-10  0.00916699588114473 
 38.3707245492251  3.95729924539125e-10  0.00919247577054132 
 38.6366977054041  3.95024155718857e-10  0.00921747292381643 
 38.9045144994252  3.94311134235211e-10  0.00924197426463138 
 39.1741877107754  3.93590816814440e-10  0.00926596653525343 
 39.4457302075250  3.92863160699473e-10  0.00928943628911514 
 39.7191549469411  3.92128123672546e-10  0.00931236990104935 
 39.9944749761068  3.91385664078144e-10  0.00933475355989333 
 40.2717034325429  3.90635740846215e-10  0.00935657326816065 
 40.5508535448354  3.89878313515714e-10  0.00937781484415749 
 40.8319386332662  3.89113342258399e-10  0.00939846391876195 
 41.1149721104492  3.88340787902917e-10  0.00941850594087506 
 41.3999674819700  3.87560611959141e-10  0.00943792617005100 
 41.6869383470304  3.86772776642821e-10  0.00945670967781861 
 41.9758983990976  3.85977244900409e-10  0.00947484135457630 
 42.2668614265572  3.85173980434169e-10  0.00949230590215602 
 42.5598413133711  3.84362947727587e-10  0.00950908783975366 
 42.8548520397408  3.83544112070868e-10  0.00952517149496066 
 43.1519076827733  3.82717439586756e-10  0.00954054101333710 
 43.4510224171539  3.81882897256482e-10  0.00955518035703422 
 43.7522105158219  3.81040452946027e-10  0.00956907330590083 
 44.0554863506520  3.80190075432418e-10  0.00958220344775044 
 44.3608643931399  3.79331734430285e-10  0.00959455419404180 
 44.6683592150929  3.78465400618553e-10  0.00960610877205799 
 44.9779854893254  3.77591045667274e-10  0.00961685022586894 
 45.2897579903586  3.76708642264572e-10  0.00962676142112214 
 45.6036915951262  3.75818164143739e-10  0.00963582504079802 
 45.9198012836834  3.74919586110422e-10  0.00964402359481756 
 46.2381021399225  3.74012884069860e-10  0.00965133940810444 
 46.5586093522923  3.73098035054225e-10  0.00965775463641836 
 46.8813382145229  3.72175017250013e-10  0.00966325125171077 
 47.2063041263554  3.71243810025466e-10  0.00966781106587801 
 47.5335225942769  3.70304393958011e-10  0.00967141570446789 
 47.8630092322602  3.69356750861688e-10  0.00967404663154583 
 48.1947797625090  3.68400863814591e-10  0.00967568514527418 
 48.5288500162084  3.67436717186270e-10  0.00967631236635987 
 48.8652359342796  3.66464296665001e-10  0.00967590926288141 
 49.2039535681413  3.65483589285125e-10  0.00967445663169433 
 49.5450190804752  3.64494583454164e-10  0.00967193511514489 
 49.8884487459974  3.63497268979859e-10  0.00966832519670891 
 50.2342589522348  3.62491637097095e-10  0.00966360720448084 
 50.5824662003074  3.61477680494677e-10  0.00965776130726255 
 50.9330871057156  3.60455393341851e-10  0.00965076753150503 
 51.2861383991325  3.59424771314681e-10  0.00964260575378300 
 51.6416369272030  3.58385811622218e-10  0.00963325570575922 
 51.9995996533475  3.57338513032348e-10  0.00962269697539578 
 52.3600436585709  3.56282875897443e-10  0.00961090901484781 
 52.7229861422781  3.55218902179666e-10  0.00959787113816921 
 53.0884444230946  3.54146595475955e-10  0.00958356253180855 
 53.4564359396929  3.53065961042716e-10  0.00956796224741091 
 53.8269782516246  3.51977005820052e-10  0.00955104921297704 
 54.2000890401581  3.50879738455668e-10  0.00953280223966752 
 54.5757861091228  3.49774169328371e-10  0.00951320001257399 
 54.9540873857581  3.48660310571029e-10  0.00949222111286326 
 55.3350109215692  3.47538176093152e-10  0.00946984400113109 
 55.7185748931885  3.46407781602919e-10  0.00944604703833850 
 56.1047976032425  3.45269144628698e-10  0.00942080848443261 
 56.4936974812257  3.44122284540025e-10  0.00939410649602925 
 56.8852930843796  3.42967222567992e-10  0.00936591914181270 
 57.2796030985783  3.41803981825016e-10  0.00933622439851224 
 57.6766463392204  3.40632587324023e-10  0.00930500016385276 
 58.0764417521265  3.39453065996899e-10  0.00927222424833891 
 58.4790084144433  3.38265446712359e-10  0.00923787439344494 
 58.8843655355541  3.37069760293012e-10  0.00920192827317020 
 59.2925324579952  3.35866039531748e-10  0.00916436349051243 
 59.7035286583788  3.34654319207329e-10  0.00912515759299090 
 60.1173737483229  3.33434636099222e-10  0.00908428807305688 
 60.5340874753864  3.32207029001597e-10  0.00904173237356841 
 60.9536897240119  3.30971538736481e-10  0.00899746789563654 
 61.3762005164744  3.29728208166075e-10  0.00895147199770287 
 61.8016400138365  3.28477082204150e-10  0.00890372200963125 
 62.2300285169109  3.27218207826551e-10  0.00885419523269784 
 62.6613864672284  3.25951634080754e-10  0.00880286894786609 
 63.0957344480141  3.24677412094469e-10  0.00874972042038081 
 63.5330931851691  3.23395595083246e-10  0.00869472690260062 
 63.9734835482595  3.22106238357085e-10  0.00863786564604577 
 64.4169265515124  3.20809399326011e-10  0.00857911390654767 
 64.8634433548184  3.19505137504603e-10  0.00851844894049237 
 65.3130552647418  3.18193514515454e-10  0.00845584802713200 
 65.7657837355365  3.16874594091524e-10  0.00839128845933041 
 66.2216503701707  3.15548442077413e-10  0.00832474756165096 
 66.6806769213566  3.14215126429466e-10  0.00825620268921446 
 67.1428852925896  3.12874717214772e-10  0.00818563123203856 
 67.6082975391925  3.11527286608967e-10  0.00811301063454762 
 68.0769358693684  3.10172908892876e-10  0.00803831838527779 
 68.5488226452604  3.08811660447958e-10  0.00796153203346066 
 69.0239803840184  3.07443619750524e-10  0.00788262919286698 
 69.5024317588738  3.06068867364777e-10  0.00780158754835085 
 69.9841996002215  3.04687485934566e-10  0.00771838486145560 
 70.4693068967087  3.03299560173941e-10  0.00763299897785076 
 70.9577767963329  3.01905176856414e-10  0.00754540783107943 
 71.4496326075453  3.00504424803007e-10  0.00745558945347998 
 71.9448978003638  2.99097394868964e-10  0.00736352198166442 
 72.4435960074928  2.97684179929252e-10  0.00726918365669579 
 72.9457510254507  2.96264874862733e-10  0.00717255284160349 
 73.4513868157052  2.94839576535098e-10  0.00707360801666692 
 73.9605275058175  2.93408383780438e-10  0.00697232779187430 
 74.4731973905925  2.91971397381628e-10  0.00686869091028717 
 74.9894209332391  2.90528720049315e-10  0.00676267625981141 
 75.5092227665369  2.89080456399723e-10  0.00665426287220208 
 76.0326276940116  2.87626712931084e-10  0.00654342993335002 
 76.5596606911190  2.86167597998835e-10  0.00643015678792569 
 77.0903469064363  2.84703221789561e-10  0.00631442294414854 
 77.6247116628625  2.83233696293600e-10  0.00619620808792553 
 78.1627804588262  2.81759135276472e-10  0.00607549207379298 
 78.7045789695030  2.80279654249003e-10  0.00595225494425561 
 79.2501330480403  2.78795370436224e-10  0.00582647692814431 
 79.7994687267907  2.77306402745072e-10  0.00569813845227031 
 80.3526122185547  2.75812871730844e-10  0.00556722013491049 
 80.9095899178312  2.74314899562469e-10  0.00543370280748787 
 81.4704284020768  2.72812609986627e-10  0.00529756751062726 
 82.0351544329747  2.71306128290678e-10  0.00515879549378037 
 82.6037949577106  2.69795581264458e-10  0.00501736823737649 
 83.1763771102598  2.68281097160980e-10  0.00487326743658461 
 83.7529282126809  2.66762805656011e-10  0.00472647502322460 
 84.3334757764201  2.65240837806601e-10  0.00457697316293309 
 84.9180475036239  2.63715326008553e-10  0.00442474426015863 
 85.5066712884608  2.62186403952889e-10  0.00426977096177211 
 86.0993752184524  2.60654206581309e-10  0.00411203616310987 
 86.6961875758139  2.59118870040708e-10  0.00395152301345300 
 87.2971368388034  2.57580531636748e-10  0.00378821491854898 
 87.9022516830806  2.56039329786544e-10  0.00362209553636247 
 88.5115609830757  2.54495403970476e-10  0.00345314880037714 
 89.1250938133666  2.52948894683181e-10  0.00328135889655006 
 89.7428794500668  2.51399943383732e-10  0.00310671029091880 
 90.3649473722220  2.49848692445084e-10  0.00292918771857921 
 90.9913272632170  2.48295285102770e-10  0.00274877618927109 
 91.6220490121917  2.46739865402941e-10  0.00256546099118300 
 92.2571427154680  2.45182578149739e-10  0.00237922769644124 
 92.8966386779852  2.43623568852079e-10  0.00219006215602768 
 93.5405674147468  2.42062983669870e-10  0.00199795050511253 
 94.1889596522756  2.40500969359706e-10  0.00180287917049928 
 94.8418463300812  2.38937673220079e-10  0.00160483486426763 
 95.4992586021349  2.37373243036170e-10  0.00140380458652657 
 96.1612278383578  2.35807827024229e-10  0.00119977563259868 
 96.8277856261161  2.34241573775622e-10  0.000992735585099481 
 97.4989637717298  2.32674632200566e-10  0.000782672325765258 
 98.1747943019895  2.31107151471615e-10  0.000569574023162149 
 98.8553094656849  2.29539280966920e-10  0.000353429143880146 
 99.5405417351436  2.27971170213341e-10  0.000134226448766389 
 100.230523807781  2.26402968829419e-10 -8.80450103978194e-05 
 100.925288607659  2.24834826468290e-10 -0.000313395884690750 
 101.624869287060  2.23266892760561e-10 -0.000541836534567667 
 102.329299228066  2.21699317257206e-10 -0.000773377028837486 
 103.038612044152  2.20132249372533e-10 -0.00100802713971379 
 103.752841581792  2.18565838327251e-10 -0.00124579635335869 
 104.472021922070  2.17000233091702e-10 -0.00148669386457458 
 105.196187382313  2.15435582329291e-10 -0.00173072858513106 
 105.925372517719  2.13872034340172e-10 -0.00197790913337676 
 106.659612123016  2.12309737005215e-10 -0.00222824385003578 
 107.398941234114  2.10748837730322e-10 -0.00248174079189267 
 108.143395129784  2.09189483391121e-10 -0.00273840773453829 
 108.893009333333  2.07631820278088e-10 -0.00299825218262091 
 109.647819614308  2.06075994042133e-10 -0.00326128135913870 
 110.407861990197  2.04522149640710e-10 -0.00352750222760306 
 111.173172728149  2.02970431284466e-10 -0.00379692147237824 
 111.943788346705  2.01420982384503e-10 -0.00406954551926845 
 112.719745617540  1.99873945500253e-10 -0.00434538053591073 
 113.501081567221  1.98329462288055e-10 -0.00462443242690478 
 114.287833478966  1.96787673450418e-10 -0.00490670684984288 
 115.080038894433  1.95248718686054e-10 -0.00519220921056997 
 115.877735615502  1.93712736640697e-10 -0.00548094467244848 
 116.680961706085  1.92179864858732e-10 -0.00577291815937185 
 117.489755493942  1.90650239735695e-10 -0.00606813436112199 
 118.304155572505  1.89123996471662e-10 -0.00636659773308639 
 119.124200802726  1.87601269025553e-10 -0.00666831251011324 
 119.949930314926  1.86082190070396e-10 -0.00697328270867827 
 120.781383510666  1.84566890949581e-10 -0.00728151212455632 
 121.618600064625  1.83055501634109e-10 -0.00759300434990319 
 122.461619926493  1.81548150680895e-10 -0.00790776277205179 
 123.310483322879  1.80044965192130e-10 -0.00822579058080890 
 124.165230759229  1.78546070775734e-10 -0.00854709077474630 
 125.025903021760  1.77051591506918e-10 -0.00887166616765673 
 125.892541179405  1.75561649890888e-10 -0.00919951939013203 
 126.765186585772  1.74076366826692e-10 -0.00953065290528770 
 127.643880881122  1.72595861572245e-10 -0.00986506900773328 
 128.528665994349  1.71120251710555e-10 -0.0102027698277583 
 129.419584144986  1.69649653117141e-10 -0.0105437573505368 
 130.316677845217  1.68184179928674e-10 -0.0108880334054521 
 131.219989901908  1.66723944512868e-10 -0.0112355996883916 
 132.129563418645  1.65269057439594e-10 -0.0115864577607241 
 133.045441797796  1.63819627453267e-10 -0.0119406090538269 
 133.967668742581  1.62375761446498e-10 -0.0122980548866840 
 134.896288259152  1.60937564435005e-10 -0.0126587964623891 
 135.831344658702  1.59505139533823e-10 -0.0130228348774701 
 136.772882559572  1.58078587934774e-10 -0.0133901711371690 
 137.720946889381  1.56658008885251e-10 -0.0137608061510251 
 138.675582887175  1.55243499668256e-10 -0.0141347407454045 
 139.636836105580  1.53835155583760e-10 -0.0145119756778584 
 140.604752412978  1.52433069931345e-10 -0.0148925116271290 
 141.579377995694  1.51037333994097e-10 -0.0152763492218592 
 142.560759360205  1.49648037023830e-10 -0.0156634890311280 
 143.548943335351  1.48265266227557e-10 -0.0160539315794031 
 144.543977074578  1.46889106755248e-10 -0.0164476773562251 
 145.545908058182  1.45519641688832e-10 -0.0168447268151831 
 146.554784095577  1.44156952032482e-10 -0.0172450803898402 
 147.570653327575  1.42801116704124e-10 -0.0176487384982879 
 148.593564228686  1.41452212528195e-10 -0.0180557015489969 
 149.623565609428  1.40110314229617e-10 -0.0184659699500831 
 150.660706618659  1.38775494428989e-10 -0.0188795441160636 
 151.705036745918  1.37447823638966e-10 -0.0192964244765990 
 152.756605823792  1.36127370261837e-10 -0.0197166114823088 
 153.815464030288  1.34814200588253e-10 -0.0201401056126259 
 154.881661891233  1.33508378797108e-10 -0.0205669073836182 
 155.955250282680  1.32209966956576e-10 -0.0209970173523279 
 157.036280433339  1.30919025026217e-10 -0.0214304361320845 
 158.124803927022  1.29635610860222e-10 -0.0218671643890570 
 159.220872705101  1.28359780211714e-10 -0.0223072028569287 
 160.324539068988  1.27091586738099e-10 -0.0227505523425607 
 161.435855682632  1.25831082007457e-10 -0.0231972137287902 
 162.554875575032  1.24578315505957e-10 -0.0236471879889304 
 163.681652142764  1.23333334646229e-10 -0.0241004761882038 
 164.816239152534  1.22096184776735e-10 -0.0245570794906148 
 165.958690743739  1.20866909192076e-10 -0.0250169991646929 
 167.109061431054  1.19645549144191e-10 -0.0254802365990594 
 168.267406107030  1.18432143854487e-10 -0.0259467932984544 
 169.433780044716  1.17226730526821e-10 -0.0264166708963214 
 170.608238900295  1.16029344361325e-10 -0.0268898711537745 
 171.790838715741  1.14840018569050e-10 -0.0273663959783119 
 172.981635921492  1.13658784387417e-10 -0.0278462474198588 
 174.180687339144  1.12485671096420e-10 -0.0283294276802746 
 175.388050184158  1.11320706035576e-10 -0.0288159391210147 
 176.603782068598  1.10163914621594e-10 -0.0293057842678266 
 177.827941003874  1.09015320366729e-10 -0.0297989658132113 
 179.060585403511  1.07874944897797e-10 -0.0302954866270215 
 180.301774085938  1.06742807975840e-10 -0.0307953497643376 
 181.551566277295  1.05618927516379e-10 -0.0312985584613206 
 182.810021614255  1.04503319610264e-10 -0.0318051161505274 
 184.077200146877  1.03395998545086e-10 -0.0323150264626642 
 185.353162341462  1.02296976827103e-10 -0.0328282932284854 
 186.637969083448  1.01206265203685e-10 -0.0333449204928065 
 187.931681680307  1.00123872686232e-10 -0.0338649125084784 
 189.234361864478  9.90498065735506e-11 -0.0343882737469266 
 190.546071796305  9.79840724756381e-11 -0.0349150089096209 
 191.866874067009  9.69266743378961e-11 -0.0354451229196571 
 193.196831701672  9.58776144657015e-11 -0.0359786209340272 
 194.536008162246  9.48368935493275e-11 -0.0365155083503461 
 195.884467350578  9.38045106892049e-11 -0.0370557908057305 
 197.242273611465  9.27804634214785e-11 -0.0375994741842153 
 198.609491735716  9.17647477438304e-11 -0.0381465646179812 
 199.986186963253  9.07573581415789e-11 -0.0386970684985728 
 201.372424986218  8.97582876139995e-11 -0.0392509924705776 
 202.768271952107  8.87675277008402e-11 -0.0398083434451284 
 204.173794466931  8.77850685090411e-11 -0.0403691286003044 
 205.589059598392  8.68108987396209e-11 -0.0409333553793826 
 207.014134879082  8.58450057146812e-11 -0.0415010315043297 
 208.449088309707  8.48873754045495e-11 -0.0420721649729709 
 209.893988362330  8.39379924550224e-11 -0.0426467640616209 
 211.348903983642  8.29968402146851e-11 -0.0432248373320528 
 212.813904598249  8.20639007622814e-11 -0.0438063936345282 
 214.289060111983  8.11391549341407e-11 -0.0443914421058193 
 215.774440915244  8.02225823516091e-11 -0.0449799921801418 
 217.270117886351  7.93141614484939e-11 -0.0455720535866665 
 218.776162394932  7.84138694985010e-11 -0.0461676363489424 
 220.292646305322  7.75216826426053e-11 -0.0467667507995894 
 221.819641979998  7.66375759164299e-11 -0.0473694075698104 
 223.357222283029  7.57615232774868e-11 -0.0479756176011610 
 224.905460583554  7.48934976324009e-11 -0.0485853921433066 
 226.464430759282  7.40334708640014e-11 -0.0491987427561139 
 228.034207200017  7.31814138583094e-11 -0.0498156813143803 
 229.614864811211  7.23372965313931e-11 -0.0504362200119703 
 231.206479017534  7.15010878561058e-11 -0.0510603713565771 
 232.809125766476  7.06727558886320e-11 -0.0516881481777236 
 234.422881531967  6.98522677949085e-11 -0.0523195636282931 
 236.047823318032  6.90395898768241e-11 -0.0529546311876255 
 237.684028662462  6.82346875982730e-11 -0.0535933646524261 
 239.331575640513  6.74375256109741e-11 -0.0542357781577384 
 240.990542868633  6.66480677800871e-11 -0.0548818861606095 
 242.661009508215  6.58662772096074e-11 -0.0555317034507041 
 244.343055269370  6.50921162675262e-11 -0.0561852451543943 
 246.036760414736  6.43255466107544e-11 -0.0568425267250439 
 247.742205763301  6.35665292097870e-11 -0.0575035639577545 
 249.459472694268  6.28150243731043e-11 -0.0581683729786838 
 251.188643150930  6.20709917713250e-11 -0.0588369702585102 
 252.929799644587  6.13343904610579e-11 -0.0595093725971090 
 254.683025258476  6.06051789085007e-11 -0.0601855971477476 
 256.448403651743  5.98833150127191e-11 -0.0608656613932350 
 258.226019063431  5.91687561286536e-11 -0.0615495831669963 
 260.015956316498  5.84614590898238e-11 -0.0622373806393814 
 261.818300821870  5.77613802307097e-11 -0.0629290723314090 
 263.633138582509  5.70684754088388e-11 -0.0636246771065324 
 265.460556197525  5.63827000265590e-11 -0.0643242141705364 
 267.300640866301  5.57040090524734e-11 -0.0650277030826326 
 269.153480392662  5.50323570425669e-11 -0.0657351637477026 
 271.019163189054  5.43676981610101e-11 -0.0664466164182307 
 272.897778280774  5.37099862006149e-11 -0.0671620816940985 
 274.789415310209  5.30591746029750e-11 -0.0678815805270755 
 276.694164541120  5.24152164782527e-11 -0.0686051342205826 
 278.612116862946  5.17780646246555e-11 -0.0693327644281924 
 280.543363795140  5.11476715475457e-11 -0.0700644931526380 
 282.487997491539  5.05239894782284e-11 -0.0708003427516505 
 284.446110744760  4.99069703923868e-11 -0.0715403359318361 
 286.417796990626  4.92965660281816e-11 -0.0722844957589717 
 288.403150312628  4.86927279040067e-11 -0.0730328456466349 
 290.402265446412  4.80954073358995e-11 -0.0737854093634796 
 292.415237784301  4.75045554546117e-11 -0.0745422110345021 
 294.442163379843  4.69201232223265e-11 -0.0753032751388411 
 296.483138952401  4.63420614490555e-11 -0.0760686265079218 
 298.538261891762  4.57703208086683e-11 -0.0768382903301400 
 300.607630262789  4.52048518545922e-11 -0.0776122921522641 
 302.691342810096  4.46456050351869e-11 -0.0783906578742151 
 304.789498962764  4.40925307087507e-11 -0.0791734137499408 
 306.902198839081  4.35455791582157e-11 -0.0799605863955759 
 309.029543251324  4.30047006054940e-11 -0.0807522027797040 
 311.171633710566  4.24698452255014e-11 -0.0815482902283463 
 313.328572431523  4.19409631598362e-11 -0.0823488764272476 
 315.500462337427  4.14180045301429e-11 -0.0831539894182024 
 317.687407064941  4.09009194511447e-11 -0.0839636576005731 
 319.889510969103  4.03896580433480e-11 -0.0847779097319463 
 322.106879128306  3.98841704454326e-11 -0.0855967749300432 
 324.339617349312  3.93844068263225e-11 -0.0864202826660636 
 326.587832172298  3.88903173969337e-11 -0.0872484627792264 
 328.851630875945  3.84018524216243e-11 -0.0880813454563251 
 331.131121482553  3.79189622293248e-11 -0.0889189612534549 
 333.426412763197  3.74415972243653e-11 -0.0897613410777040 
 335.737614242916  3.69697078970017e-11 -0.0906085162055678 
 338.064836205943  3.65032448336435e-11 -0.0914605182633307 
 340.408189700961  3.60421587267887e-11 -0.0923173792441724 
 342.767786546411  3.55864003846621e-11 -0.0931791315002818 
 345.143739335816  3.51359207405642e-11 -0.0940458077450261 
 347.536161443165  3.46906708619555e-11 -0.0949174410501622 
 349.945167028317  3.42506019592287e-11 -0.0957940648520838 
 352.370871042446  3.38156653942347e-11 -0.0966757129477965 
 354.813389233534  3.33858126885202e-11 -0.0975624194970867 
 357.272838151887  3.29609955313036e-11 -0.0984542190190491 
 359.749335155700  3.25411657871785e-11 -0.0993511464002365 
 362.242998416656  3.21262755035728e-11 -0.100253236885654 
 364.753946925565  3.17162769179366e-11 -0.101160526087116 
 367.282300498041  3.13111224646870e-11 -0.102073049975976 
 369.828179780223  3.09107647819013e-11 -0.102990844893731 
 372.391706254525  3.05151567177724e-11 -0.103913947541511 
 374.973002245439  3.01242513368181e-11 -0.104842394987715 
 377.572190925371  2.97380019258578e-11 -0.105776224666638 
 380.189396320516  2.93563619997651e-11 -0.106715474377750 
 382.824743316777  2.89792853069855e-11 -0.107660182284968 
 385.478357665726  2.86067258348305e-11 -0.108610386922326 
 388.150365990602  2.82386378145650e-11 -0.109566127190924 
 390.840895792356  2.78749757262668e-11 -0.110527442357847 
 393.550075455731  2.75156943034906e-11 -0.111494372059952 
 396.278034255392  2.71607485377100e-11 -0.112466956304415 
 399.024902362095  2.68100936825762e-11 -0.113445235467122 
 401.790810848892  2.64636852579639e-11 -0.114429250293236 
 404.575891697394  2.61214790538307e-11 -0.115419041901601 
 407.380277804064  2.57834311338948e-11 -0.116414651781897 
 410.204102986558  2.54494978391068e-11 -0.117416121795251 
 413.047501990112  2.51196357909662e-11 -0.118423494178004 
 415.910610493972  2.47938018946398e-11 -0.119436811536117 
 418.793565117868  2.44719533419222e-11 -0.120456116856969 
 421.696503428532  2.41540476140134e-11 -0.121481453498352 
 424.619563946262  2.38400424841459e-11 -0.122512865198075 
 427.562886151535  2.35298960200330e-11 -0.123550396069025 
 430.526610491659  2.32235665861813e-11 -0.124594090600750 
 433.510878387477  2.29210128460285e-11 -0.125643993667213 
 436.515832240113  2.26221937639429e-11 -0.126700150517018 
 439.541615437771  2.23270686070765e-11 -0.127762606780595 
 442.588372362573  2.20355969470641e-11 -0.128831408475176 
 445.656248397449  2.17477386616045e-11 -0.129906601995659 
 448.745389933078  2.14634539358807e-11 -0.130988234123927 
 451.855944374868  2.11827032638697e-11 -0.132076352025468 
 454.988060149993  2.09054474495110e-11 -0.133171003253235 
 458.141886714478  2.06316476077539e-11 -0.134272235747400 
 461.317574560323  2.03612651654856e-11 -0.135380097835412 
 464.515275222693  2.00942618623331e-11 -0.136494638236433 
 467.735141287141  1.98305997513589e-11 -0.137615906060242 
 470.977326396895  1.95702411996402e-11 -0.138743950809291 
 474.241985260187  1.93131488887396e-11 -0.139878822375482 
 477.529273657632  1.90592858150676e-11 -0.141020571054316 
 480.839348449670  1.88086152901499e-11 -0.142169247527540 
 484.172367584040  1.85611009407878e-11 -0.143324902882156 
 487.528490103326  1.83167067091236e-11 -0.144487588599955 
 490.907876152542  1.80753968526168e-11 -0.145657356564369 
 494.310686986774  1.78371359439218e-11 -0.146834259061251 
 497.737084978874  1.76018888706845e-11 -0.148018348780291 
 501.187233627210  1.73696208352515e-11 -0.149209678814303 
 504.661297563466  1.71402973542909e-11 -0.150408302664513 
 508.159442560498  1.69138842583473e-11 -0.151614274238665 
 511.681835540244  1.66903476913018e-11 -0.152827647856775 
 515.228644581693  1.64696541097713e-11 -0.154048478246708 
 518.800038928896  1.62517702824301e-11 -0.155276820552012 
 522.396188999055  1.60366632892590e-11 -0.156512730329918 
 526.017266390641  1.58243005207350e-11 -0.157756263554084 
 529.663443891592  1.56146496769468e-11 -0.159007476616308 
 533.334895487554  1.54076787666545e-11 -0.160266426331885 
 537.031796370186  1.52033561062874e-11 -0.161533169931120 
 540.754322945513  1.50016503188793e-11 -0.162807765075036 
 544.502652842353  1.48025303329550e-11 -0.164090269847265 
 548.276964920785  1.46059653813579e-11 -0.165380742757186 
 552.077439280688  1.44119250000262e-11 -0.166679242749804 
 555.904257270334  1.42203790267236e-11 -0.167985829194252 
 559.757601495039  1.40312975997135e-11 -0.169300561898402 
 563.637655825883  1.38446511563988e-11 -0.170623501105001 
 567.544605408475  1.36604104319089e-11 -0.171954707492401 
 571.478636671795  1.34785464576467e-11 -0.173294242181248 
 575.439937337084  1.32990305598002e-11 -0.174642166732867 
 579.428696426808  1.31218343578062e-11 -0.175998543155284 
 583.445104273671  1.29469297627884e-11 -0.177363433898485 
 587.489352529702  1.27742889759506e-11 -0.178736901864789 
 591.561634175399  1.26038844869434e-11 -0.180119010407973 
 595.662143528935  1.24356890721936e-11 -0.181509823331001 
 599.791076255433  1.22696757932096e-11 -0.182909404898261 
 603.948629376303  1.21058179948507e-11 -0.184317819827322 
 608.135001278640  1.19440893035761e-11 -0.185735133297395 
 612.350391724695  1.17844636256625e-11 -0.187161410952279 
 616.595001861403  1.16269151454022e-11 -0.188596718900743 
 620.869034229984  1.14714183232730e-11 -0.190041123716824 
 625.172692775606  1.13179478940910e-11 -0.191494692450185 
 629.506182857117  1.11664788651410e-11 -0.192957492616456 
 633.869711256846  1.10169865142849e-11 -0.194429592213213 
 638.263486190466  1.08694463880603e-11 -0.195911059713593 
 642.687717316937  1.07238342997524e-11 -0.197401964071366 
 647.142615748500  1.05801263274572e-11 -0.198902374722603 
 651.628394060759  1.04382988121286e-11 -0.200412361593748 
 656.145266302820  1.02983283556099e-11 -0.201931995098543 
 660.693448007511  1.01601918186566e-11 -0.203461346139748 
 665.273156201655  1.00238663189454e-11 -0.205000486120744 
 669.884609416440  9.88932922907363e-12 -0.206549486935537 
 674.528027697834  9.75655817455006e-12 -0.208108420983519 
 679.203632617097  9.62553103177656e-12 -0.209677361166488 
 683.911647281340  9.49622592602233e-12 -0.211256380892696 
 688.652296344187  9.36862122939317e-12 -0.212845554078054 
 693.425806016479  9.24269555879181e-12 -0.214444955153826 
 698.232404077081  9.11842777387798e-12 -0.216054659063948 
 703.072319883742  8.99579697501984e-12 -0.217674741272315 
 707.945784384046  8.87478250124539e-12 -0.219305277764869 
 712.853030126426  8.75536392819073e-12 -0.220946345050859 
 717.794291271268  8.63752106604470e-12 -0.222598020169800 
 722.769803602076  8.52123395749573e-12 -0.224260380690566 
 727.779804536729  8.40648287567573e-12 -0.225933504717575 
 732.824533138808  8.29324832210432e-12 -0.227617470891620 
 737.904230129004  8.18151102463686e-12 -0.229312358397235 
 743.019137896604  8.07125193541053e-12 -0.231018246961342 
 748.169500511056  7.96245222879414e-12 -0.232735216859398 
 753.355563733618  7.85509329934148e-12 -0.234463348918469 
 758.577575029083  7.74915675974665e-12 -0.236202724518532 
 763.835783577590  7.64462443880347e-12 -0.237953425600789 
 769.130440286508  7.54147837936977e-12 -0.239715534668089 
 774.461797802416  7.43970083633661e-12 -0.241489134784910 
 779.830110523155  7.33927427460108e-12 -0.243274309587419 
 785.235634609968  7.24018136704832e-12 -0.245071143285024 
 790.678627999720  7.14240499253559e-12 -0.246879720661735 
 796.159350417213  7.04592823388642e-12 -0.248700127081126 
 801.678063387572  6.95073437588987e-12 -0.250532448494871 
 807.235030248731  6.85680690330806e-12 -0.252376771435183 
 812.830516163991  6.76412949889096e-12 -0.254233183029327 
 818.464788134681  6.67268604140089e-12 -0.256101770999502 
 824.138115012892  6.58246060364203e-12 -0.257982623667871 
 829.850767514312  6.49343745050347e-12 -0.259875829955738 
 835.603018231136  6.40560103700760e-12 -0.261781479394904 
 841.395141645083  6.31893600636968e-12 -0.263699662125174 
 847.227414140483  6.23342718806762e-12 -0.265630468903876 
 853.100114017475  6.14905959592007e-12 -0.267573991105402 
 859.013521505280  6.06581842617623e-12 -0.269530320725636 
 864.967918775577  5.98368905561639e-12 -0.271499550389138 
 870.963589955963  5.90265703966124e-12 -0.273481773351856 
 877.000821143516  5.82270811049448e-12 -0.275477083503781 
 883.079900418444  5.74382817519607e-12 -0.277485575377663 
 889.201117857828  5.66600331388572e-12 -0.279507344142577 
 895.364765549473  5.58921977787954e-12 -0.281542485625168 
 901.571137605835  5.51346398785676e-12 -0.283591096296521 
 907.820530178063  5.43872253204087e-12 -0.285653273289032 
 914.113241470126  5.36498216439019e-12 -0.287729114393532 
 920.449571753046  5.29222980280213e-12 -0.289818718069744 
 926.829823379223  5.22045252733063e-12 -0.291922183443389 
 933.254300796864  5.14963757841368e-12 -0.294039610317275 
 939.723310564510  5.07977235511624e-12 -0.296171099174414 
 946.237161365664  5.01084441338406e-12 -0.298316751176428 
 952.796164023522  4.94284146431149e-12 -0.300476668178977 
 959.400631515802  4.87575137242124e-12 -0.302650952726132 
 966.050878989681  4.80956215395788e-12 -0.304839708063891 
 972.747223776832  4.74426197519499e-12 -0.307043038136492 
 979.489985408565  4.67983915075419e-12 -0.309261047599829 
 986.279485631076  4.61628214193912e-12 -0.311493841815405 
 993.116048420797  4.55357955508092e-12 -0.313741526867121 
 1000.00000000000  4.49172013989743e-12 -0.316004209559350 