-3.00000000000000  0.0237955189160263  0.00000000000000  3.51759204240232  0.00000000000000  0.154257962245150  103.752488563903  1.87552447128858 -1.88582822626096 
-2.94000000000000  0.0199048897710227  0.00000000000000  4.39917967567618  0.00000000000000  0.141084690066012  114.849053790156  2.09742215008714  9.79840848795659 
-2.88000000000000  0.0153441336570124  0.00000000000000  5.45874747290522  0.00000000000000  0.123871440037696  126.118740998199  2.33639625768088  21.3523771566260 
-2.82000000000000  0.0105744049016700  0.00000000000000  6.72298585666181  0.00000000000000  0.102831925498213  137.892503579695  2.59287212501153  32.7747416367747 
-2.76000000000000  0.00615894081141580  0.00000000000000  8.22130888969999  0.00000000000000  0.0784789195352216  151.007669607188  2.86728249213432  44.0630112822943 
-2.70000000000000  0.00269423979576793  0.00000000000000  9.98613667069801  0.00000000000000  0.0519060670419934  168.210813806462  3.16008491510877  55.2134053470693 
-2.64000000000000  0.000718597543093060  0.00000000000000  12.0532317332848  0.00000000000000  0.0268066697501399 -156.753177818696  3.47177645208973  66.2207465666385 
-2.58000000000000  0.000611860469586676  0.00000000000000  14.4620720221627  0.00000000000000  0.0247358135016150 -73.0810346186368  3.80290310449303  77.0783984434776 
-2.52000000000000  0.00250806788039109  0.00000000000000  17.2562273808733  0.00000000000000  0.0500806138180343 -34.0038005820743  4.15406155236935  87.7782605960444 
-2.46000000000000  0.00624871279255869  0.00000000000000  20.4836903434272  0.00000000000000  0.0790488000703283 -17.9120939611464  4.52589111042535  98.3108344615361 
-2.40000000000000  0.0114068764949833  0.00000000000000  24.1970977871403  0.00000000000000  0.106802979803859 -7.83855349923867  4.91905456232601  108.665367411287 
-2.34000000000000  0.0174102901626416  0.00000000000000  28.4537704101756  0.00000000000000  0.131948058578524 -0.763215026054503  5.33420757096831  118.830077065586 
-2.28000000000000  0.0237846274190890  0.00000000000000  33.3154946937132  0.00000000000000  0.154222655336656  3.94616649631544  5.77195761364489  128.792449871556 
-2.22000000000000  0.0305293661886742  0.00000000000000  38.8479790707456  0.00000000000000  0.174726546891634  6.30769195563383  6.23281469889372  138.539599872966 
-2.16000000000000  0.0386323737457558  0.00000000000000  45.1199334619995  0.00000000000000  0.196551198789924  6.29854127430314  6.71713729664650  148.058666374253 
-2.10000000000000  0.0507335575098061  0.00000000000000  52.2017487078351  0.00000000000000  0.225241109724238  4.33048312320333  7.22507776482961  157.337224188487 
-2.04000000000000  0.0719717080402953  0.00000000000000  60.1637876242447  0.00000000000000  0.268275433165796  1.55690474678677  7.75653193278057  166.363678314327 
-1.98000000000000  0.111100833948788  0.00000000000000  69.0743387694441  0.00000000000000  0.333317917233365 -0.478045554568292  8.31109732643314  175.127616545364 
-1.92000000000000  0.182048088934633  0.00000000000000  78.9973226656732  0.00000000000000  0.426670937532231 -0.669385084046632  8.88804380421660 -176.379901701464 
-1.86000000000000  0.306202654745854  0.00000000000000  89.9898727933719  0.00000000000000  0.553355812064764  1.27935762524456  9.48629921483462 -168.166135120063 
-1.80000000000000  0.515860276208214  0.00000000000000  102.099935094481  0.00000000000000  0.718234137456732  5.11974076188911  10.1044512515268 -160.236535809421 
-1.74000000000000  0.859374195494519  0.00000000000000  115.364036117907  0.00000000000000  0.927024376968869  10.4189504536994  10.7407651551417 -152.594709763460 
-1.68000000000000  1.40863836058907  0.00000000000000  129.805359382924  0.00000000000000  1.18686071659192  16.7509253267999  11.3932154979586 -145.242456221283 
-1.62000000000000  2.26950032349949  0.00000000000000  145.432242481477  0.00000000000000  1.50648608473477  23.7556350568078  12.0595291152465 -138.179875471434 
-1.56000000000000  3.59551316958758  0.00000000000000  162.237166772058  0.00000000000000  1.89618384382622  31.1444121383103  12.7372354446347 -131.405532575514 
-1.50000000000000  5.60504074290807  0.00000000000000  180.196262159121  0.00000000000000  2.36749672500472  38.6911757887336  13.4237201311380 -124.916663977687 
-1.44000000000000  8.60110476927758  0.00000000000000  199.269297613986  0.00000000000000  2.93276401527255  46.2225489457311  14.1162777535010 -118.709414589831 
-1.38000000000000  12.9925223143252  0.00000000000000  219.400080314321  0.00000000000000  3.60451415787554  53.6093010054083  14.8121598801229 -112.779094145156 
-1.32000000000000  19.3138961148414  0.00000000000000  240.517148455448  0.00000000000000  4.39475779933791  60.7587952572916  15.5086152978094 -107.120442938446 
-1.26000000000000  28.2410161500027  0.00000000000000  262.534619388599  0.00000000000000  5.31422770964914  67.6080040754468  16.2029200883236 -101.727898212236 
-1.20000000000000  40.5973896627717  0.00000000000000  285.353048362563  0.00000000000000  6.37160809080186  74.1170413656451  16.8923961699506 -96.5958532668678 
-1.14000000000000  57.3471554940258  0.00000000000000  308.860164426651  0.00000000000000  7.57279046943898  80.2633904191817  17.5744178972349 -91.7189018800999 
-1.08000000000000  79.5697773570392  0.00000000000000  332.931377922561  0.00000000000000  8.92018931172648  86.0370122129211  18.2464072606790 -87.0920609402746 
-1.02000000000000  108.412830600140  0.00000000000000  357.429996074804  0.00000000000000  10.4121482221557  91.4364128691675  18.9058191061589 -82.7109645086867 
-0.960000000000000  145.020992506026  0.00000000000000  382.207136199995  0.00000000000000  12.0424662136136  96.4656315432123  19.5501185725303 -78.5720230265579 
-0.900000000000000  190.441982062467  0.00000000000000  407.101386033229  0.00000000000000  13.8000718136706  101.132030760557  20.1767536049095 -74.6725422330870 
-0.840000000000000  245.513478228043  0.00000000000000  431.938322981225  0.00000000000000  15.6688697176294  105.444737649044  20.7831259193901 -71.0107976613377 
-0.780000000000000  310.738620688359  0.00000000000000  456.530063293895  0.00000000000000  17.6277798003140  109.413584784808  21.3665641433969 -67.5860623396876 
-0.720000000000000  386.161073087537  0.00000000000000  480.675061764502  0.00000000000000  19.6509814789882  113.048418222960  21.9243029938126 -64.3985874670895 
-0.660000000000000  471.253237961343  0.00000000000000  504.158415329747  0.00000000000000  21.7083679248658  116.358665904750  22.4534722332593 -61.4495381867095 
-0.600000000000000  564.832495855101  0.00000000000000  526.752932261866  0.00000000000000  23.7662049106520  119.353084978643  22.9510987157884 -58.7408889331162 
-0.540000000000000  665.019847937107  0.00000000000000  548.221205772354  0.00000000000000  25.7879787485779  122.039628360347  23.4141240658786 -56.2752849304868 
-0.480000000000000  769.252828054017  0.00000000000000  568.318872422319  0.00000000000000  27.7354074795020  124.425388131327  23.8394394317970 -54.0558780516241 
-0.420000000000000  874.360055460165  0.00000000000000  586.799141496651  0.00000000000000  29.5695798999608  126.516586371182  24.2239373656854 -52.0861462487328 
-0.360000000000000  976.698680679795  0.00000000000000  603.418556671059  0.00000000000000  31.2521788149210  128.318593443891  24.5645793098734 -50.3697060645504 
-0.300000000000000  1072.34889312000  0.00000000000000  617.943807166562  0.00000000000000  32.7467386638731  129.835960409160  24.8584755599888 -48.9101273541408 
-0.240000000000000  1157.35249795813  0.00000000000000  630.159258872176  0.00000000000000  34.0198838616202  131.072456823918  25.1029731082232 -47.7107584118499 
-0.180000000000000  1227.97632643056  0.00000000000000  639.874746845313  0.00000000000000  35.0424931537492  132.031108314196  25.2957456273839 -46.7745683871187 
-0.120000000000000  1280.97686731032  0.00000000000000  646.933079802864  0.00000000000000  35.7907371719320  132.714230374627  25.4348791977250 -46.1040123956126 
-0.0600000000000001  1313.84074367783  0.00000000000000  651.216672038243  0.00000000000000  36.2469411630530  133.123456214990  25.5189473144611 -45.7009232825817 
-1.11022302462516e-16  1324.97691504995  0.00000000000000  652.652749142738  0.00000000000000  36.4002323488456  133.259757352917  25.5470692867644 -45.5664327189648 
 0.0599999999999999  1313.84074367783  0.00000000000000  651.216672038243  0.00000000000000  36.2469411630531  133.123456214990  25.5189473144611 -45.7009232825817 
 0.120000000000000  1280.97686731032  0.00000000000000  646.933079802864  0.00000000000000  35.7907371719320  132.714230374627  25.4348791977250 -46.1040123956126 
 0.180000000000000  1227.97632643056  0.00000000000000  639.874746845313  0.00000000000000  35.0424931537492  132.031108314196  25.2957456273839 -46.7745683871187 
 0.240000000000000  1157.35249795813  0.00000000000000  630.159258872176  0.00000000000000  34.0198838616203  131.072456823918  25.1029731082232 -47.7107584118499 
 0.300000000000000  1072.34889312000  0.00000000000000  617.943807166562  0.00000000000000  32.7467386638731  129.835960409160  24.8584755599888 -48.9101273541408 
 0.360000000000000  976.698680679795  0.00000000000000  603.418556671059  0.00000000000000  31.2521788149210  128.318593443891  24.5645793098734 -50.3697060645504 
 0.420000000000000  874.360055460165  0.00000000000000  586.799141496651  0.00000000000000  29.5695798999608  126.516586371182  24.2239373656854 -52.0861462487327 
 0.480000000000000  769.252828054018  0.00000000000000  568.318872422319  0.00000000000000  27.7354074795020  124.425388131327  23.8394394317970 -54.0558780516241 
 0.540000000000000  665.019847937107  0.00000000000000  548.221205772353  0.00000000000000  25.7879787485779  122.039628360347  23.4141240658786 -56.2752849304868 
 0.600000000000000  564.832495855101  0.00000000000000  526.752932261866  0.00000000000000  23.7662049106520  119.353084978643  22.9510987157884 -58.7408889331162 
 0.660000000000000  471.253237961344  0.00000000000000  504.158415329746  0.00000000000000  21.7083679248658  116.358665904750  22.4534722332593 -61.4495381867095 
 0.720000000000000  386.161073087537  0.00000000000000  480.675061764502  0.00000000000000  19.6509814789882  113.048418222960  21.9243029938127 -64.3985874670895 
 0.780000000000000  310.738620688360  0.00000000000000  456.530063293895  0.00000000000000  17.6277798003140  109.413584784808  21.3665641433969 -67.5860623396875 
 0.840000000000000  245.513478228043  0.00000000000000  431.938322981225  0.00000000000000  15.6688697176294  105.444737649044  20.7831259193901 -71.0107976613377 
 0.900000000000000  190.441982062467  0.00000000000000  407.101386033229  0.00000000000000  13.8000718136706  101.132030760557  20.1767536049095 -74.6725422330870 
 0.960000000000000  145.020992506026  0.00000000000000  382.207136199995  0.00000000000000  12.0424662136137  96.4656315432123  19.5501185725303 -78.5720230265579 
 1.02000000000000  108.412830600140  0.00000000000000  357.429996074804  0.00000000000000  10.4121482221557  91.4364128691675  18.9058191061589 -82.7109645086867 
 1.08000000000000  79.5697773570392  0.00000000000000  332.931377922561  0.00000000000000  8.92018931172648  86.0370122129211  18.2464072606790 -87.0920609402746 
 1.14000000000000  57.3471554940258  0.00000000000000  308.860164426651  0.00000000000000  7.57279046943898  80.2633904191817  17.5744178972349 -91.7189018800998 
 1.20000000000000  40.5973896627718  0.00000000000000  285.353048362564  0.00000000000000  6.37160809080187  74.1170413656452  16.8923961699507 -96.5958532668677 
 1.26000000000000  28.2410161500027  0.00000000000000  262.534619388599  0.00000000000000  5.31422770964914  67.6080040754468  16.2029200883236 -101.727898212236 
 1.32000000000000  19.3138961148414  0.00000000000000  240.517148455448  0.00000000000000  4.39475779933791  60.7587952572917  15.5086152978094 -107.120442938446 
 1.38000000000000  12.9925223143252  0.00000000000000  219.400080314321  0.00000000000000  3.60451415787554  53.6093010054084  14.8121598801229 -112.779094145156 
 1.44000000000000  8.60110476927758  0.00000000000000  199.269297613986  0.00000000000000  2.93276401527255  46.2225489457311  14.1162777535010 -118.709414589831 
 1.50000000000000  5.60504074290807  0.00000000000000  180.196262159121  0.00000000000000  2.36749672500472  38.6911757887336  13.4237201311380 -124.916663977687 
 1.56000000000000  3.59551316958758  0.00000000000000  162.237166772058  0.00000000000000  1.89618384382622  31.1444121383103  12.7372354446347 -131.405532575514 
 1.62000000000000  2.26950032349950  0.00000000000000  145.432242481478  0.00000000000000  1.50648608473477  23.7556350568079  12.0595291152465 -138.179875471434 
 1.68000000000000  1.40863836058907  0.00000000000000  129.805359382924  0.00000000000000  1.18686071659192  16.7509253267999  11.3932154979586 -145.242456221283 
 1.74000000000000  0.859374195494519  0.00000000000000  115.364036117907  0.00000000000000  0.927024376968869  10.4189504536994  10.7407651551417 -152.594709763460 
 1.80000000000000  0.515860276208216  0.00000000000000  102.099935094481  0.00000000000000  0.718234137456733  5.11974076188918  10.1044512515268 -160.236535809421 
 1.86000000000000  0.306202654745853  0.00000000000000  89.9898727933719  0.00000000000000  0.553355812064763  1.27935762524436  9.48629921483462 -168.166135120063 
 1.92000000000000  0.182048088934633  0.00000000000000  78.9973226656732  0.00000000000000  0.426670937532231 -0.669385084046632  8.88804380421660 -176.379901701464 
 1.98000000000000  0.111100833948788  0.00000000000000  69.0743387694443  0.00000000000000  0.333317917233366 -0.478045554568282  8.31109732643315  175.127616545364 
 2.04000000000000  0.0719717080402953  0.00000000000000  60.1637876242447  0.00000000000000  0.268275433165796  1.55690474678677  7.75653193278057  166.363678314327 
 2.10000000000000  0.0507335575098058  0.00000000000000  52.2017487078352  0.00000000000000  0.225241109724238  4.33048312320334  7.22507776482961  157.337224188487 
 2.16000000000000  0.0386323737457562  0.00000000000000  45.1199334619996  0.00000000000000  0.196551198789924  6.29854127430303  6.71713729664651  148.058666374253 
 2.22000000000000  0.0305293661886743  0.00000000000000  38.8479790707457  0.00000000000000  0.174726546891634  6.30769195563393  6.23281469889372  138.539599872966 
 2.28000000000000  0.0237846274190888  0.00000000000000  33.3154946937132  0.00000000000000  0.154222655336655  3.94616649631525  5.77195761364489  128.792449871556 
 2.34000000000000  0.0174102901626416  0.00000000000000  28.4537704101756  0.00000000000000  0.131948058578524 -0.763215026054503  5.33420757096831  118.830077065586 
 2.40000000000000  0.0114068764949833  0.00000000000000  24.1970977871403  0.00000000000000  0.106802979803859 -7.83855349923867  4.91905456232601  108.665367411287 
 2.46000000000000  0.00624871279255869  0.00000000000000  20.4836903434272  0.00000000000000  0.0790488000703283 -17.9120939611464  4.52589111042535  98.3108344615361 
 2.52000000000000  0.00250806788039115  0.00000000000000  17.2562273808733  0.00000000000000  0.0500806138180347 -34.0038005820746  4.15406155236936  87.7782605960444 
 2.58000000000000  0.000611860469586629  0.00000000000000  14.4620720221627  0.00000000000000  0.0247358135016140 -73.0810346186382  3.80290310449303  77.0783984434777 
 2.64000000000000  0.000718597543093025  0.00000000000000  12.0532317332848  0.00000000000000  0.0268066697501390 -156.753177818694  3.47177645208973  66.2207465666386 
 2.70000000000000  0.00269423979576781  0.00000000000000  9.98613667069800  0.00000000000000  0.0519060670419923  168.210813806463  3.16008491510877  55.2134053470694 
 2.76000000000000  0.00615894081141580  0.00000000000000  8.22130888969999  0.00000000000000  0.0784789195352216  151.007669607188  2.86728249213432  44.0630112822943 
 2.82000000000000  0.0105744049016700  0.00000000000000  6.72298585666181  0.00000000000000  0.102831925498213  137.892503579695  2.59287212501153  32.7747416367747 
 2.88000000000000  0.0153441336570124  0.00000000000000  5.45874747290522  0.00000000000000  0.123871440037696  126.118740998199  2.33639625768088  21.3523771566260 
 2.94000000000000  0.0199048897710227  0.00000000000000  4.39917967567618  0.00000000000000  0.141084690066012  114.849053790156  2.09742215008714  9.79840848795659 
 3.00000000000000  0.0237955189160263  0.00000000000000  3.51759204240232  0.00000000000000  0.154257962245150  103.752488563903  1.87552447128858 -1.88582822626096 
