 1.00000000000000  2.00018176075250 
 1.00018233817838  0.110288904246394 
 1.00036470960397  0.0600408218265635 
 1.00054711428283  0.0395357600357356 
 1.00072955222104  0.0297467825411055 
 1.00091202342464  0.0239496946183895 
 1.00109452789970  0.0201257367789547 
 1.00127706565231  0.0174258062859307 
 1.00145963668851  0.0154282721142572 
 1.00164224101439  0.0138997593798247 
 1.00182487863600  0.0127006374221748 
 1.00200754955943  0.0117423121402192 
 1.00219025379073  0.0109659429570684 
 1.00237299133600  0.0103310080805212 
 1.00255576220130  0.00980878252363538 
 1.00273856639270  0.00937843305558523 
 1.00292140391629  0.00902458473084428 
 1.00310427477813  0.00873575375463563 
 1.00328717898432  0.00850331112273855 
 1.00347011654093  0.00832078335482867 
 1.00365308745403  0.00818337475773424 
 1.00383609172973  0.00808764046690734 
 1.00401912937408  0.00803126625502463 
 1.00420220039319  0.00801292774350224 
 1.00438530479314  0.00803221257952720 
 1.00456844258000  0.00808959687837095 
 1.00475161375988  0.00818647336661630 
 1.00493481833885  0.00832523433929083 
 1.00511805632302  0.00850941878288783 
 1.00530132771847  0.00874394098817153 
 1.00548463253128  0.00903542933802116 
 1.00566797076757  0.00939272137236020 
 1.00585134243341  0.00982758934163970 
 1.00603474753491  0.0103558177610031 
 1.00621818607816  0.0109988372690755 
 1.00640165806926  0.0117862701138826 
 1.00658516351432  0.0127600309847718 
 1.00676870241941  0.0139812075011184 
 1.00695227479066  0.0155421884553940 
 1.00713588063416  0.0175893793631450 
 1.00731951995602  0.0203691140191571 
 1.00750319276233  0.0243300573122335 
 1.00768689905921  0.0303841219700320 
 1.00787063885276  0.0407117943759057 
 1.00805441214909  0.0621443506381244 
 1.00823821895431  0.132729784960148 
 1.00842205927453  0.828747690900896 
 1.00860593311585  0.0984067635820932 
 1.00878984048440  0.0564120141582107 
 1.00897378138628  0.0379266287463303 
 1.00915775582761  0.0287890214446647 
 1.00934176381450  0.0233024110506026 
 1.00952580535308  0.0196536676034707 
 1.00970988044946  0.0170636716771089 
 1.00989398910975  0.0151404519638099 
 1.01007813134008  0.0136650760627026 
 1.01026230714657  0.0125056776516073 
 1.01044651653534  0.0115781628738514 
 1.01063075951251  0.0108264604402041 
 1.01081503608421  0.0102118393691111 
 1.01099934625657  0.00970678346921362 
 1.01118369003571  0.00929130776429919 
 1.01136806742776  0.00895065508981853 
 1.01155247843885  0.00867380883734122 
 1.01173692307510  0.00845250778655261 
 1.01192140134265  0.00828058113379834 
 1.01210591324763  0.00815349493261557 
 1.01229045879618  0.00806804329581613 
 1.01247503799443  0.00802214299242169 
 1.01265965084851  0.00801470594164101 
 1.01284429736457  0.00804557466686930 
 1.01302897754873  0.00811551343270771 
 1.01321369140714  0.00822625409928521 
 1.01339843894594  0.00838060186541099 
 1.01358322017127  0.00858261316314535 
 1.01376803508927  0.00883786740262422 
 1.01395288370609  0.00915386811845522 
 1.01413776602787  0.00954063078277052 
 1.01432268206075  0.0100115502613256 
 1.01450763181089  0.0105847020822347 
 1.01469261528442  0.0112848408646727 
 1.01487763248751  0.0121465626856905 
 1.01506268342629  0.0132194962503002 
 1.01524776810693  0.0145772124267644 
 1.01543288653557  0.0163333700283024 
 1.01561803871837  0.0186730174322045 
 1.01580322466148  0.0219187163496813 
 1.01598844437105  0.0266869667050569 
 1.01617369785325  0.0343212327494047 
 1.01635898511424  0.0484108879284624 
 1.01654430616016  0.0828561773781331 
 1.01672966099719  0.292674400603267 
 1.01691504963148  0.184442369523863 
 1.01710047206919  0.0791413665795767 
 1.01728592831650  0.0451769105136285 
 1.01747141837956  0.0325964473841469 
 1.01765694226454  0.0256285511421899 
 1.01784249997761  0.0212054369142224 
 1.01802809152493  0.0181605963692628 
 1.01821371691268  0.0159480267654229 
 1.01839937614702  0.0142774642064188 
 1.01858506923413  0.0129803040515103 
 1.01877079618018  0.0119519675054238 
 1.01895655699134  0.0111242311916652 
 1.01914235167379  0.0104507863176457 
 1.01932818023370  0.00989919211590423 
 1.01951404267725  0.00944614936648304 
 1.01969993901063  0.00907460168982879 
 1.01988586924000  0.00877189369510229 
 1.02007183337155  0.00852856664875412 
 1.02025783141146  0.00833755352449535 
 1.02044386336592  0.00819363329543618 
 1.02062992924110  0.00809305966510742 
 1.02081602904320  0.00803331198434875 
 1.02100216277840  0.00801293609240857 
 1.02118833045288  0.00803145576868526 
 1.02137453207284  0.00808934452869900 
 1.02156076764446  0.00818805458290666 
 1.02174703717393  0.00833010627259698 
 1.02193334066746  0.00851924841143599 
 1.02211967813122  0.00876070907574130 
 1.02230604957141  0.00906156946139132 
 1.02249245499424  0.00943131364567530 
 1.02267889440589  0.00988264005760661 
 1.02286536781256  0.0104326765662396 
 1.02305187522046  0.0111048405666911 
 1.02323841663577  0.0119317695534328 
 1.02342499206471  0.0129601052606330 
 1.02361160151347  0.0142586487959166 
 1.02379824498826  0.0159330152510115 
 1.02398492249528  0.0181537453690778 
 1.02417163404073  0.0212148856934019 
 1.02435837963083  0.0256700520070752 
 1.02454515927178  0.0326993784275716 
 1.02473197296979  0.0453448856419951 
 1.02491882073107  0.0745751351194228 
 1.02510570256182  0.213252470342982 
 1.02529261846828  0.238523230034455 
 1.02547956845663  0.0861236324563522 
 1.02566655253311  0.0474698103407750 
 1.02585357070392  0.0336569387389494 
 1.02604062297529  0.0262171316845627 
 1.02622770935343  0.0215651204577713 
 1.02641482984455  0.0183936663238056 
 1.02660198445489  0.0161047455064364 
 1.02678917319065  0.0143852460015999 
 1.02697639605807  0.0130552835455850 
 1.02716365306337  0.0120042128425620 
 1.02735094421276  0.0111603265047978 
 1.02753826951249  0.0104752087657911 
 1.02772562896876  0.00991509100837440 
 1.02791302258782  0.00945580925712459 
 1.02810045037589  0.00907972952591427 
 1.02828791233921  0.00877380373537986 
 1.02847540848399  0.00852830388758472 
 1.02866293881648  0.00833597913624253 
 1.02885050334291  0.00819148623971787 
 1.02903810206952  0.00809100332677582 
 1.02922573500253  0.00803197170498197 
 1.02941340214819  0.00801293173017280 
 1.02960110351274  0.00803343250348620 
 1.02978883910241  0.00809400475831031 
 1.02997660892345  0.00819619382960412 
 1.03016441298209  0.00834265654283001 
 1.03035225128459  0.00853733353359463 
 1.03054012383717  0.00878571843429552 
 1.03072803064610  0.00909525972817022 
 1.03091597171761  0.00947595346508738 
 1.03110394705796  0.00994122183212457 
 1.03129195667338  0.0105092357178104 
 1.03148000057014  0.0112049523724398 
 1.03166807875448  0.0120633504903947 
 1.03185619123265  0.0131347601482499 
 1.03204433801091  0.0144940494166677 
 1.03223251909551  0.0162573577170643 
 1.03242073449270  0.0186147440770269 
 1.03260898420875  0.0218997250651363 
 1.03279726824991  0.0267556105239915 
 1.03298558662244  0.0346033663254342 
 1.03317393933259  0.0493250920488239 
 1.03336232638664  0.0866645799105225 
 1.03355074779084  0.364638380925086 
 1.03373920355145  0.159270348078641 
 1.03392769367475  0.0717167170331769 
 1.03411621816699  0.0430449512911200 
 1.03430477703444  0.0313617625149120 
 1.03449337028338  0.0247920053806781 
 1.03468199792006  0.0205880862278918 
 1.03487065995076  0.0176798302955023 
 1.03505935638175  0.0155597904306848 
 1.03524808721931  0.0139558796396289 
 1.03543685246971  0.0127090813848016 
 1.03562565213921  0.0117203152001698 
 1.03581448623411  0.0109247248481540 
 1.03600335476066  0.0102781784524810 
 1.03619225772517  0.00974971047129051 
 1.03638119513389  0.00931706550631336 
 1.03657016699311  0.00896395750272559 
 1.03675917330913  0.00867832482007012 
 1.03694821408821  0.00845118835228394 
 1.03713728933664  0.00827588900362751 
 1.03732639906070  0.00814757268813043 
 1.03751554326669  0.00806284313060970 
 1.03770472196089  0.00801953359311232 
 1.03789393514959  0.00801656779412031 
 1.03808318283908  0.00805389293285228 
 1.03827246503564  0.00813247689461452 
 1.03846178174558  0.00825436933483488 
 1.03865113297518  0.00842283390537947 
 1.03884051873073  0.00864256786808985 
 1.03902993901855  0.00892003762249965 
 1.03921939384491  0.00926397716156297 
 1.03940888321612  0.00968612613718454 
 1.03959840713847  0.0102023341736085 
 1.03978796561828  0.0108342458478615 
 1.03997755866183  0.0116119418018926 
 1.04016718627543  0.0125782212383591 
 1.04035684846539  0.0137958401934014 
 1.04054654523800  0.0153603820813624 
 1.04073627659958  0.0174246224956640 
 1.04092604255642  0.0202484459685464 
 1.04111584311485  0.0243121905849616 
 1.04130567828117  0.0306127247270862 
 1.04149554806168  0.0416123755708975 
 1.04168545246271  0.0654970892926144 
 1.04187539149055  0.155878658401098 
 1.04206536515153  0.385379318996536 
 1.04225537345197  0.0797429495961180 
 1.04244541639817  0.0506513607057871 
 1.04263549399645  0.0349932407001873 
 1.04282560625314  0.0269017839841527 
 1.04301575317455  0.0219494200315929 
 1.04320593476701  0.0186188401065281 
 1.04339615103683  0.0162378514889930 
 1.04358640199034  0.0144618328140333 
 1.04377668763385  0.0130957600095726 
 1.04396700797371  0.0120210362448430 
 1.04415736301623  0.0111614875295952 
 1.04434775276775  0.0104660554941520 
 1.04453817723458  0.00989934437008334 
 1.04472863642307  0.00943615836323061 
 1.04491913033953  0.00905819692611450 
 1.04510965899031  0.00875197926771397 
 1.04530022238174  0.00850750105093082 
 1.04549082052015  0.00831734489018724 
 1.04568145341187  0.00817608280844931 
 1.04587212106325  0.00807987380967525 
 1.04606282348062  0.00802619756627116 
 1.04625356067033  0.00801368829327180 
 1.04644433263870  0.00804204778819154 
 1.04663513939209  0.00811202709814005 
 1.04682598093684  0.00822547465427461 
 1.04701685727928  0.00838545667278607 
 1.04720776842577  0.00859646472401893 
 1.04739871438265  0.00886473751775737 
 1.04758969515626  0.00919874198704029 
 1.04778071075297  0.00960988748201306 
 1.04797176117911  0.0101135950526203 
 1.04816284644103  0.0107309281731442 
 1.04835396654510  0.0114911456283261 
 1.04854512149766  0.0124358333664800 
 1.04873631130506  0.0136258714858633 
 1.04892753597366  0.0151537851851920 
 1.04911879550982  0.0171670375537682 
 1.04931008991990  0.0199155188345570 
 1.04950141921025  0.0238586862823439 
 1.04969278338723  0.0299429228244184 
 1.04988418245721  0.0404783835550454 
 1.05007561642655  0.0629792484107872 
 1.05026708530161  0.143716147595963 
 1.05045858908876  0.470430723683440 
 1.05065012779435  0.0835744510999034 
 1.05084170142477  0.0515390003582393 
 1.05103330998637  0.0353081270061417 
 1.05122495348553  0.0270325882296942 
 1.05141663192862  0.0220016835387836 
 1.05160834532200  0.0186327500659842 
 1.05180009367206  0.0162316019344071 
 1.05199187698515  0.0144446409250181 
 1.05218369526767  0.0130726868122592 
 1.05237554852599  0.0119950389504567 
 1.05256743676648  0.0111343866812428 
 1.05275935999552  0.0104390279143461 
 1.05295131821949  0.00987319094139729 
 1.05314331144477  0.00941145770533998 
 1.05333533967776  0.00903539824496167 
 1.05352740292482  0.00873146155354705 
 1.05371950119234  0.00848961327652241 
 1.05391163448671  0.00830243555513665 
 1.05410380281431  0.00816452389755407 
 1.05429600618154  0.00807208251952440 
 1.05448824459478  0.00802265830760477 
 1.05468051806042  0.00801497716586329 
 1.05487282658486  0.00804886180612889 
 1.05506517017448  0.00812522088830864 
 1.05525754883568  0.00824610822247071 
 1.05544996257485  0.00841485929667585 
 1.05564241139840  0.00863632240696240 
 1.05583489531271  0.00891721529337028 
 1.05602741432420  0.00926665873160444 
 1.05621996843924  0.00969697167557776 
 1.05641255766425  0.0102248687714421 
 1.05660518200564  0.0108733007422300 
 1.05679784146979  0.0116743629302431 
 1.05699053606312  0.0126740570895640 
 1.05718326579203  0.0139404328051263 
 1.05737603066293  0.0155782676839337 
 1.05756883068222  0.0177573453697412 
 1.05776166585631  0.0207716944536730 
 1.05795453619163  0.0251781552391884 
 1.05814744169456  0.0321738403702088 
 1.05834038237154  0.0448869690442882 
 1.05853335822896  0.0749043442042271 
 1.05872636927325  0.230385733054754 
 1.05891941551083  0.206027547070405 
 1.05911249694811  0.0814422528386468 
 1.05930561359150  0.0449232480799442 
 1.05949876544743  0.0320995254259472 
 1.05969195252232  0.0251098253648401 
 1.05988517482258  0.0207150836390042 
 1.06007843235465  0.0177099311060285 
 1.06027172512494  0.0155375916913227 
 1.06046505313989  0.0139047697973381 
 1.06065841640591  0.0126422576479677 
 1.06085181492944  0.0116456690320465 
 1.06104524871691  0.0108472178205173 
 1.06123871777474  0.0102010845476012 
 1.06143222210936  0.00967530579982389 
 1.06162576172721  0.00924703200814042 
 1.06181933663473  0.00889963158292105 
 1.06201294683833  0.00862085913359706 
 1.06220659234448  0.00840166424448593 
 1.06240027315959  0.00823540142046492 
 1.06259398929011  0.00811730113979605 
 1.06278774074247  0.00804411800529158 
 1.06298152752312  0.00801390508435356 
 1.06317534963850  0.00802588412908079 
 1.06336920709505  0.00808039515424984 
 1.06356309989922  0.00817891915733651 
 1.06375702805744  0.00832417681068866 
 1.06395099157618  0.00852031557673670 
 1.06414499046186  0.00877320990240134 
 1.06433902472095  0.00909091675975265 
 1.06453309435990  0.00948435644646712 
 1.06472719938515  0.00996833455724533 
 1.06492133980316  0.0105631012356546 
 1.06511551562037  0.0112967900164977 
 1.06530972684326  0.0122093580326574 
 1.06550397347826  0.0133592129728935 
 1.06569825553184  0.0148349224970821 
 1.06589257301045  0.0167772044997389 
 1.06608692592056  0.0194235189538909 
 1.06628131426863  0.0232079522389856 
 1.06647573806111  0.0290172228383771 
 1.06667019730448  0.0389879022293673 
 1.06686469200519  0.0599068807831072 
 1.06705922216970  0.130976931918306 
 1.06725378780450  0.623947030357309 
 1.06744838891603  0.0873212224990294 
 1.06764302551078  0.0522492869046963 
 1.06783769759521  0.0354446923207536 
 1.06803240517579  0.0270095108048032 
 1.06822714825901  0.0219222380702174 
 1.06842192685131  0.0185329406830665 
 1.06861674095920  0.0161261713984820 
 1.06881159058913  0.0143402164126010 
 1.06900647574758  0.0129724131933288 
 1.06920139644105  0.0119004521044280 
 1.06939635267600  0.0110462492108046 
 1.06959134445891  0.0103577310644072 
 1.06978637179627  0.00979896030123617 
 1.06998143469455  0.00934446490631730 
 1.07017653316026  0.00897582594421322 
 1.07037166719986  0.00867954502387126 
 1.07056683681984  0.00844567086269759 
 1.07076204202670  0.00826689496953586 
 1.07095728282692  0.00813794880026288 
 1.07115255922700  0.00805520272933685 
 1.07134787123341  0.00801640672720863 
 1.07154321885266  0.00802053683832217 
 1.07173860209124  0.00806772741163228 
 1.07193402095565  0.00815928055041250 
 1.07212947545237  0.00829775399446045 
 1.07232496558791  0.00848713864606085 
 1.07252049136877  0.00873314929973700 
 1.07271605280144  0.00904366967745777 
 1.07291164989242  0.00942942019328654 
 1.07310728264822  0.00990496215516079 
 1.07330295107535  0.0104902309060150 
 1.07349865518030  0.0112129338587195 
 1.07369439496957  0.0121124232866732 
 1.07389017044969  0.0132462055183082 
 1.07408598162715  0.0147014315932412 
 1.07428182850846  0.0166164506277828 
 1.07447771110014  0.0192244472990893 
 1.07467362940869  0.0229509853913278 
 1.07486958344063  0.0286632919901802 
 1.07506557320246  0.0384431777654916 
 1.07526159870072  0.0588590529595969 
 1.07545765994191  0.127185139672308 
 1.07565375693255  0.688371435086827 
 1.07584988967915  0.0880450903693821 
 1.07604605818824  0.0522999494105097 
 1.07624226246635  0.0353769496903696 
 1.07643850251998  0.0269209546451421 
 1.07663477835567  0.0218334663755618 
 1.07683108997993  0.0184494364201465 
 1.07702743739930  0.0160492795833346 
 1.07722382062030  0.0142699960836108 
 1.07742023964946  0.0129085292442874 
 1.07761669449331  0.0118424839649198 
 1.07781318515837  0.0109938021563163 
 1.07800971165118  0.0103104753845219 
 1.07820627397828  0.00975664334694550 
 1.07840287214620  0.00930691341851834 
 1.07859950616146  0.00894294576062847 
 1.07879617603062  0.00865132121261914 
 1.07899288176019  0.00842216971587902 
 1.07918962335674  0.00824826869076533 
 1.07938640082679  0.00812444358251017 
 1.07958321417688  0.00804717102822950 
 1.07978006341356  0.00801432482019859 
 1.07997694854338  0.00802502922500215 
 1.08017386957287  0.00807960031187530 
 1.08037082650858  0.00817956780906348 
 1.08056781935706  0.00832778030264331 
 1.08076484812485  0.00852860747859324 
 1.08096191281852  0.00878826693299258 
 1.08115901344460  0.00911532313595321 
 1.08135615000964  0.00952143789252181 
 1.08155332252022  0.0100225050079840 
 1.08175053098287  0.0106403959663613 
 1.08194777540415  0.0114057172045596 
 1.08214505579061  0.0123623167212491 
 1.08234237214883  0.0135749697379302 
 1.08253972448535  0.0151431905482161 
 1.08273711280673  0.0172277226154014 
 1.08293453711955  0.0201057192758718 
 1.08313199743035  0.0242988409009406 
 1.08332949374571  0.0309184469736873 
 1.08352702607218  0.0428263244701506 
 1.08372459441634  0.0703208361340441 
 1.08392219878475  0.200059885813951 
 1.08411983918398  0.226867462902238 
 1.08431751562060  0.0840508544094261 
 1.08451522810118  0.0449796539546839 
 1.08471297663230  0.0319100868741505 
 1.08491076122052  0.0248691216433474 
 1.08510858187243  0.0204720337234408 
 1.08530643859459  0.0174792301080012 
 1.08550433139359  0.0153235420890653 
 1.08570226027600  0.0137081325631196 
 1.08590022524840  0.0124625707908233 
 1.08609822631737  0.0114821133673488 
 1.08629626348950  0.0106989584868063 
 1.08649433677136  0.0100674084179186 
 1.08669244616955  0.00955567640190432 
 1.08689059169064  0.00914111165084276 
 1.08708877334123  0.00880729225804473 
 1.08728699112789  0.00854219217856427 
 1.08748524505723  0.00833699389446915 
 1.08768353513583  0.00818530546049648 
 1.08788186137028  0.00808264135957215 
 1.08808022376717  0.00802608345094730 
 1.08827862233311  0.00801407199545662 
 1.08847705707467  0.00804629797223582 
 1.08867552799847  0.00812368251937110 
 1.08887403511109  0.00824844087217349 
 1.08907257841913  0.00842423916027665 
 1.08927115792920  0.00865646520503714 
 1.08946977364790  0.00895265195790182 
 1.08966842558183  0.00932311896513633 
 1.08986711373758  0.00978194116745408 
 1.09006583812178  0.0103484304117672 
 1.09026459874102  0.0110494531408962 
 1.09046339560190  0.0119231707787295 
 1.09066222871105  0.0130253180142553 
 1.09086109807505  0.0144402651022845 
 1.09106000370054  0.0163017169850348 
 1.09125894559412  0.0188344882415920 
 1.09145792376240  0.0224474902332170 
 1.09165693821200  0.0279699827477845 
 1.09185598894952  0.0373776775531758 
 1.09205507598160  0.0568202875858455 
 1.09225419931484  0.119997795808892 
 1.09245335895588  0.874576768118596 
 1.09265255491131  0.0896981297382749 
 1.09285178718777  0.0524461300288754 
 1.09305105579189  0.0352614135936967 
 1.09325036073028  0.0267564108817745 
 1.09344970200957  0.0216650840766763 
 1.09364907963638  0.0182896477173173 
 1.09384849361734  0.0159014634829441 
 1.09404794395909  0.0141346478876064 
 1.09424743066825  0.0127852085315057 
 1.09444695375146  0.0117305012720832 
 1.09464651321534  0.0108924748780350 
 1.09484610906653  0.0102192237814007 
 1.09504574131166  0.00967502485753034 
 1.09524540995737  0.00923463371318162 
 1.09544511501030  0.00887986251174710 
 1.09564485647709  0.00859744762943013 
 1.09584463436437  0.00837768127549450 
 1.09604444867878  0.00821351511605972 
 1.09624429942698  0.00809996776980655 
 1.09644418661560  0.00803373684280870 
 1.09664411025128  0.00801295630298175 
 1.09684407034067  0.00803706480393124 
 1.09704406689042  0.00810676722385584 
 1.09724409990718  0.00822408439063267 
 1.09744416939760  0.00839249758657220 
 1.09764427536831  0.00861720748053298 
 1.09784441782600  0.00890554460433194 
 1.09804459677728  0.00926759486352621 
 1.09824481222884  0.00971714662182611 
 1.09844506418732  0.0102731402117419 
 1.09864535265937  0.0109619353453834 
 1.09884567765166  0.0118209678942801 
 1.09904603917084  0.0129048810942495 
 1.09924643722358  0.0142963126247077 
 1.09944687181653  0.0161260400172252 
 1.09964734295636  0.0186135374569786 
 1.09984785064974  0.0221569559242780 
 1.10004839490332  0.0275606986611955 
 1.10024897572377  0.0367301233930201 
 1.10044959311777  0.0555345875034604 
 1.10065024709198  0.115303489627495 
 1.10085093765306  1.11048347407143 
 1.10105166480770  0.0917184780201421 
 1.10125242856257  0.0528160914833072 
 1.10145322892432  0.0353306276877891 
 1.10165406589966  0.0267457831785759 
 1.10185493949524  0.0216270055512934 
 1.10205584971774  0.0182419140740908 
 1.10225679657385  0.0158512288985775 
 1.10245778007024  0.0140850806323252 
 1.10265880021360  0.0127377926005457 
 1.10285985701061  0.0116859537145976 
 1.10306095046794  0.0108511503868240 
 1.10326208059229  0.0101813075377974 
 1.10346324739034  0.00964063066357708 
 1.10366445086878  0.00920385728324538 
 1.10386569103429  0.00885281283350660 
 1.10406696789357  0.00857426765438116 
 1.10426828145331  0.00835856388698196 
 1.10446963172019  0.00819871783115817 
 1.10467101870091  0.00808982849366977 
 1.10487244240217  0.00802869257297648 
 1.10507390283066  0.00801356670802869 
 1.10527539999307  0.00804404298890879 
 1.10547693389611  0.00812102077253601 
 1.10567850454648  0.00824677107462222 
 1.10588011195087  0.00842510222310358 
 1.10608175611599  0.00866164979391973 
 1.10628343704854  0.00896433348302299 
 1.10648515475523  0.00934405373000316 
 1.10668690924275  0.00981575083171459 
 1.10688870051781  0.0104000365739353 
 1.10709052858713  0.0111257686347411 
 1.10729239345742  0.0120342471898307 
 1.10749429513537  0.0131863440091979 
 1.10769623362771  0.0146752484089329 
 1.10789820894115  0.0166507521742005 
 1.10810022108240  0.0193694053736234 
 1.10830227005817  0.0233096209428316 
 1.10850435587519  0.0294768641678249 
 1.10870647854016  0.0404044164372356 
 1.10890863805981  0.0648339467840609 
 1.10911083444087  0.166842441597245 
 1.10931306769004  0.276309165174102 
 1.10951533781406  0.0902460490913395 
 1.10971764481964  0.0457320023286151 
 1.10991998871351  0.0320555183717595 
 1.11012236950240  0.0248281571986649 
 1.11032478719303  0.0203625196339604 
 1.11052724179214  0.0173444578580317 
 1.11072973330644  0.0151818808797051 
 1.11093226174269  0.0135680909489292 
 1.11113482710760  0.0123283158669246 
 1.11133742940790  0.0113557679354721 
 1.11154006865035  0.0105816507348472 
 1.11174274484166  0.00995978815543375 
 1.11194545798858  0.00945818579057520 
 1.11214820809785  0.00905413693420585 
 1.11235099517620  0.00873125620459329 
 1.11255381923038  0.00847761737151368 
 1.11275668026712  0.00828455324829766 
 1.11295957829319  0.00814586982217241 
 1.11316251331530  0.00805733109841220 
 1.11336548534022  0.00801632995249245 
 1.11356849437468  0.00802169528490510 
 1.11377154042545  0.00807360812743321 
 1.11397462349926  0.00817361525432948 
 1.11417774360287  0.00832474218119227 
 1.11438090074303  0.00853172118682852 
 1.11458409492649  0.00880136730925647 
 1.11478732616001  0.00914316051648178 
 1.11499059445034  0.00957013272844765 
 1.11519389980424  0.0101002275410278 
 1.11539724222848  0.0107584249592097 
 1.11560062172979  0.0115801587019624 
 1.11580403831496  0.0126170226929584 
 1.11600749199073  0.0139467575845572 
 1.11621098276388  0.0156917749046929 
 1.11641451064116  0.0180561266001756 
 1.11661807562935  0.0214065907571948 
 1.11682167773520  0.0264745307007749 
 1.11702531696550  0.0349577694904455 
 1.11722899332699  0.0519040894271292 
 1.11743270682647  0.102028278760519 
 1.11763645747069  2.03135211501664 
 1.11784024526644  0.101407016355842 
 1.11804407022048  0.0549496809148141 
 1.11824793233959  0.0360353380661608 
 1.11845183163055  0.0270360003069435 
 1.11865576810013  0.0217476129332518 
 1.11885974175512  0.0182815511163325 
 1.11906375260230  0.0158488184424850 
 1.11926780064844  0.0140599478714017 
 1.11947188590032  0.0127004056809236 
 1.11967600836474  0.0116423767188580 
 1.11988016804849  0.0108051011689123 
 1.12008436495833  0.0101351913518948 
 1.12028859910107  0.00959609574197239 
 1.12049287048349  0.00916211164369601 
 1.12069717911238  0.00881481552081619 
 1.12090152499453  0.00854085159637045 
 1.12110590813674  0.00833052105087940 
 1.12131032854580  0.00817686424732579 
 1.12151478622851  0.00807506006463689 
 1.12171928119165  0.00802203930072092 
 1.12192381344204  0.00801625162159032 
 1.12212838298646  0.00805755201558452 
 1.12233298983172  0.00814719089882610 
 1.12253763398462  0.00828790654885154 
 1.12274231545197  0.00848413277940513 
 1.12294703424055  0.00874235197165246 
 1.12315179035719  0.00907164803703968 
 1.12335658380869  0.00948455256591884 
 1.12356141460185  0.00999834300881431 
 1.12376628274349  0.0106370691162703 
 1.12397118824041  0.0114348046909397 
 1.12417613109942  0.0124410598159522 
 1.12438111132734  0.0137302121357193 
 1.12458612893099  0.0154189068529803 
 1.12479118391717  0.0177005440279093 
 1.12499627629270  0.0209202384517520 
 1.12520140606440  0.0257591257248733 
 1.12540657323909  0.0337739386443478 
 1.12561177782359  0.0494696027318798 
 1.12581701982472  0.0935634972224529 
 1.12602229924930  0.885512550815702 
 1.12622761610417  0.111200053018605 
 1.12643297039613  0.0571828991573982 
 1.12663836213201  0.0368254084760477 
 1.12684379131866  0.0274146144762553 
 1.12704925796288  0.0219526827596466 
 1.12725476207153  0.0183994526896795 
 1.12746030365141  0.0159180662567780 
 1.12766588270937  0.0141000908861052 
 1.12787149925225  0.0127223146796803 
 1.12807715328686  0.0116525283187230 
 1.12828284482007  0.0108075735799525 
 1.12848857385869  0.0101326770232311 
 1.12869434040957  0.00959045143467255 
 1.12890014447954  0.00915467478468342 
 1.12910598607546  0.00880659561588001 
 1.12931186520416  0.00853265187817014 
 1.12951778187248  0.00832301999305540 
 1.12972373608728  0.00817067375385153 
 1.12992972785538  0.00807077046682671 
 1.13013575718366  0.00802025777536201 
 1.13034182407894  0.00801763887276320 
 1.13054792854809  0.00806286137602812 
 1.13075407059795  0.00815731413229777 
 1.13096025023538  0.00830393155237691 
 1.13116646746723  0.00850742029972572 
 1.13137272230035  0.00877464186626727 
 1.13157901474160  0.00911521152407085 
 1.13178534479784  0.00954241724730602 
 1.13199171247593  0.0100746360279850 
 1.13219811778272  0.0107375584509411 
 1.13240456072508  0.0115677861827819 
 1.13261104130987  0.0126188768311508 
 1.13281755954396  0.0139720010254487 
 1.13302411543420  0.0157558900227590 
 1.13323070898747  0.0181871037580927 
 1.13343734021063  0.0216596848340280 
 1.13364400911055  0.0269730085048840 
 1.13385071569410  0.0360323751259439 
 1.13405745996815  0.0547725710702834 
 1.13426424193958  0.115781125702664 
 1.13447106161526  0.830982068368645 
 1.13467791900206  0.0840230178666762 
 1.13488481410685  0.0504295414045110 
 1.13509174693653  0.0339596570922748 
 1.13529871749796  0.0257877029505097 
 1.13550572579802  0.0208967728386780 
 1.13571277184360  0.0176566727564266 
 1.13591985564158  0.0153669163753485 
 1.13612697719884  0.0136756413844664 
 1.13633413652228  0.0123866764496122 
 1.13654133361876  0.0113821155334652 
 1.13674856849518  0.0105869725923969 
 1.13695584115844  0.00995144003428514 
 1.13716315161541  0.00944130779867960 
 1.13737049987300  0.00903248109602783 
 1.13757788593808  0.00870769475778918 
 1.13778530981757  0.00845447073345393 
 1.13799277151835  0.00826381352600578 
 1.13820027104732  0.00812936365066028 
 1.13840780841137  0.00804684874877675 
 1.13861538361741  0.00801373879953268 
 1.13882299667233  0.00802905142034079 
 1.13903064758304  0.00809327855190308 
 1.13923833635644  0.00820842409773140 
 1.13944606299943  0.00837815791400529 
 1.13965382751892  0.00860810863804305 
 1.13986162992181  0.00890634036364329 
 1.14006947021502  0.00928409227115195 
 1.14027734840544  0.00975691673213061 
 1.14048526450000  0.0103464506816617 
 1.14069321850560  0.0110832391497655 
 1.14090121042915  0.0120113897279996 
 1.14110924027756  0.0131965827147524 
 1.14131730805777  0.0147406176995849 
 1.14152541377667  0.0168096719444805 
 1.14173355744120  0.0196941334988649 
 1.14194173905825  0.0239505679129414 
 1.14214995863477  0.0307963987272612 
 1.14235821617766  0.0435038698936728 
 1.14256651169385  0.0749037607382592 
 1.14277484519028  0.276599672493265 
 1.14298321667384  0.156365992997239 
 1.14319162615149  0.0665556266011428 
 1.14340007363014  0.0398802894976308 
 1.14360855911672  0.0289089048995250 
 1.14381708261817  0.0228029419516723 
 1.14402564414142  0.0189260459733226 
 1.14423424369339  0.0162616452559519 
 1.14444288128102  0.0143316499145016 
 1.14465155691125  0.0128813227995880 
 1.14486027059102  0.0117625591348179 
 1.14506902232726  0.0108835173970552 
 1.14527781212691  0.0101843792610769 
 1.14548663999691  0.00962468171162080 
 1.14569550594421  0.00917625559319055 
 1.14590440997573  0.00881908172449322 
 1.14611335209844  0.00853875766625693 
 1.14632233231928  0.00832489992136498 
 1.14653135064519  0.00817011501339207 
 1.14674040708313  0.00806933264331696 
 1.14694950164003  0.00801938129681425 
 1.14715863432285  0.00801873693348823 
 1.14736780513854  0.00806740644956274 
 1.14757701409406  0.00816692891915746 
 1.14778626119636  0.00832049483756694 
 1.14799554645240  0.00853320086590939 
 1.14820486986912  0.00881247908514205 
 1.14841423145350  0.00916877123388157 
 1.14862363121249  0.00961656945009188 
 1.14883306915305  0.0101760337343370 
 1.14904254528214  0.0108755591490073 
 1.14925205960673  0.0117559807647477 
 1.14946161213377  0.0128777498759980 
 1.14967120287024  0.0143338288692829 
 1.14988083182311  0.0162744070066817 
 1.15009049899934  0.0189583310359652 
 1.15030020440590  0.0228723164584609 
 1.15050994804976  0.0290514962766749 
 1.15071972993789  0.0401536701784683 
 1.15092955007728  0.0656896056627173 
 1.15113940847488  0.184218806638055 
 1.15134930513768  0.218277086522404 
 1.15155924007266  0.0773783891548580 
 1.15176921328679  0.0425838184157309 
 1.15197922478705  0.0301976044491343 
 1.15218927458043  0.0235371983141848 
 1.15239936267391  0.0193876664648342 
 1.15260948907446  0.0165704202243561 
 1.15281965378908  0.0145469105781842 
 1.15302985682475  0.0130356683080449 
 1.15324009818846  0.0118753112071407 
 1.15345037788720  0.0109668135505258 
 1.15366069592795  0.0102462052110454 
 1.15387105231772  0.00967049551200273 
 1.15408144706348  0.00920991057291664 
 1.15429188017224  0.00884337740110047 
 1.15450235165099  0.00855578278064940 
 1.15471286150672  0.00833625427593316 
 1.15492340974644  0.00817705821561303 
 1.15513399637714  0.00807288767890972 
 1.15534462140583  0.00802040988759565 
 1.15555528483949  0.00801799752357735 
 1.15576598668514  0.00806560226472823 
 1.15597672694979  0.00816475178787923 
 1.15618750564043  0.00831866984660595 
 1.15639832276408  0.00853253730105732 
 1.15660917832773  0.00881393463350236 
 1.15682007233840  0.00917353963452555 
 1.15703100480310  0.00962620786259622 
 1.15724197572885  0.0101926575349370 
 1.15745298512265  0.0109021539676819 
 1.15766403299151  0.0117969262147678 
 1.15787511934246  0.0129397448923149 
 1.15808624418251  0.0144276276684884 
 1.15829740751868  0.0164183233316486 
 1.15850860935799  0.0191860017791329 
 1.15871984970746  0.0232521613760348 
 1.15893112857411  0.0297447212654151 
 1.15914244596496  0.0416396549540911 
 1.15935380188703  0.0701748021656553 
 1.15956519634737  0.228573420695316 
 1.15977662935298  0.173757372350338 
 1.15998810091091  0.0691813493417465 
 1.16019961102817  0.0404224343483294 
 1.16041115971180  0.0290661176566563 
 1.16062274696883  0.0228273754441711 
 1.16083437280630  0.0188957410023050 
 1.16104603723124  0.0162073324175148 
 1.16125774025068  0.0142672571224914 
 1.16146948187167  0.0128137864504626 
 1.16168126210123  0.0116955854172572 
 1.16189308094642  0.0108192117465222 
 1.16210493841427  0.0101240202970398 
 1.16231683451183  0.00956911736717864 
 1.16252876924613  0.00912612005634400 
 1.16274074262423  0.00877492303394677 
 1.16295275465316  0.00850111966977802 
 1.16316480533999  0.00829438143812095 
 1.16337689469175  0.00814741920614045 
 1.16358902271550  0.00805531497183674 
 1.16380118941828  0.00801510248831789 
 1.16401339480715  0.00802552710353321 
 1.16422563888917  0.00808694747493739 
 1.16443792167139  0.00820136447428580 
 1.16465024316086  0.00837258162924723 
 1.16486260336465  0.00860652154872412 
 1.16507500228981  0.00891174903725497 
 1.16528743994340  0.00930029146703838 
 1.16549991633249  0.00978891351066303 
 1.16571243146413  0.0104011218735070 
 1.16592498534540  0.0111703987827634 
 1.16613757798336  0.0121456068807826 
 1.16635020938506  0.0134004476598266 
 1.16656287955759  0.0150509944603069 
 1.16677558850802  0.0172906438880384 
 1.16698833624340  0.0204666491938524 
 1.16720112277083  0.0252702054552124 
 1.16741394809735  0.0333012767471019 
 1.16762681223007  0.0492926460776923 
 1.16783971517603  0.0961445089674053 
 1.16805265694233  1.71454804469515 
 1.16826563753605  0.0971490039084088 
 1.16847865696426  0.0529705647048140 
 1.16869171523405  0.0346909518635886 
 1.16890481235249  0.0260084840568886 
 1.16911794832667  0.0209201799102469 
 1.16933112316368  0.0175932796738731 
 1.16954433687060  0.0152638123587014 
 1.16975758945452  0.0135553971989703 
 1.16997088092253  0.0122610529687469 
 1.17018421128171  0.0112576596332375 
 1.17039758053917  0.0104675604594780 
 1.17061098870198  0.00983953358459193 
 1.17082443577725  0.00933862047787035 
 1.17103792177207  0.00894035495193525 
 1.17125144669354  0.00862733030468970 
 1.17146501054876  0.00838708076744354 
 1.17167861334481  0.00821073939485383 
 1.17189225508882  0.00809217686539393 
 1.17210593578786  0.00802745354765604 
 1.17231965544907  0.00801448855600498 
 1.17253341407952  0.00805289206132895 
 1.17274721168633  0.00814393502821448 
 1.17296104827661  0.00829065186106222 
 1.17317492385746  0.00849809163616721 
 1.17338883843600  0.00877375773413978 
 1.17360279201933  0.00912831032764172 
 1.17381678461457  0.00957666212623197 
 1.17403081622882  0.0101396953009957 
 1.17424488686921  0.0108470077541128 
 1.17445899654286  0.0117414489229857 
 1.17467314525687  0.0128869350324675 
 1.17488733301837  0.0143826544889563 
 1.17510155983447  0.0163906867561953 
 1.17531582571230  0.0191945373338501 
 1.17553013065898  0.0233381953293419 
 1.17574447468163  0.0300134034990001 
 1.17595885778739  0.0424312912576353 
 1.17617327998336  0.0732474048086870 
 1.17638774127669  0.275639472378759 
 1.17660224167451  0.149052199344460 
 1.17681678118393  0.0639846882302848 
 1.17703135981210  0.0386184882279702 
 1.17724597756614  0.0280373007681602 
 1.17746063445319  0.0221395364900917 
 1.17767533048039  0.0183938531096739 
 1.17789006565487  0.0158205619659961 
 1.17810483998378  0.0139581911125872 
 1.17831965347424  0.0125606514893929 
 1.17853450613340  0.0114848126157474 
 1.17874939796841  0.0106419225816990 
 1.17896432898639  0.00997420910149169 
 1.17917929919452  0.00944264520892779 
 1.17939430859991  0.00902012892742683 
 1.17960935720974  0.00868748302690939 
 1.17982444503113  0.00843101363967859 
 1.18003957207124  0.00824097624694661 
 1.18025473833723  0.00811059587522967 
 1.18046994383624  0.00803544312630155 
 1.18068518857543  0.00801305261810407 
 1.18090047256195  0.00804272010092284 
 1.18111579580297  0.00812544628058968 
 1.18133115830563  0.00826401877981464 
 1.18154656007710  0.00846324490786019 
 1.18176200112453  0.00873037236941409 
 1.18197748145509  0.00907576934696890 
 1.18219300107595  0.00951399014593603 
 1.18240855999426  0.0100654474817072 
 1.18262415821719  0.0107590872759803 
 1.18283979575190  0.0116368023135331 
 1.18305547260557  0.0127610251015215 
 1.18327118878537  0.0142284993688010 
 1.18348694429846  0.0161969802132554 
 1.18370273915202  0.0189416138019907 
 1.18391857335322  0.0229882078845833 
 1.18413444690923  0.0294817327378736 
 1.18435035982724  0.0414766747361296 
 1.18456631211441  0.0707677705984802 
 1.18478230377794  0.247742644772986 
 1.18499833482498  0.157357424527726 
 1.18521440526273  0.0652608994880966 
 1.18543051509838  0.0389129732634554 
 1.18564666433910  0.0281325783761055 
 1.18586285299208  0.0221641200933705 
 1.18607908106450  0.0183883381042235 
 1.18629534856355  0.0158012062764232 
 1.18651165549643  0.0139324932253641 
 1.18672800187032  0.0125324199588103 
 1.18694438769241  0.0114561294434696 
 1.18716081296990  0.0106140021563514 
 1.18737727770998  0.00994781030484458 
 1.18759378191984  0.00941828466829629 
 1.18781032560669  0.00899819926082768 
 1.18802690877773  0.00866832340772287 
 1.18824353144014  0.00841495590668499 
 1.18846019360113  0.00822837884356972 
 1.18867689526791  0.00810187274706047 
 1.18889363644767  0.00803109231388015 
 1.18911041714763  0.00801368836093887 
 1.18932723737498  0.00804911228854350 
 1.18954409713694  0.00813857190681896 
 1.18976099644072  0.00828513180717500 
 1.18997793529352  0.00849397404913512 
 1.19019491370255  0.00877286160206509 
 1.19041193167503  0.00913288515345559 
 1.19062898921817  0.00958963576578834 
 1.19084608633919  0.0101650544535658 
 1.19106322304530  0.0108904122356507 
 1.19128039934373  0.0118112738990197 
 1.19149761524168  0.0129961377592855 
 1.19171487074639  0.0145523359691689 
 1.19193216586507  0.0166574349282051 
 1.19214950060494  0.0196271460025340 
 1.19236687497324  0.0240811488714167 
 1.19258428897718  0.0314236560000383 
 1.19280174262400  0.0456587816220701 
 1.19301923592091  0.0846027043264419 
 1.19323676887516  0.603687743207448 
 1.19345434149397  0.109786604961185 
 1.19367195378458  0.0553883010087312 
 1.19388960575422  0.0353811965228647 
 1.19410729741011  0.0262406984311651 
 1.19432502875951  0.0209773843523577 
 1.19454279980965  0.0175728248857332 
 1.19476061056776  0.0152066859654007 
 1.19497846104109  0.0134811808826990 
 1.19519635123688  0.0121799733937671 
 1.19541428116237  0.0111754462561549 
 1.19563225082481  0.0103876362397082 
 1.19585026023143  0.00976409234978228 
 1.19606830938950  0.00926919665527074 
 1.19628639830625  0.00887814616171743 
 1.19650452698894  0.00857339425219047 
 1.19672269544481  0.00834246730139460 
 1.19694090368112  0.00817659066372879 
 1.19715915170513  0.00806981524753466 
 1.19737743952408  0.00801847096143061 
 1.19759576714523  0.00802084865870758 
 1.19781413457585  0.00807705744485843 
 1.19803254182318  0.00818903459509550 
 1.19825098889450  0.00836070970211330 
 1.19846947579706  0.00859834947529506 
 1.19868800253811  0.00891114144507760 
 1.19890656912494  0.00931212314141380 
 1.19912517556480  0.00981964474737263 
 1.19934382186496  0.0104597005089281 
 1.19956250803269  0.0112697466397051 
 1.19978123407526  0.0123051980930769 
 1.20000000000000  0.0136510457346383 
