-3.00000000000000  0.643213163898856  0.00000000000000  0.000526997028292702  0.00000000000000  0.465797281045866 -12.9276160826082  0.0150131268911300  81.0651838763410 
-2.94000000000000  0.906868925233811  0.00000000000000  0.000879330600245903  0.00000000000000  0.537943440664431 -0.405571833792090  0.0187793704059253  79.1244780105623 
-2.88000000000000  1.26836751138131  0.00000000000000  0.00144843919911384  0.00000000000000  0.618630118577831  11.9144214973631  0.0240329481681730  78.8914619275728 
-2.82000000000000  1.75968240464913  0.00000000000000  0.00235484616412334  0.00000000000000  0.708360159379139  24.0302194640474  0.0309890932133720  80.3227262965004 
-2.76000000000000  2.42153887269256  0.00000000000000  0.00378006890300301  0.00000000000000  0.807564627282095  35.9399068502800  0.0398707644105376  83.1029831563402 
-2.70000000000000  3.30520027113669  0.00000000000000  0.00599492591156430  0.00000000000000  0.916578746705191  47.6418128808658  0.0509277650128297  86.8765287750117 
-2.64000000000000  4.47441600420346  0.00000000000000  0.00939982941394575  0.00000000000000  1.03561601103990  59.1345209714643  0.0644435787078739  91.3393217279312 
-2.58000000000000  6.00747675340582  0.00000000000000  0.0145815604436493  0.00000000000000  1.16474102987089  70.4168731491551  0.0807365168383827  96.2560905364263 
-2.52000000000000  7.99929529771393  0.00000000000000  0.0223924123502832  0.00000000000000  1.30384184645487  81.4879694387358  0.100158939367673  101.451383307890 
-2.46000000000000  10.5634005335346  0.00000000000000  0.0340592646398095  0.00000000000000  1.45260261303845  92.3471626403443  0.123095940862446  106.795669456391 
-2.40000000000000  13.8336996242581  0.00000000000000  0.0513321082063438  0.00000000000000  1.61047765206454  102.994049017292  0.149963816049538  112.193153338500 
-2.34000000000000  17.9658307157669  0.00000000000000  0.0766837496369991  0.00000000000000  1.77666804627593  113.428455469850  0.181208228413772  117.572546140069 
-2.28000000000000  23.1378991808360  0.00000000000000  0.113574795928176  0.00000000000000  1.95010197987059  123.650423794259  0.217301874594554  122.880438383856 
-2.22000000000000  29.5503673487293  0.00000000000000  0.166800423375745  0.00000000000000  2.12942008646175  133.660192621466  0.258741387399009  128.076621424891 
-2.16000000000000  37.4248550320011  0.00000000000000  0.242937657005172  0.00000000000000  2.31296703920150  143.458177602996  0.306043189897162  133.130785067702 
-2.10000000000000  47.0016099638419  0.00000000000000  0.350913640736699  0.00000000000000  2.49879053762308  153.044950368514  0.359737986871068  138.020163820838 
-2.04000000000000  58.5354274221342  0.00000000000000  0.502716288841899  0.00000000000000  2.68464870084641  162.421216727252  0.420363558884604  142.727831583792 
-1.98000000000000  72.2898401550904  0.00000000000000  0.714268317539737  0.00000000000000  2.86802666738742  171.587794529443  0.488455515297295  147.241439158446 
-1.92000000000000  88.5294654659156  0.00000000000000  1.00648343096046  0.00000000000000  3.04616293126643 -179.454408450677  0.564535674411613  151.552255303973 
-1.86000000000000  107.510486608581  0.00000000000000  1.40651879907952  0.00000000000000  3.21608561972549 -170.704416297644  0.649097780320159  155.654417616002 
-1.80000000000000  129.469359112286  0.00000000000000  1.94923032755545  0.00000000000000  3.37465855083754 -162.161206130189  0.742590344164493  159.544330670175 
-1.74000000000000  154.609965532349  0.00000000000000  2.67882603553264  0.00000000000000  3.51863651437899 -153.823728423268  0.845396516983085  163.220170198885 
-1.68000000000000  183.089588108782  0.00000000000000  3.65069769538269  0.00000000000000  3.64472881422396 -145.690926242300  0.957811062869409  166.681466650527 
-1.62000000000000  215.004219075490  0.00000000000000  4.93339151235295  0.00000000000000  3.74966971490427 -137.761753147783  1.08001470098892  169.928751347097 
-1.56000000000000  250.373871869632  0.00000000000000  6.61065508624986  0.00000000000000  3.83029406945269 -130.035189497040  1.21204631451000  172.963254960473 
-1.50000000000000  289.128680592950  0.00000000000000  8.78347064351617  0.00000000000000  3.88361609039220 -122.510256806200  1.35377377059066  175.786652101061 
-1.44000000000000  331.096666382826  0.00000000000000  11.5719544804396  0.00000000000000  3.90690897918606 -115.186029725595  1.50486434152757  178.400848131509 
-1.38000000000000  375.994094841265  0.00000000000000  15.1169712027435  0.00000000000000  3.89778296700071 -108.061645000055  1.66475594405599 -179.192194594903 
-1.32000000000000  423.419336984696  0.00000000000000  19.5812807831346  0.00000000000000  3.85425925243727 -101.136306485021  1.83263060199053 -176.990593597797 
-1.26000000000000  472.851068964353  0.00000000000000  25.1500094081184  0.00000000000000  3.77483735606896 -94.4092847805996  2.00739166838932 -174.992648963249 
-1.20000000000000  523.651499003661  0.00000000000000  32.0302148401936  0.00000000000000  3.65855354770564 -87.8799091527818  2.18764640134069 -173.196915008211 
-1.14000000000000  575.075094894318  0.00000000000000  40.4493073146726  0.00000000000000  3.50502823514973 -81.5475477751249  2.37169546047006 -171.602244488034 
-1.08000000000000  626.283009318935  0.00000000000000  50.6520917786910  0.00000000000000  3.31450052235962 -75.4115691750512  2.55753077254854 -170.207809244549 
-1.02000000000000  676.363076786664  0.00000000000000  62.8962204284184  0.00000000000000  3.08784853546913 -69.4712713570901  2.74284300307041 -169.013101346383 
-0.960000000000000  724.354904449811  0.00000000000000  77.4458893722172  0.00000000000000  2.82659455885837 -63.7257511401840  2.92503957125553 -168.017918739692 
-0.900000000000000  769.279223622281  0.00000000000000  94.5636822151156  0.00000000000000  2.53289450075337 -58.1736535010089  3.10127376941087 -167.222339224499 
-0.840000000000000  810.170336593573  0.00000000000000  114.500557271442  0.00000000000000  2.20951170000573 -52.8126559873259  3.26848511014486 -166.626686237963 
-0.780000000000000  846.110212292085  0.00000000000000  137.484092762682  0.00000000000000  1.85977558058791 -47.6382952987666  3.42345054733289 -166.231489508854 
-0.720000000000000  876.262580722552  0.00000000000000  163.705242034696  0.00000000000000  1.48752617139859 -42.6408875109477  3.56284572315223 -166.037443194733 
-0.660000000000000  899.905271706014  0.00000000000000  193.304002015743  0.00000000000000  1.09704618125085 -37.7955571210375  3.68331491007508 -166.045363666576 
-0.600000000000000  916.459053244837  0.00000000000000  226.354553456045  0.00000000000000  0.692984350189477 -33.0165589901578  3.78154786988781 -166.256148698463 
-0.540000000000000  925.511354947276  0.00000000000000  262.850578961506  0.00000000000000  0.280298129085962 -27.7048385776602  3.85436146664026 -166.670739478416 
-0.480000000000000  926.833508472352  0.00000000000000  302.691590508933  0.00000000000000  0.136393807667612  151.398967807840  3.89878356885583 -167.290086601343 
-0.420000000000000  920.390485730095  0.00000000000000  345.671187102224  0.00000000000000  0.550970356259815  157.870019284189  3.91213657565813 -168.115121057530 
-0.360000000000000  906.342542998713  0.00000000000000  391.468200997719  0.00000000000000  0.958975883429240  161.948182507797  3.89211781315508 -169.146731219983 
-0.300000000000000  885.038654045335  0.00000000000000  439.641665004592  0.00000000000000  1.35525992411156  165.606032173694  3.83687407632019 -170.385747014993 
-0.240000000000000  857.002101795946  0.00000000000000  489.630434979180  0.00000000000000  1.73502843157396  168.992140184063  3.74506773570447 -171.832932938337 
-0.180000000000000  822.909058660015  0.00000000000000  540.758127312452  0.00000000000000  2.09381718420649  172.143024417685  3.61593207901108 -173.488992571332 
-0.120000000000000  783.561384944336  0.00000000000000  592.243784050332  0.00000000000000  2.42757130744239  175.071769550942  3.44931390053842 -175.354589214589 
-0.0600000000000001  739.855183045627  0.00000000000000  643.218368640873  0.00000000000000  2.73271980190512  177.784092314217  3.24570176797759 -177.430391202871 
 0.00000000000000  692.746840748714  0.00000000000000  692.746840748714  0.00000000000000  3.00623886448392 -179.717158748220  3.00623886448392 -179.717158748220 
 0.0600000000000001  643.218368640873  0.00000000000000  739.855183045628  0.00000000000000  3.24570176797759 -177.430391202871  2.73271980190512  177.784092314217 
 0.120000000000000  592.243784050332  0.00000000000000  783.561384944336  0.00000000000000  3.44931390053842 -175.354589214589  2.42757130744239  175.071769550942 
 0.180000000000000  540.758127312452  0.00000000000000  822.909058660015  0.00000000000000  3.61593207901108 -173.488992571332  2.09381718420650  172.143024417685 
 0.240000000000000  489.630434979180  0.00000000000000  857.002101795946  0.00000000000000  3.74506773570447 -171.832932938337  1.73502843157396  168.992140184063 
 0.300000000000000  439.641665004592  0.00000000000000  885.038654045335  0.00000000000000  3.83687407632019 -170.385747014993  1.35525992411156  165.606032173694 
 0.360000000000000  391.468200997719  0.00000000000000  906.342542998713  0.00000000000000  3.89211781315508 -169.146731219983  0.958975883429243  161.948182507797 
 0.420000000000000  345.671187102224  0.00000000000000  920.390485730095  0.00000000000000  3.91213657565813 -168.115121057530  0.550970356259815  157.870019284189 
 0.480000000000000  302.691590508933  0.00000000000000  926.833508472352  0.00000000000000  3.89878356885583 -167.290086601343  0.136393807667612  151.398967807840 
 0.540000000000000  262.850578961506  0.00000000000000  925.511354947276  0.00000000000000  3.85436146664026 -166.670739478416  0.280298129085961 -27.7048385776603 
 0.600000000000000  226.354553456045  0.00000000000000  916.459053244837  0.00000000000000  3.78154786988782 -166.256148698463  0.692984350189475 -33.0165589901578 
 0.660000000000000  193.304002015743  0.00000000000000  899.905271706014  0.00000000000000  3.68331491007508 -166.045363666576  1.09704618125085 -37.7955571210375 
 0.720000000000000  163.705242034696  0.00000000000000  876.262580722552  0.00000000000000  3.56284572315224 -166.037443194733  1.48752617139859 -42.6408875109478 
 0.780000000000000  137.484092762682  0.00000000000000  846.110212292085  0.00000000000000  3.42345054733289 -166.231489508854  1.85977558058791 -47.6382952987665 
 0.840000000000000  114.500557271442  0.00000000000000  810.170336593573  0.00000000000000  3.26848511014486 -166.626686237963  2.20951170000572 -52.8126559873259 
 0.900000000000000  94.5636822151156  0.00000000000000  769.279223622281  0.00000000000000  3.10127376941087 -167.222339224499  2.53289450075337 -58.1736535010089 
 0.960000000000000  77.4458893722172  0.00000000000000  724.354904449810  0.00000000000000  2.92503957125553 -168.017918739692  2.82659455885837 -63.7257511401840 
 1.02000000000000  62.8962204284185  0.00000000000000  676.363076786665  0.00000000000000  2.74284300307041 -169.013101346383  3.08784853546913 -69.4712713570900 
 1.08000000000000  50.6520917786910  0.00000000000000  626.283009318935  0.00000000000000  2.55753077254854 -170.207809244549  3.31450052235962 -75.4115691750512 
 1.14000000000000  40.4493073146727  0.00000000000000  575.075094894319  0.00000000000000  2.37169546047007 -171.602244488034  3.50502823514973 -81.5475477751248 
 1.20000000000000  32.0302148401936  0.00000000000000  523.651499003661  0.00000000000000  2.18764640134069 -173.196915008211  3.65855354770564 -87.8799091527818 
 1.26000000000000  25.1500094081184  0.00000000000000  472.851068964353  0.00000000000000  2.00739166838932 -174.992648963249  3.77483735606896 -94.4092847805996 
 1.32000000000000  19.5812807831346  0.00000000000000  423.419336984696  0.00000000000000  1.83263060199053 -176.990593597797  3.85425925243727 -101.136306485021 
 1.38000000000000  15.1169712027436  0.00000000000000  375.994094841265  0.00000000000000  1.66475594405599 -179.192194594903  3.89778296700071 -108.061645000055 
 1.44000000000000  11.5719544804396  0.00000000000000  331.096666382826  0.00000000000000  1.50486434152757  178.400848131510  3.90690897918607 -115.186029725595 
 1.50000000000000  8.78347064351619  0.00000000000000  289.128680592951  0.00000000000000  1.35377377059066  175.786652101061  3.88361609039220 -122.510256806200 
 1.56000000000000  6.61065508624990  0.00000000000000  250.373871869632  0.00000000000000  1.21204631451000  172.963254960473  3.83029406945269 -130.035189497040 
 1.62000000000000  4.93339151235296  0.00000000000000  215.004219075490  0.00000000000000  1.08001470098892  169.928751347097  3.74966971490427 -137.761753147783 
 1.68000000000000  3.65069769538269  0.00000000000000  183.089588108782  0.00000000000000  0.957811062869409  166.681466650527  3.64472881422396 -145.690926242300 
 1.74000000000000  2.67882603553264  0.00000000000000  154.609965532349  0.00000000000000  0.845396516983085  163.220170198885  3.51863651437899 -153.823728423268 
 1.80000000000000  1.94923032755545  0.00000000000000  129.469359112286  0.00000000000000  0.742590344164493  159.544330670175  3.37465855083754 -162.161206130189 
 1.86000000000000  1.40651879907953  0.00000000000000  107.510486608581  0.00000000000000  0.649097780320160  155.654417616002  3.21608561972550 -170.704416297644 
 1.92000000000000  1.00648343096047  0.00000000000000  88.5294654659155  0.00000000000000  0.564535674411613  151.552255303974  3.04616293126643 -179.454408450677 
 1.98000000000000  0.714268317539740  0.00000000000000  72.2898401550905  0.00000000000000  0.488455515297296  147.241439158446  2.86802666738742  171.587794529443 
 2.04000000000000  0.502716288841900  0.00000000000000  58.5354274221342  0.00000000000000  0.420363558884604  142.727831583792  2.68464870084641  162.421216727252 
 2.10000000000000  0.350913640736702  0.00000000000000  47.0016099638420  0.00000000000000  0.359737986871069  138.020163820838  2.49879053762308  153.044950368514 
 2.16000000000000  0.242937657005173  0.00000000000000  37.4248550320011  0.00000000000000  0.306043189897162  133.130785067702  2.31296703920150  143.458177602996 
 2.22000000000000  0.166800423375746  0.00000000000000  29.5503673487293  0.00000000000000  0.258741387399009  128.076621424891  2.12942008646175  133.660192621466 
 2.28000000000000  0.113574795928178  0.00000000000000  23.1378991808361  0.00000000000000  0.217301874594554  122.880438383856  1.95010197987059  123.650423794259 
 2.34000000000000  0.0766837496369993  0.00000000000000  17.9658307157668  0.00000000000000  0.181208228413772  117.572546140069  1.77666804627593  113.428455469850 
 2.40000000000000  0.0513321082063439  0.00000000000000  13.8336996242582  0.00000000000000  0.149963816049538  112.193153338500  1.61047765206454  102.994049017292 
 2.46000000000000  0.0340592646398096  0.00000000000000  10.5634005335346  0.00000000000000  0.123095940862446  106.795669456391  1.45260261303845  92.3471626403443 
 2.52000000000000  0.0223924123502835  0.00000000000000  7.99929529771395  0.00000000000000  0.100158939367673  101.451383307890  1.30384184645488  81.4879694387359 
 2.58000000000000  0.0145815604436494  0.00000000000000  6.00747675340581  0.00000000000000  0.0807365168383828  96.2560905364264  1.16474102987089  70.4168731491551 
 2.64000000000000  0.00939982941394593  0.00000000000000  4.47441600420347  0.00000000000000  0.0644435787078739  91.3393217279312  1.03561601103990  59.1345209714645 
 2.70000000000000  0.00599492591156434  0.00000000000000  3.30520027113669  0.00000000000000  0.0509277650128297  86.8765287750118  0.916578746705191  47.6418128808658 
 2.76000000000000  0.00378006890300304  0.00000000000000  2.42153887269256  0.00000000000000  0.0398707644105377  83.1029831563403  0.807564627282095  35.9399068502800 
 2.82000000000000  0.00235484616412336  0.00000000000000  1.75968240464913  0.00000000000000  0.0309890932133721  80.3227262965004  0.708360159379140  24.0302194640474 
 2.88000000000000  0.00144843919911386  0.00000000000000  1.26836751138131  0.00000000000000  0.0240329481681731  78.8914619275729  0.618630118577831  11.9144214973631 
 2.94000000000000  0.000879330600245905  0.00000000000000  0.906868925233812  0.00000000000000  0.0187793704059254  79.1244780105625  0.537943440664431 -0.405571833792063 
 3.00000000000000  0.000526997028292707  0.00000000000000  0.643213163898856  0.00000000000000  0.0150131268911301  81.0651838763411  0.465797281045866 -12.9276160826082 
