 1.00000000000000e-05  3.99920009332534e-08 
 0.000209000000000000  0.00699810572351468 
 0.000408000000000000  0.0801898909913477 
 0.000607000000000000  0.271861901012236 
 0.000806000000000000  0.528921262478824 
 0.00100500000000000  0.752298047811000 
 0.00120400000000000  0.892901220401625 
 0.00140300000000000  0.961360252764621 
 0.00160200000000000  0.988234869496082 
 0.00180100000000000  0.996956710681072 
 0.00200000000000000  0.999329187409813 
