 0.00000000000000  0.00000000000000  3.43329497839268e-05 
 0.00000000000000  10.0000000000000  2.50978410604366e-05 
 0.00000000000000  20.0000000000000  1.51001471364453e-05 
 0.00000000000000  30.0000000000000  4.64364288275636e-06 
 0.00000000000000  40.0000000000000 -5.95395611012849e-06 
 0.00000000000000  50.0000000000000 -1.63706471594543e-05 
 0.00000000000000  60.0000000000000 -2.62899243787872e-05 
 0.00000000000000  70.0000000000000 -3.54103955492143e-05 
 0.00000000000000  80.0000000000000 -4.34549397694032e-05 
 0.00000000000000  90.0000000000000 -5.01791276339594e-05 
 0.00000000000000  100.000000000000 -5.53786480972215e-05 
 0.00000000000000  110.000000000000 -5.88955163609975e-05 
 0.00000000000000  120.000000000000 -6.06228741627139e-05 
 0.00000000000000  130.000000000000 -6.05082366096508e-05 
 0.00000000000000  140.000000000000 -5.85550869058486e-05 
 0.00000000000000  150.000000000000 -5.48227705167157e-05 
 0.00000000000000  160.000000000000 -4.94246919870930e-05 
 0.00000000000000  170.000000000000 -4.25248692015433e-05 
 0.00000000000000  180.000000000000 -3.43329497839268e-05 
 0.00000000000000  190.000000000000 -2.50978410604365e-05 
 0.00000000000000  200.000000000000 -1.51001471364453e-05 
 0.00000000000000  210.000000000000 -4.64364288275635e-06 
 0.00000000000000  220.000000000000  5.95395611012849e-06 
 0.00000000000000  230.000000000000  1.63706471594542e-05 
 0.00000000000000  240.000000000000  2.62899243787871e-05 
 0.00000000000000  250.000000000000  3.54103955492143e-05 
 0.00000000000000  260.000000000000  4.34549397694032e-05 
 0.00000000000000  270.000000000000  5.01791276339594e-05 
 0.00000000000000  280.000000000000  5.53786480972214e-05 
 0.00000000000000  290.000000000000  5.88955163609975e-05 
 0.00000000000000  300.000000000000  6.06228741627140e-05 
 0.00000000000000  310.000000000000  6.05082366096508e-05 
 0.00000000000000  320.000000000000  5.85550869058486e-05 
 0.00000000000000  330.000000000000  5.48227705167158e-05 
 0.00000000000000  340.000000000000  4.94246919870930e-05 
 0.00000000000000  350.000000000000  4.25248692015433e-05 
 0.00000000000000  360.000000000000  3.43329497839268e-05 

 10.0000000000000  0.00000000000000 -1.98686684916045e-05 
 10.0000000000000  10.0000000000000 -8.61418985214655e-06 
 10.0000000000000  20.0000000000000  2.90202658697848e-06 
 10.0000000000000  30.0000000000000  1.43300664167545e-05 
 10.0000000000000  40.0000000000000  2.53226944298209e-05 
 10.0000000000000  50.0000000000000  3.55459051865388e-05 
 10.0000000000000  60.0000000000000  4.46890716012597e-05 
 10.0000000000000  70.0000000000000  5.24743831891377e-05 
 10.0000000000000  80.0000000000000  5.86652871971329e-05 
 10.0000000000000  90.0000000000000  6.30736761397108e-05 
 10.0000000000000  100.000000000000  6.55656033496038e-05 
 10.0000000000000  110.000000000000  6.60653528795153e-05 
 10.0000000000000  120.000000000000  6.45577400928642e-05 
 10.0000000000000  130.000000000000  6.10885730412843e-05 
 10.0000000000000  140.000000000000  5.57632606101544e-05 
 10.0000000000000  150.000000000000  4.87436097229564e-05 
 10.0000000000000  160.000000000000  4.02429089197830e-05 
 10.0000000000000  170.000000000000  3.05194476929764e-05 
 10.0000000000000  180.000000000000  1.98686684916045e-05 
 10.0000000000000  190.000000000000  8.61418985214654e-06 
 10.0000000000000  200.000000000000 -2.90202658697847e-06 
 10.0000000000000  210.000000000000 -1.43300664167545e-05 
 10.0000000000000  220.000000000000 -2.53226944298209e-05 
 10.0000000000000  230.000000000000 -3.55459051865388e-05 
 10.0000000000000  240.000000000000 -4.46890716012597e-05 
 10.0000000000000  250.000000000000 -5.24743831891377e-05 
 10.0000000000000  260.000000000000 -5.86652871971329e-05 
 10.0000000000000  270.000000000000 -6.30736761397108e-05 
 10.0000000000000  280.000000000000 -6.55656033496038e-05 
 10.0000000000000  290.000000000000 -6.60653528795153e-05 
 10.0000000000000  300.000000000000 -6.45577400928642e-05 
 10.0000000000000  310.000000000000 -6.10885730412843e-05 
 10.0000000000000  320.000000000000 -5.57632606101544e-05 
 10.0000000000000  330.000000000000 -4.87436097229564e-05 
 10.0000000000000  340.000000000000 -4.02429089197829e-05 
 10.0000000000000  350.000000000000 -3.05194476929764e-05 
 10.0000000000000  360.000000000000 -1.98686684916045e-05 

 20.0000000000000  0.00000000000000 -7.34665873290497e-05 
 20.0000000000000  10.0000000000000 -4.20644829650625e-05 
 20.0000000000000  20.0000000000000 -9.38427057183737e-06 
 20.0000000000000  30.0000000000000  2.35810781340430e-05 
 20.0000000000000  40.0000000000000  5.58299277134219e-05 
 20.0000000000000  50.0000000000000  8.63824131905349e-05 
 20.0000000000000  60.0000000000000  0.000114310212754464 
 20.0000000000000  70.0000000000000  0.000138764754347607 
 20.0000000000000  80.0000000000000  0.000159002999098252 
 20.0000000000000  90.0000000000000  0.000174410018180696 
 20.0000000000000  100.000000000000  0.000184517677116448 
 20.0000000000000  110.000000000000  0.000189018859803466 
 20.0000000000000  120.000000000000  0.000187776800083513 
 20.0000000000000  130.000000000000  0.000180829237312669 
 20.0000000000000  140.000000000000  0.000168387269670089 
 20.0000000000000  150.000000000000  0.000150828940046653 
 20.0000000000000  160.000000000000  0.000128687749403026 
 20.0000000000000  170.000000000000  0.000102636446612931 
 20.0000000000000  180.000000000000  7.34665873290497e-05 
 20.0000000000000  190.000000000000  4.20644829650625e-05 
 20.0000000000000  200.000000000000  9.38427057183738e-06 
 20.0000000000000  210.000000000000 -2.35810781340431e-05 
 20.0000000000000  220.000000000000 -5.58299277134219e-05 
 20.0000000000000  230.000000000000 -8.63824131905349e-05 
 20.0000000000000  240.000000000000 -0.000114310212754464 
 20.0000000000000  250.000000000000 -0.000138764754347607 
 20.0000000000000  260.000000000000 -0.000159002999098252 
 20.0000000000000  270.000000000000 -0.000174410018180696 
 20.0000000000000  280.000000000000 -0.000184517677116448 
 20.0000000000000  290.000000000000 -0.000189018859803466 
 20.0000000000000  300.000000000000 -0.000187776800083513 
 20.0000000000000  310.000000000000 -0.000180829237312669 
 20.0000000000000  320.000000000000 -0.000168387269670089 
 20.0000000000000  330.000000000000 -0.000150828940046653 
 20.0000000000000  340.000000000000 -0.000128687749403026 
 20.0000000000000  350.000000000000 -0.000102636446612931 
 20.0000000000000  360.000000000000 -7.34665873290498e-05 

 30.0000000000000  0.00000000000000 -0.000124832261086389 
 30.0000000000000  10.0000000000000 -7.42366680487405e-05 
 30.0000000000000  20.0000000000000 -2.13854314179980e-05 
 30.0000000000000  30.0000000000000  3.21155907248300e-05 
 30.0000000000000  40.0000000000000  8.46407968947571e-05 
 30.0000000000000  50.0000000000000  0.000134594235281347 
 30.0000000000000  60.0000000000000  0.000180458095936882 
 30.0000000000000  70.0000000000000  0.000220838828663578 
 30.0000000000000  80.0000000000000  0.000254509485331170 
 30.0000000000000  90.0000000000000  0.000280447000074989 
 30.0000000000000  100.000000000000  0.000297863274634558 
 30.0000000000000  110.000000000000  0.000306229124320446 
 30.0000000000000  120.000000000000  0.000305290357023271 
 30.0000000000000  130.000000000000  0.000295075496712318 
 30.0000000000000  140.000000000000  0.000275894916749168 
 30.0000000000000  150.000000000000  0.000248331409350158 
 30.0000000000000  160.000000000000  0.000213222477739801 
 30.0000000000000  170.000000000000  0.000171634889039099 
 30.0000000000000  180.000000000000  0.000124832261086389 
 30.0000000000000  190.000000000000  7.42366680487405e-05 
 30.0000000000000  200.000000000000  2.13854314179980e-05 
 30.0000000000000  210.000000000000 -3.21155907248301e-05 
 30.0000000000000  220.000000000000 -8.46407968947571e-05 
 30.0000000000000  230.000000000000 -0.000134594235281347 
 30.0000000000000  240.000000000000 -0.000180458095936882 
 30.0000000000000  250.000000000000 -0.000220838828663578 
 30.0000000000000  260.000000000000 -0.000254509485331170 
 30.0000000000000  270.000000000000 -0.000280447000074989 
 30.0000000000000  280.000000000000 -0.000297863274634558 
 30.0000000000000  290.000000000000 -0.000306229124320446 
 30.0000000000000  300.000000000000 -0.000305290357023271 
 30.0000000000000  310.000000000000 -0.000295075496712318 
 30.0000000000000  320.000000000000 -0.000275894916749168 
 30.0000000000000  330.000000000000 -0.000248331409350159 
 30.0000000000000  340.000000000000 -0.000213222477739801 
 30.0000000000000  350.000000000000 -0.000171634889039099 
 30.0000000000000  360.000000000000 -0.000124832261086389 

 40.0000000000000  0.00000000000000 -0.000172404969758790 
 40.0000000000000  10.0000000000000 -0.000104153209539324 
 40.0000000000000  20.0000000000000 -3.27368067520731e-05 
 40.0000000000000  30.0000000000000  3.96742873427161e-05 
 40.0000000000000  40.0000000000000  0.000110879898292755 
 40.0000000000000  50.0000000000000  0.000178716479641104 
 40.0000000000000  60.0000000000000  0.000241122851190461 
 40.0000000000000  70.0000000000000  0.000296202826920445 
 40.0000000000000  80.0000000000000  0.000342282829640315 
 40.0000000000000  90.0000000000000  0.000377962741785032 
 40.0000000000000  100.000000000000  0.000402158447278987 
 40.0000000000000  110.000000000000  0.000414134771854363 
 40.0000000000000  120.000000000000  0.000413527820949251 
 40.0000000000000  130.000000000000  0.000400356036459769 
 40.0000000000000  140.000000000000  0.000375019636392388 
 40.0000000000000  150.000000000000  0.000338288454442316 
 40.0000000000000  160.000000000000  0.000291278548986232 
 40.0000000000000  170.000000000000  0.000235418292213259 
 40.0000000000000  180.000000000000  0.000172404969758790 
 40.0000000000000  190.000000000000  0.000104153209539324 
 40.0000000000000  200.000000000000  3.27368067520732e-05 
 40.0000000000000  210.000000000000 -3.96742873427162e-05 
 40.0000000000000  220.000000000000 -0.000110879898292755 
 40.0000000000000  230.000000000000 -0.000178716479641104 
 40.0000000000000  240.000000000000 -0.000241122851190461 
 40.0000000000000  250.000000000000 -0.000296202826920445 
 40.0000000000000  260.000000000000 -0.000342282829640315 
 40.0000000000000  270.000000000000 -0.000377962741785032 
 40.0000000000000  280.000000000000 -0.000402158447278987 
 40.0000000000000  290.000000000000 -0.000414134771854363 
 40.0000000000000  300.000000000000 -0.000413527820949251 
 40.0000000000000  310.000000000000 -0.000400356036459769 
 40.0000000000000  320.000000000000 -0.000375019636392388 
 40.0000000000000  330.000000000000 -0.000338288454442316 
 40.0000000000000  340.000000000000 -0.000291278548986232 
 40.0000000000000  350.000000000000 -0.000235418292213259 
 40.0000000000000  360.000000000000 -0.000172404969758790 

 50.0000000000000  0.00000000000000 -0.000214739240666194 
 50.0000000000000  10.0000000000000 -0.000130905108462122 
 50.0000000000000  20.0000000000000 -4.30934907786101e-05 
 50.0000000000000  30.0000000000000  4.60275008158518e-05 
 50.0000000000000  40.0000000000000  0.000133749970089063 
 50.0000000000000  50.0000000000000  0.000217408514201869 
 50.0000000000000  60.0000000000000  0.000294461210624667 
 50.0000000000000  70.0000000000000  0.000362566852167198 
 50.0000000000000  80.0000000000000  0.000419656083374307 
 50.0000000000000  90.0000000000000  0.000463994276844313 
 50.0000000000000  100.000000000000  0.000494234239004837 
 50.0000000000000  110.000000000000  0.000509457143907792 
 50.0000000000000  120.000000000000  0.000509200451290862 
 50.0000000000000  130.000000000000  0.000493471960629320 
 50.0000000000000  140.000000000000  0.000462749574152917 
 50.0000000000000  150.000000000000  0.000417966776028461 
 50.0000000000000  160.000000000000  0.000360484268915774 
 50.0000000000000  170.000000000000  0.000292048629705923 
 50.0000000000000  180.000000000000  0.000214739240666194 
 50.0000000000000  190.000000000000  0.000130905108462122 
 50.0000000000000  200.000000000000  4.30934907786101e-05 
 50.0000000000000  210.000000000000 -4.60275008158519e-05 
 50.0000000000000  220.000000000000 -0.000133749970089063 
 50.0000000000000  230.000000000000 -0.000217408514201869 
 50.0000000000000  240.000000000000 -0.000294461210624667 
 50.0000000000000  250.000000000000 -0.000362566852167198 
 50.0000000000000  260.000000000000 -0.000419656083374307 
 50.0000000000000  270.000000000000 -0.000463994276844313 
 50.0000000000000  280.000000000000 -0.000494234239004837 
 50.0000000000000  290.000000000000 -0.000509457143907792 
 50.0000000000000  300.000000000000 -0.000509200451290862 
 50.0000000000000  310.000000000000 -0.000493471960629320 
 50.0000000000000  320.000000000000 -0.000462749574152917 
 50.0000000000000  330.000000000000 -0.000417966776028461 
 50.0000000000000  340.000000000000 -0.000360484268915774 
 50.0000000000000  350.000000000000 -0.000292048629705923 
 50.0000000000000  360.000000000000 -0.000214739240666194 

 60.0000000000000  0.00000000000000 -0.000250548768409255 
 60.0000000000000  10.0000000000000 -0.000153679521905480 
 60.0000000000000  20.0000000000000 -5.21408008941975e-05 
 60.0000000000000  30.0000000000000  5.09821919677370e-05 
 60.0000000000000  40.0000000000000  0.000152556116724966 
 60.0000000000000  50.0000000000000  0.000249494701072627 
 60.0000000000000  60.0000000000000  0.000338852515178606 
 60.0000000000000  70.0000000000000  0.000417914467078529 
 60.0000000000000  80.0000000000000  0.000484278299371196 
 60.0000000000000  90.0000000000000  0.000535927580594112 
 60.0000000000000  100.000000000000  0.000571292973473118 
 60.0000000000000  110.000000000000  0.000589299918441336 
 60.0000000000000  120.000000000000  0.000589401283587861 
 60.0000000000000  130.000000000000  0.000571593988984010 
 60.0000000000000  140.000000000000  0.000536419100265393 
 60.0000000000000  150.000000000000  0.000484945388626375 
 60.0000000000000  160.000000000000  0.000418736856748152 
 60.0000000000000  170.000000000000  0.000339805217368709 
 60.0000000000000  180.000000000000  0.000250548768409255 
 60.0000000000000  190.000000000000  0.000153679521905480 
 60.0000000000000  200.000000000000  5.21408008941975e-05 
 60.0000000000000  210.000000000000 -5.09821919677372e-05 
 60.0000000000000  220.000000000000 -0.000152556116724966 
 60.0000000000000  230.000000000000 -0.000249494701072626 
 60.0000000000000  240.000000000000 -0.000338852515178606 
 60.0000000000000  250.000000000000 -0.000417914467078529 
 60.0000000000000  260.000000000000 -0.000484278299371196 
 60.0000000000000  270.000000000000 -0.000535927580594112 
 60.0000000000000  280.000000000000 -0.000571292973473118 
 60.0000000000000  290.000000000000 -0.000589299918441336 
 60.0000000000000  300.000000000000 -0.000589401283587861 
 60.0000000000000  310.000000000000 -0.000571593988984010 
 60.0000000000000  320.000000000000 -0.000536419100265393 
 60.0000000000000  330.000000000000 -0.000484945388626375 
 60.0000000000000  340.000000000000 -0.000418736856748152 
 60.0000000000000  350.000000000000 -0.000339805217368709 
 60.0000000000000  360.000000000000 -0.000250548768409255 

 70.0000000000000  0.00000000000000 -0.000278745498607995 
 70.0000000000000  10.0000000000000 -0.000171784460841330 
 70.0000000000000  20.0000000000000 -5.96038391591331e-05 
 70.0000000000000  30.0000000000000  5.43878150149165e-05 
 70.0000000000000  40.0000000000000  0.000166726922951300 
 70.0000000000000  50.0000000000000  0.000274000117701703 
 70.0000000000000  60.0000000000000  0.000372947957526488 
 70.0000000000000  70.0000000000000  0.000460563962382604 
 70.0000000000000  80.0000000000000  0.000534185964298334 
 70.0000000000000  90.0000000000000  0.000591576996000001 
 70.0000000000000  100.000000000000  0.000630993260030611 
 70.0000000000000  110.000000000000  0.000651237113153187 
 70.0000000000000  120.000000000000  0.000651693456134483 
 70.0000000000000  130.000000000000  0.000632348423223934 
 70.0000000000000  140.000000000000  0.000593789803457467 
 70.0000000000000  150.000000000000  0.000537189180985084 
 70.0000000000000  160.000000000000  0.000464266337079311 
 70.0000000000000  170.000000000000  0.000377236995451484 
 70.0000000000000  180.000000000000  0.000278745498607995 
 70.0000000000000  190.000000000000  0.000171784460841330 
 70.0000000000000  200.000000000000  5.96038391591331e-05 
 70.0000000000000  210.000000000000 -5.43878150149166e-05 
 70.0000000000000  220.000000000000 -0.000166726922951300 
 70.0000000000000  230.000000000000 -0.000274000117701702 
 70.0000000000000  240.000000000000 -0.000372947957526488 
 70.0000000000000  250.000000000000 -0.000460563962382604 
 70.0000000000000  260.000000000000 -0.000534185964298334 
 70.0000000000000  270.000000000000 -0.000591576996000001 
 70.0000000000000  280.000000000000 -0.000630993260030611 
 70.0000000000000  290.000000000000 -0.000651237113153187 
 70.0000000000000  300.000000000000 -0.000651693456134483 
 70.0000000000000  310.000000000000 -0.000632348423223934 
 70.0000000000000  320.000000000000 -0.000593789803457468 
 70.0000000000000  330.000000000000 -0.000537189180985084 
 70.0000000000000  340.000000000000 -0.000464266337079311 
 70.0000000000000  350.000000000000 -0.000377236995451484 
 70.0000000000000  360.000000000000 -0.000278745498607995 

 80.0000000000000  0.00000000000000 -0.000298472687883560 
 80.0000000000000  10.0000000000000 -0.000184669815861648 
 80.0000000000000  20.0000000000000 -6.52558449322162e-05 
 80.0000000000000  30.0000000000000  5.61408918244302e-05 
 80.0000000000000  40.0000000000000  0.000175831815991653 
 80.0000000000000  50.0000000000000  0.000290180179405162 
 80.0000000000000  60.0000000000000  0.000395711564905701 
 80.0000000000000  70.0000000000000  0.000489219454746293 
 80.0000000000000  80.0000000000000  0.000567862659011409 
 80.0000000000000  90.0000000000000  0.000629251643734833 
 80.0000000000000  100.000000000000  0.000671521135680070 
 80.0000000000000  110.000000000000  0.000693386797723759 
 80.0000000000000  120.000000000000  0.000694184252789260 
 80.0000000000000  130.000000000000  0.000673889270607942 
 80.0000000000000  140.000000000000  0.000633118503943625 
 80.0000000000000  150.000000000000  0.000573110751910403 
 80.0000000000000  160.000000000000  0.000495689319688417 
 80.0000000000000  170.000000000000  0.000403206618318597 
 80.0000000000000  180.000000000000  0.000298472687883560 
 80.0000000000000  190.000000000000  0.000184669815861648 
 80.0000000000000  200.000000000000  6.52558449322162e-05 
 80.0000000000000  210.000000000000 -5.61408918244303e-05 
 80.0000000000000  220.000000000000 -0.000175831815991653 
 80.0000000000000  230.000000000000 -0.000290180179405162 
 80.0000000000000  240.000000000000 -0.000395711564905701 
 80.0000000000000  250.000000000000 -0.000489219454746294 
 80.0000000000000  260.000000000000 -0.000567862659011409 
 80.0000000000000  270.000000000000 -0.000629251643734833 
 80.0000000000000  280.000000000000 -0.000671521135680070 
 80.0000000000000  290.000000000000 -0.000693386797723759 
 80.0000000000000  300.000000000000 -0.000694184252789260 
 80.0000000000000  310.000000000000 -0.000673889270607942 
 80.0000000000000  320.000000000000 -0.000633118503943625 
 80.0000000000000  330.000000000000 -0.000573110751910403 
 80.0000000000000  340.000000000000 -0.000495689319688417 
 80.0000000000000  350.000000000000 -0.000403206618318597 
 80.0000000000000  360.000000000000 -0.000298472687883560 

 90.0000000000000  0.00000000000000 -0.000309130935572249 
 90.0000000000000  10.0000000000000 -0.000191944071974445 
 90.0000000000000  20.0000000000000 -6.89250848780849e-05 
 90.0000000000000  30.0000000000000  5.61881560445204e-05 
 90.0000000000000  40.0000000000000  0.000179594148278292 
 90.0000000000000  50.0000000000000  0.000297543263195652 
 90.0000000000000  60.0000000000000  0.000406451676624967 
 90.0000000000000  70.0000000000000  0.000503010261534506 
 90.0000000000000  80.0000000000000  0.000584285134182792 
 90.0000000000000  90.0000000000000  0.000647806798691478 
 90.0000000000000  100.000000000000  0.000691645181427981 
 90.0000000000000  110.000000000000  0.000714468275316143 
 90.0000000000000  120.000000000000  0.000715582612197217 
 90.0000000000000  130.000000000000  0.000694954333508951 
 90.0000000000000  140.000000000000  0.000653210219060877 
 90.0000000000000  150.000000000000  0.000591618642646958 
 90.0000000000000  160.000000000000  0.000512051033149689 
 90.0000000000000  170.000000000000  0.000416925012120492 
 90.0000000000000  180.000000000000  0.000309130935572250 
 90.0000000000000  190.000000000000  0.000191944071974445 
 90.0000000000000  200.000000000000  6.89250848780849e-05 
 90.0000000000000  210.000000000000 -5.61881560445206e-05 
 90.0000000000000  220.000000000000 -0.000179594148278292 
 90.0000000000000  230.000000000000 -0.000297543263195651 
 90.0000000000000  240.000000000000 -0.000406451676624967 
 90.0000000000000  250.000000000000 -0.000503010261534506 
 90.0000000000000  260.000000000000 -0.000584285134182792 
 90.0000000000000  270.000000000000 -0.000647806798691478 
 90.0000000000000  280.000000000000 -0.000691645181427981 
 90.0000000000000  290.000000000000 -0.000714468275316143 
 90.0000000000000  300.000000000000 -0.000715582612197217 
 90.0000000000000  310.000000000000 -0.000694954333508951 
 90.0000000000000  320.000000000000 -0.000653210219060877 
 90.0000000000000  330.000000000000 -0.000591618642646958 
 90.0000000000000  340.000000000000 -0.000512051033149689 
 90.0000000000000  350.000000000000 -0.000416925012120492 
 90.0000000000000  360.000000000000 -0.000309130935572250 

 100.000000000000  0.00000000000000 -0.000310396396211378 
 100.000000000000  10.0000000000000 -0.000193386204588686 
 100.000000000000  20.0000000000000 -7.05000709977087e-05 
 100.000000000000  30.0000000000000  5.45281715757768e-05 
 100.000000000000  40.0000000000000  0.000177899603248519 
 100.000000000000  50.0000000000000  0.000295865645498097 
 100.000000000000  60.0000000000000  0.000404841959824456 
 100.000000000000  70.0000000000000  0.000501517356061466 
 100.000000000000  80.0000000000000  0.000582954401214575 
 100.000000000000  90.0000000000000  0.000646678671875940 
 100.000000000000  100.000000000000  0.000690753938327552 
 100.000000000000  110.000000000000  0.000713840995901439 
 100.000000000000  120.000000000000  0.000715238356035834 
 100.000000000000  130.000000000000  0.000694903560650152 
 100.000000000000  140.000000000000  0.000653454472212284 
 100.000000000000  150.000000000000  0.000592150500300163 
 100.000000000000  160.000000000000  0.000512854335079033 
 100.000000000000  170.000000000000  0.000417975350403342 
 100.000000000000  180.000000000000  0.000310396396211378 
 100.000000000000  190.000000000000  0.000193386204588686 
 100.000000000000  200.000000000000  7.05000709977088e-05 
 100.000000000000  210.000000000000 -5.45281715757770e-05 
 100.000000000000  220.000000000000 -0.000177899603248519 
 100.000000000000  230.000000000000 -0.000295865645498097 
 100.000000000000  240.000000000000 -0.000404841959824456 
 100.000000000000  250.000000000000 -0.000501517356061466 
 100.000000000000  260.000000000000 -0.000582954401214575 
 100.000000000000  270.000000000000 -0.000646678671875940 
 100.000000000000  280.000000000000 -0.000690753938327551 
 100.000000000000  290.000000000000 -0.000713840995901439 
 100.000000000000  300.000000000000 -0.000715238356035834 
 100.000000000000  310.000000000000 -0.000694903560650152 
 100.000000000000  320.000000000000 -0.000653454472212284 
 100.000000000000  330.000000000000 -0.000592150500300163 
 100.000000000000  340.000000000000 -0.000512854335079033 
 100.000000000000  350.000000000000 -0.000417975350403342 
 100.000000000000  360.000000000000 -0.000310396396211378 

 110.000000000000  0.00000000000000 -0.000302230619419779 
 110.000000000000  10.0000000000000 -0.000188952395234641 
 110.000000000000  20.0000000000000 -6.99329481348245e-05 
 110.000000000000  30.0000000000000  5.12113762062894e-05 
 110.000000000000  40.0000000000000  0.000170799668795582 
 110.000000000000  50.0000000000000  0.000285198299877324 
 110.000000000000  60.0000000000000  0.000390931324934596 
 110.000000000000  70.0000000000000  0.000484786099504526 
 110.000000000000  80.0000000000000  0.000563910893754614 
 110.000000000000  90.0000000000000  0.000625901540850648 
 110.000000000000  100.000000000000  0.000668874486349398 
 110.000000000000  110.000000000000  0.000691524019047242 
 110.000000000000  120.000000000000  0.000693161944354374 
 110.000000000000  130.000000000000  0.000673738494739167 
 110.000000000000  140.000000000000  0.000633843841889438 
 110.000000000000  150.000000000000  0.000574690164644359 
 110.000000000000  160.000000000000  0.000498074817553816 
 110.000000000000  170.000000000000  0.000406325719169919 
 110.000000000000  180.000000000000  0.000302230619419779 
 110.000000000000  190.000000000000  0.000188952395234641 
 110.000000000000  200.000000000000  6.99329481348245e-05 
 110.000000000000  210.000000000000 -5.12113762062896e-05 
 110.000000000000  220.000000000000 -0.000170799668795582 
 110.000000000000  230.000000000000 -0.000285198299877324 
 110.000000000000  240.000000000000 -0.000390931324934596 
 110.000000000000  250.000000000000 -0.000484786099504526 
 110.000000000000  260.000000000000 -0.000563910893754614 
 110.000000000000  270.000000000000 -0.000625901540850648 
 110.000000000000  280.000000000000 -0.000668874486349398 
 110.000000000000  290.000000000000 -0.000691524019047242 
 110.000000000000  300.000000000000 -0.000693161944354374 
 110.000000000000  310.000000000000 -0.000673738494739167 
 110.000000000000  320.000000000000 -0.000633843841889438 
 110.000000000000  330.000000000000 -0.000574690164644359 
 110.000000000000  340.000000000000 -0.000498074817553816 
 110.000000000000  350.000000000000 -0.000406325719169919 
 110.000000000000  360.000000000000 -0.000302230619419779 

 120.000000000000  0.00000000000000 -0.000284881718193182 
 120.000000000000  10.0000000000000 -0.000178777362965917 
 120.000000000000  20.0000000000000 -6.72409480306428e-05 
 120.000000000000  30.0000000000000  4.63385490849807e-05 
 120.000000000000  40.0000000000000  0.000158510072835094 
 120.000000000000  50.0000000000000  0.000265865348232081 
 120.000000000000  60.0000000000000  0.000365142439557393 
 120.000000000000  70.0000000000000  0.000453324862627743 
 120.000000000000  80.0000000000000  0.000527733239140599 
 120.000000000000  90.0000000000000  0.000586106708228072 
 120.000000000000  100.000000000000  0.000626671621570339 
 120.000000000000  110.000000000000  0.000648195434802333 
 120.000000000000  120.000000000000  0.000650024157750575 
 120.000000000000  130.000000000000  0.000632102225593660 
 120.000000000000  140.000000000000  0.000594974187171242 
 120.000000000000  150.000000000000  0.000539768159143091 
 120.000000000000  160.000000000000  0.000468161548735245 
 120.000000000000  170.000000000000  0.000382330086570252 
 120.000000000000  180.000000000000  0.000284881718193182 
 120.000000000000  190.000000000000  0.000178777362965917 
 120.000000000000  200.000000000000  6.72409480306429e-05 
 120.000000000000  210.000000000000 -4.63385490849808e-05 
 120.000000000000  220.000000000000 -0.000158510072835094 
 120.000000000000  230.000000000000 -0.000265865348232081 
 120.000000000000  240.000000000000 -0.000365142439557393 
 120.000000000000  250.000000000000 -0.000453324862627744 
 120.000000000000  260.000000000000 -0.000527733239140599 
 120.000000000000  270.000000000000 -0.000586106708228072 
 120.000000000000  280.000000000000 -0.000626671621570339 
 120.000000000000  290.000000000000 -0.000648195434802333 
 120.000000000000  300.000000000000 -0.000650024157750575 
 120.000000000000  310.000000000000 -0.000632102225593660 
 120.000000000000  320.000000000000 -0.000594974187171242 
 120.000000000000  330.000000000000 -0.000539768159143091 
 120.000000000000  340.000000000000 -0.000468161548735245 
 120.000000000000  350.000000000000 -0.000382330086570253 
 120.000000000000  360.000000000000 -0.000284881718193182 

 130.000000000000  0.00000000000000 -0.000258876830116391 
 130.000000000000  10.0000000000000 -0.000163170270989184 
 130.000000000000  20.0000000000000 -6.25058657461116e-05 
 130.000000000000  30.0000000000000  4.00577485981620e-05 
 130.000000000000  40.0000000000000  0.000141404228521479 
 130.000000000000  50.0000000000000  0.000238454212515164 
 130.000000000000  60.0000000000000  0.000328258885925228 
 130.000000000000  70.0000000000000  0.000408089579193466 
 130.000000000000  80.0000000000000  0.000475520677101202 
 130.000000000000  90.0000000000000  0.000528503319860290 
 130.000000000000  100.000000000000  0.000565427656681007 
 130.000000000000  110.000000000000  0.000585171760273672 
 130.000000000000  120.000000000000  0.000587135716041619 
 130.000000000000  130.000000000000  0.000571259850182650 
 130.000000000000  140.000000000000  0.000538026542847313 
 130.000000000000  150.000000000000  0.000488445571262128 
 130.000000000000  160.000000000000  0.000424023428159528 
 130.000000000000  170.000000000000  0.000346717547758508 
 130.000000000000  180.000000000000  0.000258876830116391 
 130.000000000000  190.000000000000  0.000163170270989184 
 130.000000000000  200.000000000000  6.25058657461117e-05 
 130.000000000000  210.000000000000 -4.00577485981621e-05 
 130.000000000000  220.000000000000 -0.000141404228521479 
 130.000000000000  230.000000000000 -0.000238454212515164 
 130.000000000000  240.000000000000 -0.000328258885925228 
 130.000000000000  250.000000000000 -0.000408089579193466 
 130.000000000000  260.000000000000 -0.000475520677101202 
 130.000000000000  270.000000000000 -0.000528503319860290 
 130.000000000000  280.000000000000 -0.000565427656681007 
 130.000000000000  290.000000000000 -0.000585171760273672 
 130.000000000000  300.000000000000 -0.000587135716041619 
 130.000000000000  310.000000000000 -0.000571259850182650 
 130.000000000000  320.000000000000 -0.000538026542847313 
 130.000000000000  330.000000000000 -0.000488445571262128 
 130.000000000000  340.000000000000 -0.000424023428159528 
 130.000000000000  350.000000000000 -0.000346717547758508 
 130.000000000000  360.000000000000 -0.000258876830116391 

 140.000000000000  0.00000000000000 -0.000225006100554510 
 140.000000000000  10.0000000000000 -0.000142605332896586 
 140.000000000000  20.0000000000000 -5.58715743603789e-05 
 140.000000000000  30.0000000000000  3.25598136903871e-05 
 140.000000000000  40.0000000000000  0.000120001888278231 
 140.000000000000  50.0000000000000  0.000203797766214627 
 140.000000000000  60.0000000000000  0.000281401352151237 
 140.000000000000  70.0000000000000  0.000350454700398687 
 140.000000000000  80.0000000000000  0.000408859659913157 
 140.000000000000  90.0000000000000  0.000454841625554137 
 140.000000000000  100.000000000000  0.000487003458563623 
 140.000000000000  110.000000000000  0.000504367937920293 
 140.000000000000  120.000000000000  0.000506407452705747 
 140.000000000000  130.000000000000  0.000493060033295272 
 140.000000000000  140.000000000000  0.000464731234273536 
 140.000000000000  150.000000000000  0.000422281811863750 
 140.000000000000  160.000000000000  0.000367001570285391 
 140.000000000000  170.000000000000  0.000300570171705666 
 140.000000000000  180.000000000000  0.000225006100554510 
 140.000000000000  190.000000000000  0.000142605332896586 
 140.000000000000  200.000000000000  5.58715743603789e-05 
 140.000000000000  210.000000000000 -3.25598136903872e-05 
 140.000000000000  220.000000000000 -0.000120001888278231 
 140.000000000000  230.000000000000 -0.000203797766214627 
 140.000000000000  240.000000000000 -0.000281401352151237 
 140.000000000000  250.000000000000 -0.000350454700398687 
 140.000000000000  260.000000000000 -0.000408859659913157 
 140.000000000000  270.000000000000 -0.000454841625554137 
 140.000000000000  280.000000000000 -0.000487003458563623 
 140.000000000000  290.000000000000 -0.000504367937920293 
 140.000000000000  300.000000000000 -0.000506407452705747 
 140.000000000000  310.000000000000 -0.000493060033295272 
 140.000000000000  320.000000000000 -0.000464731234273536 
 140.000000000000  330.000000000000 -0.000422281811863750 
 140.000000000000  340.000000000000 -0.000367001570285391 
 140.000000000000  350.000000000000 -0.000300570171705666 
 140.000000000000  360.000000000000 -0.000225006100554510 

 150.000000000000  0.00000000000000 -0.000184298674485861 
 150.000000000000  10.0000000000000 -0.000117707403925705 
 150.000000000000  20.0000000000000 -4.75396534600870e-05 
 150.000000000000  30.0000000000000  2.40725653196904e-05 
 150.000000000000  40.0000000000000  9.49533513835348e-05 
 150.000000000000  50.0000000000000  0.000162949027914305 
 150.000000000000  60.0000000000000  0.000225993580688085 
 150.000000000000  70.0000000000000  0.000282171432870928 
 150.000000000000  80.0000000000000  0.000329775648851622 
 150.000000000000  90.0000000000000  0.000367359798616490 
 150.000000000000  100.000000000000  0.000393781906793423 
 150.000000000000  110.000000000000  0.000408239150995698 
 150.000000000000  120.000000000000  0.000410292255173946 
 150.000000000000  130.000000000000  0.000399878836796633 
 150.000000000000  140.000000000000  0.000377315302311709 
 150.000000000000  150.000000000000  0.000343287233296799 
 150.000000000000  160.000000000000  0.000298828555409888 
 150.000000000000  170.000000000000  0.000245290123081393 
 150.000000000000  180.000000000000  0.000184298674485861 
 150.000000000000  190.000000000000  0.000117707403925705 
 150.000000000000  200.000000000000  4.75396534600870e-05 
 150.000000000000  210.000000000000 -2.40725653196905e-05 
 150.000000000000  220.000000000000 -9.49533513835348e-05 
 150.000000000000  230.000000000000 -0.000162949027914305 
 150.000000000000  240.000000000000 -0.000225993580688085 
 150.000000000000  250.000000000000 -0.000282171432870928 
 150.000000000000  260.000000000000 -0.000329775648851622 
 150.000000000000  270.000000000000 -0.000367359798616490 
 150.000000000000  280.000000000000 -0.000393781906793423 
 150.000000000000  290.000000000000 -0.000408239150995698 
 150.000000000000  300.000000000000 -0.000410292255173946 
 150.000000000000  310.000000000000 -0.000399878836796633 
 150.000000000000  320.000000000000 -0.000377315302311709 
 150.000000000000  330.000000000000 -0.000343287233296799 
 150.000000000000  340.000000000000 -0.000298828555409888 
 150.000000000000  350.000000000000 -0.000245290123081393 
 150.000000000000  360.000000000000 -0.000184298674485861 

 160.000000000000  0.00000000000000 -0.000137991426452588 
 160.000000000000  10.0000000000000 -8.92329950493622e-05 
 160.000000000000  20.0000000000000 -3.77632642456357e-05 
 160.000000000000  30.0000000000000  1.48538842330607e-05 
 160.000000000000  40.0000000000000  6.70197049557637e-05 
 160.000000000000  50.0000000000000  0.000117149165856993 
 160.000000000000  60.0000000000000  0.000163719108633996 
 160.000000000000  70.0000000000000  0.000205314529141021 
 160.000000000000  80.0000000000000  0.000240671571574261 
 160.000000000000  90.0000000000000  0.000268715930090908 
 160.000000000000  100.000000000000  0.000288595491048565 
 160.000000000000  110.000000000000  0.000299706224047076 
 160.000000000000  120.000000000000  0.000301710535086584 
 160.000000000000  130.000000000000  0.000294547524190383 
 160.000000000000  140.000000000000  0.000278434835819896 
 160.000000000000  150.000000000000  0.000253862045857847 
 160.000000000000  160.000000000000  0.000221575786092801 
 160.000000000000  170.000000000000  0.000182557058190083 
 160.000000000000  180.000000000000  0.000137991426452588 
 160.000000000000  190.000000000000  8.92329950493621e-05 
 160.000000000000  200.000000000000  3.77632642456357e-05 
 160.000000000000  210.000000000000 -1.48538842330608e-05 
 160.000000000000  220.000000000000 -6.70197049557637e-05 
 160.000000000000  230.000000000000 -0.000117149165856993 
 160.000000000000  240.000000000000 -0.000163719108633995 
 160.000000000000  250.000000000000 -0.000205314529141021 
 160.000000000000  260.000000000000 -0.000240671571574261 
 160.000000000000  270.000000000000 -0.000268715930090908 
 160.000000000000  280.000000000000 -0.000288595491048565 
 160.000000000000  290.000000000000 -0.000299706224047076 
 160.000000000000  300.000000000000 -0.000301710535086584 
 160.000000000000  310.000000000000 -0.000294547524190383 
 160.000000000000  320.000000000000 -0.000278434835819896 
 160.000000000000  330.000000000000 -0.000253862045857847 
 160.000000000000  340.000000000000 -0.000221575786092801 
 160.000000000000  350.000000000000 -0.000182557058190083 
 160.000000000000  360.000000000000 -0.000137991426452588 

 170.000000000000  0.00000000000000 -8.74913787535843e-05 
 170.000000000000  10.0000000000000 -5.80472867725186e-05 
 170.000000000000  20.0000000000000 -2.68394573562144e-05 
 170.000000000000  30.0000000000000  5.18387539043762e-06 
 170.000000000000  40.0000000000000  3.70496987065188e-05 
 170.000000000000  50.0000000000000  6.77897856754545e-05 
 170.000000000000  60.0000000000000  9.64701143099282e-05 
 170.000000000000  70.0000000000000  0.000122219247337328 
 170.000000000000  80.0000000000000  0.000144254810380306 
 170.000000000000  90.0000000000000  0.000161907264006335 
 170.000000000000  100.000000000000  0.000174640247344561 
 170.000000000000  110.000000000000  0.000182066875139451 
 170.000000000000  120.000000000000  0.000183961493063513 
 170.000000000000  130.000000000000  0.000180266534109847 
 170.000000000000  140.000000000000  0.000171094267736521 
 170.000000000000  150.000000000000  0.000156723388615898 
 170.000000000000  160.000000000000  0.000137590548638042 
 170.000000000000  170.000000000000  0.000114277089463996 
 170.000000000000  180.000000000000  8.74913787535843e-05 
 170.000000000000  190.000000000000  5.80472867725186e-05 
 170.000000000000  200.000000000000  2.68394573562144e-05 
 170.000000000000  210.000000000000 -5.18387539043766e-06 
 170.000000000000  220.000000000000 -3.70496987065188e-05 
 170.000000000000  230.000000000000 -6.77897856754545e-05 
 170.000000000000  240.000000000000 -9.64701143099282e-05 
 170.000000000000  250.000000000000 -0.000122219247337328 
 170.000000000000  260.000000000000 -0.000144254810380306 
 170.000000000000  270.000000000000 -0.000161907264006335 
 170.000000000000  280.000000000000 -0.000174640247344561 
 170.000000000000  290.000000000000 -0.000182066875139451 
 170.000000000000  300.000000000000 -0.000183961493063513 
 170.000000000000  310.000000000000 -0.000180266534109847 
 170.000000000000  320.000000000000 -0.000171094267736521 
 170.000000000000  330.000000000000 -0.000156723388615898 
 170.000000000000  340.000000000000 -0.000137590548638042 
 170.000000000000  350.000000000000 -0.000114277089463996 
 170.000000000000  360.000000000000 -8.74913787535843e-05 

 180.000000000000  0.00000000000000 -3.43329497839268e-05 
 180.000000000000  10.0000000000000 -2.50978410604365e-05 
 180.000000000000  20.0000000000000 -1.51001471364453e-05 
 180.000000000000  30.0000000000000 -4.64364288275632e-06 
 180.000000000000  40.0000000000000  5.95395611012855e-06 
 180.000000000000  50.0000000000000  1.63706471594543e-05 
 180.000000000000  60.0000000000000  2.62899243787872e-05 
 180.000000000000  70.0000000000000  3.54103955492143e-05 
 180.000000000000  80.0000000000000  4.34549397694033e-05 
 180.000000000000  90.0000000000000  5.01791276339595e-05 
 180.000000000000  100.000000000000  5.53786480972215e-05 
 180.000000000000  110.000000000000  5.88955163609976e-05 
 180.000000000000  120.000000000000  6.06228741627140e-05 
 180.000000000000  130.000000000000  6.05082366096509e-05 
 180.000000000000  140.000000000000  5.85550869058486e-05 
 180.000000000000  150.000000000000  5.48227705167158e-05 
 180.000000000000  160.000000000000  4.94246919870930e-05 
 180.000000000000  170.000000000000  4.25248692015433e-05 
 180.000000000000  180.000000000000  3.43329497839268e-05 
 180.000000000000  190.000000000000  2.50978410604365e-05 
 180.000000000000  200.000000000000  1.51001471364453e-05 
 180.000000000000  210.000000000000  4.64364288275630e-06 
 180.000000000000  220.000000000000 -5.95395611012855e-06 
 180.000000000000  230.000000000000 -1.63706471594543e-05 
 180.000000000000  240.000000000000 -2.62899243787872e-05 
 180.000000000000  250.000000000000 -3.54103955492144e-05 
 180.000000000000  260.000000000000 -4.34549397694033e-05 
 180.000000000000  270.000000000000 -5.01791276339595e-05 
 180.000000000000  280.000000000000 -5.53786480972215e-05 
 180.000000000000  290.000000000000 -5.88955163609976e-05 
 180.000000000000  300.000000000000 -6.06228741627140e-05 
 180.000000000000  310.000000000000 -6.05082366096509e-05 
 180.000000000000  320.000000000000 -5.85550869058486e-05 
 180.000000000000  330.000000000000 -5.48227705167158e-05 
 180.000000000000  340.000000000000 -4.94246919870930e-05 
 180.000000000000  350.000000000000 -4.25248692015433e-05 
 180.000000000000  360.000000000000 -3.43329497839268e-05 

 190.000000000000  0.00000000000000  1.98686684916045e-05 
 190.000000000000  10.0000000000000  8.61418985214653e-06 
 190.000000000000  20.0000000000000 -2.90202658697852e-06 
 190.000000000000  30.0000000000000 -1.43300664167545e-05 
 190.000000000000  40.0000000000000 -2.53226944298210e-05 
 190.000000000000  50.0000000000000 -3.55459051865389e-05 
 190.000000000000  60.0000000000000 -4.46890716012598e-05 
 190.000000000000  70.0000000000000 -5.24743831891378e-05 
 190.000000000000  80.0000000000000 -5.86652871971330e-05 
 190.000000000000  90.0000000000000 -6.30736761397109e-05 
 190.000000000000  100.000000000000 -6.55656033496039e-05 
 190.000000000000  110.000000000000 -6.60653528795154e-05 
 190.000000000000  120.000000000000 -6.45577400928643e-05 
 190.000000000000  130.000000000000 -6.10885730412844e-05 
 190.000000000000  140.000000000000 -5.57632606101545e-05 
 190.000000000000  150.000000000000 -4.87436097229564e-05 
 190.000000000000  160.000000000000 -4.02429089197830e-05 
 190.000000000000  170.000000000000 -3.05194476929764e-05 
 190.000000000000  180.000000000000 -1.98686684916045e-05 
 190.000000000000  190.000000000000 -8.61418985214652e-06 
 190.000000000000  200.000000000000  2.90202658697851e-06 
 190.000000000000  210.000000000000  1.43300664167545e-05 
 190.000000000000  220.000000000000  2.53226944298210e-05 
 190.000000000000  230.000000000000  3.55459051865389e-05 
 190.000000000000  240.000000000000  4.46890716012598e-05 
 190.000000000000  250.000000000000  5.24743831891378e-05 
 190.000000000000  260.000000000000  5.86652871971330e-05 
 190.000000000000  270.000000000000  6.30736761397109e-05 
 190.000000000000  280.000000000000  6.55656033496039e-05 
 190.000000000000  290.000000000000  6.60653528795154e-05 
 190.000000000000  300.000000000000  6.45577400928643e-05 
 190.000000000000  310.000000000000  6.10885730412844e-05 
 190.000000000000  320.000000000000  5.57632606101545e-05 
 190.000000000000  330.000000000000  4.87436097229564e-05 
 190.000000000000  340.000000000000  4.02429089197830e-05 
 190.000000000000  350.000000000000  3.05194476929764e-05 
 190.000000000000  360.000000000000  1.98686684916045e-05 

 200.000000000000  0.00000000000000  7.34665873290497e-05 
 200.000000000000  10.0000000000000  4.20644829650625e-05 
 200.000000000000  20.0000000000000  9.38427057183733e-06 
 200.000000000000  30.0000000000000 -2.35810781340431e-05 
 200.000000000000  40.0000000000000 -5.58299277134219e-05 
 200.000000000000  50.0000000000000 -8.63824131905349e-05 
 200.000000000000  60.0000000000000 -0.000114310212754464 
 200.000000000000  70.0000000000000 -0.000138764754347607 
 200.000000000000  80.0000000000000 -0.000159002999098252 
 200.000000000000  90.0000000000000 -0.000174410018180696 
 200.000000000000  100.000000000000 -0.000184517677116448 
 200.000000000000  110.000000000000 -0.000189018859803466 
 200.000000000000  120.000000000000 -0.000187776800083513 
 200.000000000000  130.000000000000 -0.000180829237312669 
 200.000000000000  140.000000000000 -0.000168387269670089 
 200.000000000000  150.000000000000 -0.000150828940046653 
 200.000000000000  160.000000000000 -0.000128687749403026 
 200.000000000000  170.000000000000 -0.000102636446612931 
 200.000000000000  180.000000000000 -7.34665873290497e-05 
 200.000000000000  190.000000000000 -4.20644829650625e-05 
 200.000000000000  200.000000000000 -9.38427057183733e-06 
 200.000000000000  210.000000000000  2.35810781340431e-05 
 200.000000000000  220.000000000000  5.58299277134219e-05 
 200.000000000000  230.000000000000  8.63824131905349e-05 
 200.000000000000  240.000000000000  0.000114310212754464 
 200.000000000000  250.000000000000  0.000138764754347607 
 200.000000000000  260.000000000000  0.000159002999098252 
 200.000000000000  270.000000000000  0.000174410018180696 
 200.000000000000  280.000000000000  0.000184517677116448 
 200.000000000000  290.000000000000  0.000189018859803466 
 200.000000000000  300.000000000000  0.000187776800083513 
 200.000000000000  310.000000000000  0.000180829237312669 
 200.000000000000  320.000000000000  0.000168387269670089 
 200.000000000000  330.000000000000  0.000150828940046653 
 200.000000000000  340.000000000000  0.000128687749403026 
 200.000000000000  350.000000000000  0.000102636446612931 
 200.000000000000  360.000000000000  7.34665873290497e-05 

 210.000000000000  0.00000000000000  0.000124832261086389 
 210.000000000000  10.0000000000000  7.42366680487405e-05 
 210.000000000000  20.0000000000000  2.13854314179980e-05 
 210.000000000000  30.0000000000000 -3.21155907248300e-05 
 210.000000000000  40.0000000000000 -8.46407968947571e-05 
 210.000000000000  50.0000000000000 -0.000134594235281347 
 210.000000000000  60.0000000000000 -0.000180458095936882 
 210.000000000000  70.0000000000000 -0.000220838828663578 
 210.000000000000  80.0000000000000 -0.000254509485331170 
 210.000000000000  90.0000000000000 -0.000280447000074989 
 210.000000000000  100.000000000000 -0.000297863274634558 
 210.000000000000  110.000000000000 -0.000306229124320446 
 210.000000000000  120.000000000000 -0.000305290357023271 
 210.000000000000  130.000000000000 -0.000295075496712318 
 210.000000000000  140.000000000000 -0.000275894916749168 
 210.000000000000  150.000000000000 -0.000248331409350159 
 210.000000000000  160.000000000000 -0.000213222477739801 
 210.000000000000  170.000000000000 -0.000171634889039099 
 210.000000000000  180.000000000000 -0.000124832261086389 
 210.000000000000  190.000000000000 -7.42366680487405e-05 
 210.000000000000  200.000000000000 -2.13854314179980e-05 
 210.000000000000  210.000000000000  3.21155907248301e-05 
 210.000000000000  220.000000000000  8.46407968947571e-05 
 210.000000000000  230.000000000000  0.000134594235281347 
 210.000000000000  240.000000000000  0.000180458095936882 
 210.000000000000  250.000000000000  0.000220838828663578 
 210.000000000000  260.000000000000  0.000254509485331170 
 210.000000000000  270.000000000000  0.000280447000074989 
 210.000000000000  280.000000000000  0.000297863274634558 
 210.000000000000  290.000000000000  0.000306229124320446 
 210.000000000000  300.000000000000  0.000305290357023271 
 210.000000000000  310.000000000000  0.000295075496712318 
 210.000000000000  320.000000000000  0.000275894916749168 
 210.000000000000  330.000000000000  0.000248331409350159 
 210.000000000000  340.000000000000  0.000213222477739801 
 210.000000000000  350.000000000000  0.000171634889039099 
 210.000000000000  360.000000000000  0.000124832261086389 

 220.000000000000  0.00000000000000  0.000172404969758790 
 220.000000000000  10.0000000000000  0.000104153209539324 
 220.000000000000  20.0000000000000  3.27368067520731e-05 
 220.000000000000  30.0000000000000 -3.96742873427161e-05 
 220.000000000000  40.0000000000000 -0.000110879898292755 
 220.000000000000  50.0000000000000 -0.000178716479641104 
 220.000000000000  60.0000000000000 -0.000241122851190461 
 220.000000000000  70.0000000000000 -0.000296202826920445 
 220.000000000000  80.0000000000000 -0.000342282829640315 
 220.000000000000  90.0000000000000 -0.000377962741785032 
 220.000000000000  100.000000000000 -0.000402158447278987 
 220.000000000000  110.000000000000 -0.000414134771854363 
 220.000000000000  120.000000000000 -0.000413527820949251 
 220.000000000000  130.000000000000 -0.000400356036459769 
 220.000000000000  140.000000000000 -0.000375019636392388 
 220.000000000000  150.000000000000 -0.000338288454442316 
 220.000000000000  160.000000000000 -0.000291278548986232 
 220.000000000000  170.000000000000 -0.000235418292213259 
 220.000000000000  180.000000000000 -0.000172404969758790 
 220.000000000000  190.000000000000 -0.000104153209539324 
 220.000000000000  200.000000000000 -3.27368067520732e-05 
 220.000000000000  210.000000000000  3.96742873427162e-05 
 220.000000000000  220.000000000000  0.000110879898292755 
 220.000000000000  230.000000000000  0.000178716479641104 
 220.000000000000  240.000000000000  0.000241122851190461 
 220.000000000000  250.000000000000  0.000296202826920445 
 220.000000000000  260.000000000000  0.000342282829640315 
 220.000000000000  270.000000000000  0.000377962741785032 
 220.000000000000  280.000000000000  0.000402158447278987 
 220.000000000000  290.000000000000  0.000414134771854363 
 220.000000000000  300.000000000000  0.000413527820949251 
 220.000000000000  310.000000000000  0.000400356036459769 
 220.000000000000  320.000000000000  0.000375019636392388 
 220.000000000000  330.000000000000  0.000338288454442316 
 220.000000000000  340.000000000000  0.000291278548986232 
 220.000000000000  350.000000000000  0.000235418292213259 
 220.000000000000  360.000000000000  0.000172404969758790 

 230.000000000000  0.00000000000000  0.000214739240666194 
 230.000000000000  10.0000000000000  0.000130905108462122 
 230.000000000000  20.0000000000000  4.30934907786101e-05 
 230.000000000000  30.0000000000000 -4.60275008158517e-05 
 230.000000000000  40.0000000000000 -0.000133749970089063 
 230.000000000000  50.0000000000000 -0.000217408514201869 
 230.000000000000  60.0000000000000 -0.000294461210624667 
 230.000000000000  70.0000000000000 -0.000362566852167197 
 230.000000000000  80.0000000000000 -0.000419656083374307 
 230.000000000000  90.0000000000000 -0.000463994276844313 
 230.000000000000  100.000000000000 -0.000494234239004837 
 230.000000000000  110.000000000000 -0.000509457143907792 
 230.000000000000  120.000000000000 -0.000509200451290862 
 230.000000000000  130.000000000000 -0.000493471960629320 
 230.000000000000  140.000000000000 -0.000462749574152917 
 230.000000000000  150.000000000000 -0.000417966776028461 
 230.000000000000  160.000000000000 -0.000360484268915774 
 230.000000000000  170.000000000000 -0.000292048629705923 
 230.000000000000  180.000000000000 -0.000214739240666194 
 230.000000000000  190.000000000000 -0.000130905108462122 
 230.000000000000  200.000000000000 -4.30934907786102e-05 
 230.000000000000  210.000000000000  4.60275008158518e-05 
 230.000000000000  220.000000000000  0.000133749970089063 
 230.000000000000  230.000000000000  0.000217408514201869 
 230.000000000000  240.000000000000  0.000294461210624667 
 230.000000000000  250.000000000000  0.000362566852167198 
 230.000000000000  260.000000000000  0.000419656083374307 
 230.000000000000  270.000000000000  0.000463994276844313 
 230.000000000000  280.000000000000  0.000494234239004837 
 230.000000000000  290.000000000000  0.000509457143907792 
 230.000000000000  300.000000000000  0.000509200451290862 
 230.000000000000  310.000000000000  0.000493471960629320 
 230.000000000000  320.000000000000  0.000462749574152917 
 230.000000000000  330.000000000000  0.000417966776028461 
 230.000000000000  340.000000000000  0.000360484268915774 
 230.000000000000  350.000000000000  0.000292048629705923 
 230.000000000000  360.000000000000  0.000214739240666194 

 240.000000000000  0.00000000000000  0.000250548768409255 
 240.000000000000  10.0000000000000  0.000153679521905480 
 240.000000000000  20.0000000000000  5.21408008941975e-05 
 240.000000000000  30.0000000000000 -5.09821919677370e-05 
 240.000000000000  40.0000000000000 -0.000152556116724966 
 240.000000000000  50.0000000000000 -0.000249494701072626 
 240.000000000000  60.0000000000000 -0.000338852515178606 
 240.000000000000  70.0000000000000 -0.000417914467078529 
 240.000000000000  80.0000000000000 -0.000484278299371196 
 240.000000000000  90.0000000000000 -0.000535927580594112 
 240.000000000000  100.000000000000 -0.000571292973473118 
 240.000000000000  110.000000000000 -0.000589299918441336 
 240.000000000000  120.000000000000 -0.000589401283587861 
 240.000000000000  130.000000000000 -0.000571593988984009 
 240.000000000000  140.000000000000 -0.000536419100265393 
 240.000000000000  150.000000000000 -0.000484945388626375 
 240.000000000000  160.000000000000 -0.000418736856748152 
 240.000000000000  170.000000000000 -0.000339805217368709 
 240.000000000000  180.000000000000 -0.000250548768409255 
 240.000000000000  190.000000000000 -0.000153679521905480 
 240.000000000000  200.000000000000 -5.21408008941976e-05 
 240.000000000000  210.000000000000  5.09821919677371e-05 
 240.000000000000  220.000000000000  0.000152556116724966 
 240.000000000000  230.000000000000  0.000249494701072626 
 240.000000000000  240.000000000000  0.000338852515178605 
 240.000000000000  250.000000000000  0.000417914467078529 
 240.000000000000  260.000000000000  0.000484278299371196 
 240.000000000000  270.000000000000  0.000535927580594112 
 240.000000000000  280.000000000000  0.000571292973473117 
 240.000000000000  290.000000000000  0.000589299918441336 
 240.000000000000  300.000000000000  0.000589401283587861 
 240.000000000000  310.000000000000  0.000571593988984009 
 240.000000000000  320.000000000000  0.000536419100265393 
 240.000000000000  330.000000000000  0.000484945388626375 
 240.000000000000  340.000000000000  0.000418736856748152 
 240.000000000000  350.000000000000  0.000339805217368709 
 240.000000000000  360.000000000000  0.000250548768409255 

 250.000000000000  0.00000000000000  0.000278745498607995 
 250.000000000000  10.0000000000000  0.000171784460841330 
 250.000000000000  20.0000000000000  5.96038391591330e-05 
 250.000000000000  30.0000000000000 -5.43878150149165e-05 
 250.000000000000  40.0000000000000 -0.000166726922951300 
 250.000000000000  50.0000000000000 -0.000274000117701703 
 250.000000000000  60.0000000000000 -0.000372947957526488 
 250.000000000000  70.0000000000000 -0.000460563962382604 
 250.000000000000  80.0000000000000 -0.000534185964298334 
 250.000000000000  90.0000000000000 -0.000591576996000001 
 250.000000000000  100.000000000000 -0.000630993260030611 
 250.000000000000  110.000000000000 -0.000651237113153187 
 250.000000000000  120.000000000000 -0.000651693456134484 
 250.000000000000  130.000000000000 -0.000632348423223934 
 250.000000000000  140.000000000000 -0.000593789803457468 
 250.000000000000  150.000000000000 -0.000537189180985084 
 250.000000000000  160.000000000000 -0.000464266337079311 
 250.000000000000  170.000000000000 -0.000377236995451484 
 250.000000000000  180.000000000000 -0.000278745498607995 
 250.000000000000  190.000000000000 -0.000171784460841330 
 250.000000000000  200.000000000000 -5.96038391591331e-05 
 250.000000000000  210.000000000000  5.43878150149167e-05 
 250.000000000000  220.000000000000  0.000166726922951300 
 250.000000000000  230.000000000000  0.000274000117701702 
 250.000000000000  240.000000000000  0.000372947957526488 
 250.000000000000  250.000000000000  0.000460563962382604 
 250.000000000000  260.000000000000  0.000534185964298334 
 250.000000000000  270.000000000000  0.000591576996000001 
 250.000000000000  280.000000000000  0.000630993260030611 
 250.000000000000  290.000000000000  0.000651237113153187 
 250.000000000000  300.000000000000  0.000651693456134484 
 250.000000000000  310.000000000000  0.000632348423223934 
 250.000000000000  320.000000000000  0.000593789803457468 
 250.000000000000  330.000000000000  0.000537189180985084 
 250.000000000000  340.000000000000  0.000464266337079311 
 250.000000000000  350.000000000000  0.000377236995451485 
 250.000000000000  360.000000000000  0.000278745498607995 

 260.000000000000  0.00000000000000  0.000298472687883560 
 260.000000000000  10.0000000000000  0.000184669815861648 
 260.000000000000  20.0000000000000  6.52558449322162e-05 
 260.000000000000  30.0000000000000 -5.61408918244302e-05 
 260.000000000000  40.0000000000000 -0.000175831815991653 
 260.000000000000  50.0000000000000 -0.000290180179405162 
 260.000000000000  60.0000000000000 -0.000395711564905701 
 260.000000000000  70.0000000000000 -0.000489219454746293 
 260.000000000000  80.0000000000000 -0.000567862659011409 
 260.000000000000  90.0000000000000 -0.000629251643734833 
 260.000000000000  100.000000000000 -0.000671521135680070 
 260.000000000000  110.000000000000 -0.000693386797723759 
 260.000000000000  120.000000000000 -0.000694184252789260 
 260.000000000000  130.000000000000 -0.000673889270607942 
 260.000000000000  140.000000000000 -0.000633118503943625 
 260.000000000000  150.000000000000 -0.000573110751910403 
 260.000000000000  160.000000000000 -0.000495689319688417 
 260.000000000000  170.000000000000 -0.000403206618318597 
 260.000000000000  180.000000000000 -0.000298472687883560 
 260.000000000000  190.000000000000 -0.000184669815861648 
 260.000000000000  200.000000000000 -6.52558449322162e-05 
 260.000000000000  210.000000000000  5.61408918244303e-05 
 260.000000000000  220.000000000000  0.000175831815991653 
 260.000000000000  230.000000000000  0.000290180179405162 
 260.000000000000  240.000000000000  0.000395711564905701 
 260.000000000000  250.000000000000  0.000489219454746294 
 260.000000000000  260.000000000000  0.000567862659011409 
 260.000000000000  270.000000000000  0.000629251643734833 
 260.000000000000  280.000000000000  0.000671521135680070 
 260.000000000000  290.000000000000  0.000693386797723759 
 260.000000000000  300.000000000000  0.000694184252789260 
 260.000000000000  310.000000000000  0.000673889270607942 
 260.000000000000  320.000000000000  0.000633118503943625 
 260.000000000000  330.000000000000  0.000573110751910403 
 260.000000000000  340.000000000000  0.000495689319688417 
 260.000000000000  350.000000000000  0.000403206618318597 
 260.000000000000  360.000000000000  0.000298472687883560 

 270.000000000000  0.00000000000000  0.000309130935572249 
 270.000000000000  10.0000000000000  0.000191944071974445 
 270.000000000000  20.0000000000000  6.89250848780849e-05 
 270.000000000000  30.0000000000000 -5.61881560445204e-05 
 270.000000000000  40.0000000000000 -0.000179594148278292 
 270.000000000000  50.0000000000000 -0.000297543263195651 
 270.000000000000  60.0000000000000 -0.000406451676624967 
 270.000000000000  70.0000000000000 -0.000503010261534506 
 270.000000000000  80.0000000000000 -0.000584285134182792 
 270.000000000000  90.0000000000000 -0.000647806798691478 
 270.000000000000  100.000000000000 -0.000691645181427981 
 270.000000000000  110.000000000000 -0.000714468275316143 
 270.000000000000  120.000000000000 -0.000715582612197217 
 270.000000000000  130.000000000000 -0.000694954333508951 
 270.000000000000  140.000000000000 -0.000653210219060877 
 270.000000000000  150.000000000000 -0.000591618642646958 
 270.000000000000  160.000000000000 -0.000512051033149689 
 270.000000000000  170.000000000000 -0.000416925012120492 
 270.000000000000  180.000000000000 -0.000309130935572250 
 270.000000000000  190.000000000000 -0.000191944071974445 
 270.000000000000  200.000000000000 -6.89250848780849e-05 
 270.000000000000  210.000000000000  5.61881560445205e-05 
 270.000000000000  220.000000000000  0.000179594148278292 
 270.000000000000  230.000000000000  0.000297543263195651 
 270.000000000000  240.000000000000  0.000406451676624967 
 270.000000000000  250.000000000000  0.000503010261534506 
 270.000000000000  260.000000000000  0.000584285134182792 
 270.000000000000  270.000000000000  0.000647806798691478 
 270.000000000000  280.000000000000  0.000691645181427981 
 270.000000000000  290.000000000000  0.000714468275316143 
 270.000000000000  300.000000000000  0.000715582612197217 
 270.000000000000  310.000000000000  0.000694954333508951 
 270.000000000000  320.000000000000  0.000653210219060877 
 270.000000000000  330.000000000000  0.000591618642646958 
 270.000000000000  340.000000000000  0.000512051033149689 
 270.000000000000  350.000000000000  0.000416925012120492 
 270.000000000000  360.000000000000  0.000309130935572250 

 280.000000000000  0.00000000000000  0.000310396396211378 
 280.000000000000  10.0000000000000  0.000193386204588686 
 280.000000000000  20.0000000000000  7.05000709977088e-05 
 280.000000000000  30.0000000000000 -5.45281715757768e-05 
 280.000000000000  40.0000000000000 -0.000177899603248519 
 280.000000000000  50.0000000000000 -0.000295865645498097 
 280.000000000000  60.0000000000000 -0.000404841959824456 
 280.000000000000  70.0000000000000 -0.000501517356061466 
 280.000000000000  80.0000000000000 -0.000582954401214575 
 280.000000000000  90.0000000000000 -0.000646678671875940 
 280.000000000000  100.000000000000 -0.000690753938327552 
 280.000000000000  110.000000000000 -0.000713840995901439 
 280.000000000000  120.000000000000 -0.000715238356035834 
 280.000000000000  130.000000000000 -0.000694903560650152 
 280.000000000000  140.000000000000 -0.000653454472212284 
 280.000000000000  150.000000000000 -0.000592150500300163 
 280.000000000000  160.000000000000 -0.000512854335079033 
 280.000000000000  170.000000000000 -0.000417975350403342 
 280.000000000000  180.000000000000 -0.000310396396211378 
 280.000000000000  190.000000000000 -0.000193386204588686 
 280.000000000000  200.000000000000 -7.05000709977088e-05 
 280.000000000000  210.000000000000  5.45281715757769e-05 
 280.000000000000  220.000000000000  0.000177899603248519 
 280.000000000000  230.000000000000  0.000295865645498097 
 280.000000000000  240.000000000000  0.000404841959824456 
 280.000000000000  250.000000000000  0.000501517356061466 
 280.000000000000  260.000000000000  0.000582954401214575 
 280.000000000000  270.000000000000  0.000646678671875940 
 280.000000000000  280.000000000000  0.000690753938327552 
 280.000000000000  290.000000000000  0.000713840995901439 
 280.000000000000  300.000000000000  0.000715238356035834 
 280.000000000000  310.000000000000  0.000694903560650152 
 280.000000000000  320.000000000000  0.000653454472212284 
 280.000000000000  330.000000000000  0.000592150500300163 
 280.000000000000  340.000000000000  0.000512854335079033 
 280.000000000000  350.000000000000  0.000417975350403342 
 280.000000000000  360.000000000000  0.000310396396211378 

 290.000000000000  0.00000000000000  0.000302230619419779 
 290.000000000000  10.0000000000000  0.000188952395234641 
 290.000000000000  20.0000000000000  6.99329481348245e-05 
 290.000000000000  30.0000000000000 -5.12113762062894e-05 
 290.000000000000  40.0000000000000 -0.000170799668795582 
 290.000000000000  50.0000000000000 -0.000285198299877324 
 290.000000000000  60.0000000000000 -0.000390931324934596 
 290.000000000000  70.0000000000000 -0.000484786099504526 
 290.000000000000  80.0000000000000 -0.000563910893754614 
 290.000000000000  90.0000000000000 -0.000625901540850648 
 290.000000000000  100.000000000000 -0.000668874486349398 
 290.000000000000  110.000000000000 -0.000691524019047242 
 290.000000000000  120.000000000000 -0.000693161944354374 
 290.000000000000  130.000000000000 -0.000673738494739167 
 290.000000000000  140.000000000000 -0.000633843841889438 
 290.000000000000  150.000000000000 -0.000574690164644359 
 290.000000000000  160.000000000000 -0.000498074817553816 
 290.000000000000  170.000000000000 -0.000406325719169919 
 290.000000000000  180.000000000000 -0.000302230619419779 
 290.000000000000  190.000000000000 -0.000188952395234641 
 290.000000000000  200.000000000000 -6.99329481348245e-05 
 290.000000000000  210.000000000000  5.12113762062896e-05 
 290.000000000000  220.000000000000  0.000170799668795582 
 290.000000000000  230.000000000000  0.000285198299877323 
 290.000000000000  240.000000000000  0.000390931324934596 
 290.000000000000  250.000000000000  0.000484786099504526 
 290.000000000000  260.000000000000  0.000563910893754614 
 290.000000000000  270.000000000000  0.000625901540850648 
 290.000000000000  280.000000000000  0.000668874486349398 
 290.000000000000  290.000000000000  0.000691524019047242 
 290.000000000000  300.000000000000  0.000693161944354374 
 290.000000000000  310.000000000000  0.000673738494739167 
 290.000000000000  320.000000000000  0.000633843841889438 
 290.000000000000  330.000000000000  0.000574690164644359 
 290.000000000000  340.000000000000  0.000498074817553816 
 290.000000000000  350.000000000000  0.000406325719169919 
 290.000000000000  360.000000000000  0.000302230619419779 

 300.000000000000  0.00000000000000  0.000284881718193182 
 300.000000000000  10.0000000000000  0.000178777362965917 
 300.000000000000  20.0000000000000  6.72409480306428e-05 
 300.000000000000  30.0000000000000 -4.63385490849807e-05 
 300.000000000000  40.0000000000000 -0.000158510072835094 
 300.000000000000  50.0000000000000 -0.000265865348232081 
 300.000000000000  60.0000000000000 -0.000365142439557393 
 300.000000000000  70.0000000000000 -0.000453324862627743 
 300.000000000000  80.0000000000000 -0.000527733239140599 
 300.000000000000  90.0000000000000 -0.000586106708228072 
 300.000000000000  100.000000000000 -0.000626671621570339 
 300.000000000000  110.000000000000 -0.000648195434802333 
 300.000000000000  120.000000000000 -0.000650024157750575 
 300.000000000000  130.000000000000 -0.000632102225593660 
 300.000000000000  140.000000000000 -0.000594974187171242 
 300.000000000000  150.000000000000 -0.000539768159143091 
 300.000000000000  160.000000000000 -0.000468161548735245 
 300.000000000000  170.000000000000 -0.000382330086570252 
 300.000000000000  180.000000000000 -0.000284881718193182 
 300.000000000000  190.000000000000 -0.000178777362965917 
 300.000000000000  200.000000000000 -6.72409480306429e-05 
 300.000000000000  210.000000000000  4.63385490849808e-05 
 300.000000000000  220.000000000000  0.000158510072835094 
 300.000000000000  230.000000000000  0.000265865348232081 
 300.000000000000  240.000000000000  0.000365142439557393 
 300.000000000000  250.000000000000  0.000453324862627744 
 300.000000000000  260.000000000000  0.000527733239140599 
 300.000000000000  270.000000000000  0.000586106708228072 
 300.000000000000  280.000000000000  0.000626671621570339 
 300.000000000000  290.000000000000  0.000648195434802333 
 300.000000000000  300.000000000000  0.000650024157750575 
 300.000000000000  310.000000000000  0.000632102225593660 
 300.000000000000  320.000000000000  0.000594974187171242 
 300.000000000000  330.000000000000  0.000539768159143091 
 300.000000000000  340.000000000000  0.000468161548735245 
 300.000000000000  350.000000000000  0.000382330086570253 
 300.000000000000  360.000000000000  0.000284881718193182 

 310.000000000000  0.00000000000000  0.000258876830116391 
 310.000000000000  10.0000000000000  0.000163170270989184 
 310.000000000000  20.0000000000000  6.25058657461116e-05 
 310.000000000000  30.0000000000000 -4.00577485981620e-05 
 310.000000000000  40.0000000000000 -0.000141404228521479 
 310.000000000000  50.0000000000000 -0.000238454212515164 
 310.000000000000  60.0000000000000 -0.000328258885925229 
 310.000000000000  70.0000000000000 -0.000408089579193466 
 310.000000000000  80.0000000000000 -0.000475520677101202 
 310.000000000000  90.0000000000000 -0.000528503319860290 
 310.000000000000  100.000000000000 -0.000565427656681007 
 310.000000000000  110.000000000000 -0.000585171760273672 
 310.000000000000  120.000000000000 -0.000587135716041619 
 310.000000000000  130.000000000000 -0.000571259850182650 
 310.000000000000  140.000000000000 -0.000538026542847313 
 310.000000000000  150.000000000000 -0.000488445571262128 
 310.000000000000  160.000000000000 -0.000424023428159528 
 310.000000000000  170.000000000000 -0.000346717547758508 
 310.000000000000  180.000000000000 -0.000258876830116391 
 310.000000000000  190.000000000000 -0.000163170270989184 
 310.000000000000  200.000000000000 -6.25058657461116e-05 
 310.000000000000  210.000000000000  4.00577485981622e-05 
 310.000000000000  220.000000000000  0.000141404228521479 
 310.000000000000  230.000000000000  0.000238454212515164 
 310.000000000000  240.000000000000  0.000328258885925228 
 310.000000000000  250.000000000000  0.000408089579193466 
 310.000000000000  260.000000000000  0.000475520677101202 
 310.000000000000  270.000000000000  0.000528503319860290 
 310.000000000000  280.000000000000  0.000565427656681007 
 310.000000000000  290.000000000000  0.000585171760273672 
 310.000000000000  300.000000000000  0.000587135716041619 
 310.000000000000  310.000000000000  0.000571259850182650 
 310.000000000000  320.000000000000  0.000538026542847313 
 310.000000000000  330.000000000000  0.000488445571262128 
 310.000000000000  340.000000000000  0.000424023428159528 
 310.000000000000  350.000000000000  0.000346717547758508 
 310.000000000000  360.000000000000  0.000258876830116391 

 320.000000000000  0.00000000000000  0.000225006100554510 
 320.000000000000  10.0000000000000  0.000142605332896586 
 320.000000000000  20.0000000000000  5.58715743603790e-05 
 320.000000000000  30.0000000000000 -3.25598136903871e-05 
 320.000000000000  40.0000000000000 -0.000120001888278231 
 320.000000000000  50.0000000000000 -0.000203797766214627 
 320.000000000000  60.0000000000000 -0.000281401352151237 
 320.000000000000  70.0000000000000 -0.000350454700398687 
 320.000000000000  80.0000000000000 -0.000408859659913157 
 320.000000000000  90.0000000000000 -0.000454841625554137 
 320.000000000000  100.000000000000 -0.000487003458563623 
 320.000000000000  110.000000000000 -0.000504367937920293 
 320.000000000000  120.000000000000 -0.000506407452705747 
 320.000000000000  130.000000000000 -0.000493060033295272 
 320.000000000000  140.000000000000 -0.000464731234273536 
 320.000000000000  150.000000000000 -0.000422281811863750 
 320.000000000000  160.000000000000 -0.000367001570285391 
 320.000000000000  170.000000000000 -0.000300570171705666 
 320.000000000000  180.000000000000 -0.000225006100554510 
 320.000000000000  190.000000000000 -0.000142605332896586 
 320.000000000000  200.000000000000 -5.58715743603790e-05 
 320.000000000000  210.000000000000  3.25598136903872e-05 
 320.000000000000  220.000000000000  0.000120001888278231 
 320.000000000000  230.000000000000  0.000203797766214627 
 320.000000000000  240.000000000000  0.000281401352151237 
 320.000000000000  250.000000000000  0.000350454700398687 
 320.000000000000  260.000000000000  0.000408859659913157 
 320.000000000000  270.000000000000  0.000454841625554137 
 320.000000000000  280.000000000000  0.000487003458563623 
 320.000000000000  290.000000000000  0.000504367937920293 
 320.000000000000  300.000000000000  0.000506407452705747 
 320.000000000000  310.000000000000  0.000493060033295272 
 320.000000000000  320.000000000000  0.000464731234273536 
 320.000000000000  330.000000000000  0.000422281811863750 
 320.000000000000  340.000000000000  0.000367001570285391 
 320.000000000000  350.000000000000  0.000300570171705666 
 320.000000000000  360.000000000000  0.000225006100554510 

 330.000000000000  0.00000000000000  0.000184298674485861 
 330.000000000000  10.0000000000000  0.000117707403925705 
 330.000000000000  20.0000000000000  4.75396534600870e-05 
 330.000000000000  30.0000000000000 -2.40725653196904e-05 
 330.000000000000  40.0000000000000 -9.49533513835349e-05 
 330.000000000000  50.0000000000000 -0.000162949027914305 
 330.000000000000  60.0000000000000 -0.000225993580688085 
 330.000000000000  70.0000000000000 -0.000282171432870928 
 330.000000000000  80.0000000000000 -0.000329775648851622 
 330.000000000000  90.0000000000000 -0.000367359798616490 
 330.000000000000  100.000000000000 -0.000393781906793423 
 330.000000000000  110.000000000000 -0.000408239150995698 
 330.000000000000  120.000000000000 -0.000410292255173946 
 330.000000000000  130.000000000000 -0.000399878836796633 
 330.000000000000  140.000000000000 -0.000377315302311709 
 330.000000000000  150.000000000000 -0.000343287233296799 
 330.000000000000  160.000000000000 -0.000298828555409888 
 330.000000000000  170.000000000000 -0.000245290123081393 
 330.000000000000  180.000000000000 -0.000184298674485861 
 330.000000000000  190.000000000000 -0.000117707403925705 
 330.000000000000  200.000000000000 -4.75396534600870e-05 
 330.000000000000  210.000000000000  2.40725653196905e-05 
 330.000000000000  220.000000000000  9.49533513835349e-05 
 330.000000000000  230.000000000000  0.000162949027914305 
 330.000000000000  240.000000000000  0.000225993580688085 
 330.000000000000  250.000000000000  0.000282171432870928 
 330.000000000000  260.000000000000  0.000329775648851622 
 330.000000000000  270.000000000000  0.000367359798616490 
 330.000000000000  280.000000000000  0.000393781906793423 
 330.000000000000  290.000000000000  0.000408239150995698 
 330.000000000000  300.000000000000  0.000410292255173946 
 330.000000000000  310.000000000000  0.000399878836796633 
 330.000000000000  320.000000000000  0.000377315302311709 
 330.000000000000  330.000000000000  0.000343287233296800 
 330.000000000000  340.000000000000  0.000298828555409888 
 330.000000000000  350.000000000000  0.000245290123081393 
 330.000000000000  360.000000000000  0.000184298674485861 

 340.000000000000  0.00000000000000  0.000137991426452588 
 340.000000000000  10.0000000000000  8.92329950493621e-05 
 340.000000000000  20.0000000000000  3.77632642456357e-05 
 340.000000000000  30.0000000000000 -1.48538842330607e-05 
 340.000000000000  40.0000000000000 -6.70197049557637e-05 
 340.000000000000  50.0000000000000 -0.000117149165856993 
 340.000000000000  60.0000000000000 -0.000163719108633995 
 340.000000000000  70.0000000000000 -0.000205314529141020 
 340.000000000000  80.0000000000000 -0.000240671571574260 
 340.000000000000  90.0000000000000 -0.000268715930090908 
 340.000000000000  100.000000000000 -0.000288595491048565 
 340.000000000000  110.000000000000 -0.000299706224047076 
 340.000000000000  120.000000000000 -0.000301710535086583 
 340.000000000000  130.000000000000 -0.000294547524190383 
 340.000000000000  140.000000000000 -0.000278434835819896 
 340.000000000000  150.000000000000 -0.000253862045857847 
 340.000000000000  160.000000000000 -0.000221575786092801 
 340.000000000000  170.000000000000 -0.000182557058190083 
 340.000000000000  180.000000000000 -0.000137991426452588 
 340.000000000000  190.000000000000 -8.92329950493621e-05 
 340.000000000000  200.000000000000 -3.77632642456357e-05 
 340.000000000000  210.000000000000  1.48538842330608e-05 
 340.000000000000  220.000000000000  6.70197049557637e-05 
 340.000000000000  230.000000000000  0.000117149165856993 
 340.000000000000  240.000000000000  0.000163719108633995 
 340.000000000000  250.000000000000  0.000205314529141021 
 340.000000000000  260.000000000000  0.000240671571574260 
 340.000000000000  270.000000000000  0.000268715930090908 
 340.000000000000  280.000000000000  0.000288595491048565 
 340.000000000000  290.000000000000  0.000299706224047076 
 340.000000000000  300.000000000000  0.000301710535086583 
 340.000000000000  310.000000000000  0.000294547524190383 
 340.000000000000  320.000000000000  0.000278434835819896 
 340.000000000000  330.000000000000  0.000253862045857847 
 340.000000000000  340.000000000000  0.000221575786092801 
 340.000000000000  350.000000000000  0.000182557058190083 
 340.000000000000  360.000000000000  0.000137991426452588 

 350.000000000000  0.00000000000000  8.74913787535843e-05 
 350.000000000000  10.0000000000000  5.80472867725186e-05 
 350.000000000000  20.0000000000000  2.68394573562144e-05 
 350.000000000000  30.0000000000000 -5.18387539043767e-06 
 350.000000000000  40.0000000000000 -3.70496987065188e-05 
 350.000000000000  50.0000000000000 -6.77897856754545e-05 
 350.000000000000  60.0000000000000 -9.64701143099283e-05 
 350.000000000000  70.0000000000000 -0.000122219247337328 
 350.000000000000  80.0000000000000 -0.000144254810380307 
 350.000000000000  90.0000000000000 -0.000161907264006336 
 350.000000000000  100.000000000000 -0.000174640247344561 
 350.000000000000  110.000000000000 -0.000182066875139451 
 350.000000000000  120.000000000000 -0.000183961493063513 
 350.000000000000  130.000000000000 -0.000180266534109847 
 350.000000000000  140.000000000000 -0.000171094267736521 
 350.000000000000  150.000000000000 -0.000156723388615898 
 350.000000000000  160.000000000000 -0.000137590548638042 
 350.000000000000  170.000000000000 -0.000114277089463996 
 350.000000000000  180.000000000000 -8.74913787535843e-05 
 350.000000000000  190.000000000000 -5.80472867725186e-05 
 350.000000000000  200.000000000000 -2.68394573562144e-05 
 350.000000000000  210.000000000000  5.18387539043770e-06 
 350.000000000000  220.000000000000  3.70496987065188e-05 
 350.000000000000  230.000000000000  6.77897856754545e-05 
 350.000000000000  240.000000000000  9.64701143099282e-05 
 350.000000000000  250.000000000000  0.000122219247337328 
 350.000000000000  260.000000000000  0.000144254810380307 
 350.000000000000  270.000000000000  0.000161907264006336 
 350.000000000000  280.000000000000  0.000174640247344561 
 350.000000000000  290.000000000000  0.000182066875139451 
 350.000000000000  300.000000000000  0.000183961493063513 
 350.000000000000  310.000000000000  0.000180266534109847 
 350.000000000000  320.000000000000  0.000171094267736521 
 350.000000000000  330.000000000000  0.000156723388615898 
 350.000000000000  340.000000000000  0.000137590548638042 
 350.000000000000  350.000000000000  0.000114277089463996 
 350.000000000000  360.000000000000  8.74913787535843e-05 

 360.000000000000  0.00000000000000  3.43329497839269e-05 
 360.000000000000  10.0000000000000  2.50978410604366e-05 
 360.000000000000  20.0000000000000  1.51001471364454e-05 
 360.000000000000  30.0000000000000  4.64364288275637e-06 
 360.000000000000  40.0000000000000 -5.95395611012852e-06 
 360.000000000000  50.0000000000000 -1.63706471594543e-05 
 360.000000000000  60.0000000000000 -2.62899243787872e-05 
 360.000000000000  70.0000000000000 -3.54103955492144e-05 
 360.000000000000  80.0000000000000 -4.34549397694034e-05 
 360.000000000000  90.0000000000000 -5.01791276339595e-05 
 360.000000000000  100.000000000000 -5.53786480972216e-05 
 360.000000000000  110.000000000000 -5.88955163609977e-05 
 360.000000000000  120.000000000000 -6.06228741627141e-05 
 360.000000000000  130.000000000000 -6.05082366096510e-05 
 360.000000000000  140.000000000000 -5.85550869058487e-05 
 360.000000000000  150.000000000000 -5.48227705167159e-05 
 360.000000000000  160.000000000000 -4.94246919870931e-05 
 360.000000000000  170.000000000000 -4.25248692015434e-05 
 360.000000000000  180.000000000000 -3.43329497839269e-05 
 360.000000000000  190.000000000000 -2.50978410604366e-05 
 360.000000000000  200.000000000000 -1.51001471364454e-05 
 360.000000000000  210.000000000000 -4.64364288275636e-06 
 360.000000000000  220.000000000000  5.95395611012852e-06 
 360.000000000000  230.000000000000  1.63706471594543e-05 
 360.000000000000  240.000000000000  2.62899243787872e-05 
 360.000000000000  250.000000000000  3.54103955492144e-05 
 360.000000000000  260.000000000000  4.34549397694034e-05 
 360.000000000000  270.000000000000  5.01791276339595e-05 
 360.000000000000  280.000000000000  5.53786480972216e-05 
 360.000000000000  290.000000000000  5.88955163609977e-05 
 360.000000000000  300.000000000000  6.06228741627141e-05 
 360.000000000000  310.000000000000  6.05082366096510e-05 
 360.000000000000  320.000000000000  5.85550869058487e-05 
 360.000000000000  330.000000000000  5.48227705167159e-05 
 360.000000000000  340.000000000000  4.94246919870931e-05 
 360.000000000000  350.000000000000  4.25248692015434e-05 
 360.000000000000  360.000000000000  3.43329497839269e-05 

