top-level: update to automake-1.15.1

18 jobs for automake-update in 83 minutes and 6 seconds (queued for 2 seconds)
Status Job ID Name Coverage
  Nightly
passed #38678
macos
nightly:macos

00:47:46

passed #38676
nightly:openmp:jessie

00:37:24

passed #38677
nightly:python3:stretch

00:38:02

failed #38673
allowed to fail
nightly:top-level:artful

00:21:24

failed #38674
allowed to fail
nightly:top-level:buster

00:23:31

passed #38675
nightly:top-level:clang

00:36:44

passed #38669
nightly:top-level:el7

00:34:31

passed #38670
nightly:top-level:stretch

00:37:12

passed #38671
nightly:top-level:trusty

00:27:56

passed #38672
nightly:top-level:xenial

00:29:51

passed #38684
macos
nightly:wheel:cp27-cp27m-macosx

00:30:57

passed #38679
nightly:wheel:cp27-cp27m-manylinux1

00:15:48

passed #38680
nightly:wheel:cp27-cp27mu-manylinux1

00:15:04

passed #38681
nightly:wheel:cp34-cp34m-manylinux1

00:14:58

passed #38685
macos
nightly:wheel:cp35-cp35m-macosx

00:31:08

passed #38682
nightly:wheel:cp35-cp35m-manylinux1

00:15:00

passed #38686
macos
nightly:wheel:cp36-cp36m-macosx

00:35:19

passed #38683
nightly:wheel:cp36-cp36m-manylinux1

00:14:56

 
Name Stage Failure
failed
nightly:top-level:buster Nightly
Makefile:403: recipe for target 'check-recursive' failed
make[2]: *** [check-recursive] Error 1
make[2]: Leaving directory '/builds/adam-mercer/lalsuite/lalsuite-6.48.1/_build/sub'
make[1]: *** [check] Error 2
Makefile:677: recipe for target 'check' failed
make[1]: Leaving directory '/builds/adam-mercer/lalsuite/lalsuite-6.48.1/_build/sub'
Makefile:594: recipe for target 'distcheck' failed
make: *** [distcheck] Error 1
ERROR: Job failed: exit code 1
failed
nightly:top-level:artful Nightly
Makefile:403: recipe for target 'check-recursive' failed
make[2]: *** [check-recursive] Error 1
make[2]: Leaving directory '/builds/adam-mercer/lalsuite/lalsuite-6.48.1/_build/sub'
Makefile:677: recipe for target 'check' failed
make[1]: *** [check] Error 2
make[1]: Leaving directory '/builds/adam-mercer/lalsuite/lalsuite-6.48.1/_build/sub'
Makefile:594: recipe for target 'distcheck' failed
make: *** [distcheck] Error 1
ERROR: Job failed: exit code 1