disable python39 wheels

57 jobs for disable-python39-wheels in 141 minutes and 7 seconds (queued for 2 minutes and 7 seconds)
Status Job ID Name Coverage
  .Pre
passed #1052738
make-dist

00:07:21

 
  Lal
passed #1052741
lal:conda:fftw

00:23:03

passed #1052742
lal:conda:mkl

00:23:47

passed #1052740
lal:deb

00:24:01

passed #1052739
lal:rpm

00:17:31

 
  Lal Frame
passed #1052745
lalframe:conda

00:19:24

passed #1052744
lalframe:deb

00:07:00

passed #1052743
lalframe:rpm

00:05:43

 
  Lal Meta Io
passed #1052748
lalmetaio:conda

00:14:21

passed #1052747
lalmetaio:deb

00:07:10

passed #1052746
lalmetaio:rpm

00:05:36

 
  Lal Simulation
passed #1052751
lalsimulation:conda

00:21:04

passed #1052750
lalsimulation:deb

00:17:54

passed #1052749
lalsimulation:rpm

00:09:02

 
  Lal Burst
passed #1052754
lalburst:conda

00:20:14

passed #1052753
lalburst:deb

00:16:37

passed #1052752
lalburst:rpm

00:19:05

 
  Lal Inspiral
passed #1052757
lalinspiral:conda

00:20:47

passed #1052756
lalinspiral:deb

00:15:43

passed #1052755
lalinspiral:rpm

00:10:33

 
  Lal Pulsar
passed #1052760
lalpulsar:conda

00:18:30

passed #1052759
lalpulsar:deb

00:17:36

passed #1052758
lalpulsar:rpm

00:10:58

 
  Lal Inference
passed #1052763
lalinference:conda

00:32:36

passed #1052762
lalinference:deb

00:16:18

passed #1052761
lalinference:rpm

00:11:37

 
  Lal Apps
passed #1052766
lalapps:conda

00:15:48

passed #1052765
lalapps:deb

00:25:17

passed #1052764
lalapps:rpm

00:10:26

 
  Lint
passed #1052768
lint:coala

00:02:23

passed #1052793
lint:python

00:01:17

failed #1052767
lint:python

00:00:18

 
  Integration Tests
passed #1052771
coverage

00:54:48

19.33%
passed #1052769
lalinference_testjob

00:19:52

passed #1052770
top-level

00:42:21

 
  Compiler Tests
passed #1052772
clang:10

00:33:35

passed #1052773
clang:11

00:34:14

passed #1052774
clang:dev

00:38:33

passed #1052779
cuda

00:15:04

failed #1052778
allowed to fail
gcc:10

00:18:41

passed #1052775
gcc:7

00:30:34

passed #1052801
gcc:8

00:30:10

passed #1052777
gcc:9

00:29:00

failed #1052776
gcc:8

00:00:21

 
  Platform Tests
failed #1052783
allowed to fail
platform:conda:linux

00:16:41

passed #1052780
platform:debian:buster

00:31:00

passed #1052781
macos_highsierra
platform:macos:highsierra

00:28:34

passed #1052782
macos_sierra
platform:macos:sierra

00:25:12

 
  Docker
passed #1052784
docker:nightly:el7

00:15:04

passed #1052785
docker:nightly:stretch

00:09:09

 
  Wheels
passed #1052789
macos_sierra
wheel:cp36-cp36m-macosx

00:19:10

passed #1052786
wheel:cp36-cp36m-manylinux2014

00:15:25

passed #1052790
macos_sierra
wheel:cp37-cp37m-macosx

00:20:55

passed #1052787
wheel:cp37-cp37m-manylinux2014

00:17:18

passed #1052791
macos_sierra
wheel:cp38-cp38-macosx

00:17:44

passed #1052788
wheel:cp38-cp38-manylinux2014

00:15:38

 
  Deploy
passed #1052792
deploy:wheel

00:00:59

 
Name Stage Failure
failed
gcc:10 Compiler Tests
make[1]: Leaving directory '/builds/adam-mercer/lalsuite/lalsuite-6.78.1/_build/sub'
make[1]: *** [Makefile:693: check] Error 2
make: *** [Makefile:615: distcheck] Error 1
Uploading artifacts for failed job
Uploading artifacts...
WARNING: */test/python/junit*.xml: no matching files
ERROR: No files to upload
Cleaning up file based variables
ERROR: Job failed: exit code 1
failed
platform:conda:linux Platform Tests
make[1]: *** [Makefile:415: check-recursive] Error 1
make[1]: Leaving directory '/builds/adam-mercer/lalsuite'
make: *** [Makefile:689: check] Error 2
Uploading artifacts for failed job
Uploading artifacts...
*/test/python/junit*.xml: found 5 matching files and directories

Uploading artifacts as "junit" to coordinator... ok
id=1052783 responseStatus=201 Created token=nPSZE4t7
Cleaning up file based variables
ERROR: Job failed: exit code 1