lalinference: drop lalxml dependency

LALXML is no longer used, or needed
34 jobs for remove-lalxml-dependency-from-lalinference in 61 minutes and 15 seconds (queued for 5 seconds)
Status Job ID Name Coverage
  Level0
passed #62064
level0:lal

00:03:00

passed #62065
level0:rpm:lal

00:10:03

 
  Level1
passed #62066
level1:lalframe

00:01:44

passed #62067
level1:lalmetaio

00:01:24

passed #62068
level1:lalsimulation

00:02:55

passed #62069
level1:lalxml

00:01:22

passed #62070
level1:rpm:lalframe

00:02:07

passed #62071
level1:rpm:lalmetaio

00:02:17

passed #62072
level1:rpm:lalsimulation

00:04:11

passed #62073
level1:rpm:lalxml

00:01:32

 
  Level2
passed #62074
level2:lalburst

00:01:53

passed #62075
level2:lalinspiral

00:04:08

passed #62076
level2:lalpulsar

00:03:23

passed #62077
level2:lalstochastic

00:01:38

passed #62078
level2:rpm:lalburst

00:01:51

passed #62079
level2:rpm:lalinspiral

00:07:47

passed #62080
level2:rpm:lalpulsar

00:06:55

passed #62081
level2:rpm:lalstochastic

00:01:53

 
  Level3
passed #62082
level3:laldetchar

00:01:51

passed #62083
level3:lalinference

00:06:43

passed #62084
level3:rpm:laldetchar

00:01:25

passed #62085
level3:rpm:lalinference

00:06:08

 
  Level4
passed #62086
level4:lalapps

00:05:44

passed #62087
level4:rpm:lalapps

00:04:00

 
  Nightly
failed #62097
macos_highsierra
nightly:macos:highsierra

00:19:33

failed #62095
nightly:openmp:jessie

00:24:52

failed #62096
allowed to fail
nightly:python3:stretch

00:25:45

failed #62092
nightly:top-level:artful

00:24:10

failed #62093
nightly:top-level:buster

00:23:57

failed #62094
nightly:top-level:clang

00:25:15

failed #62088
nightly:top-level:el7

00:24:45

failed #62089
nightly:top-level:stretch

00:17:21

passed #62090
nightly:top-level:trusty

00:26:40

passed #62091
nightly:top-level:xenial

00:24:42

 
Name Stage Failure
failed
nightly:python3:stretch Nightly
make[2]: *** [check-recursive] Error 1
Makefile:416: recipe for target 'check-recursive' failed
make[2]: Leaving directory '/builds/adam-mercer/lalsuite/lalsuite-6.48.1/_build/sub'
Makefile:690: recipe for target 'check' failed
make[1]: *** [check] Error 2
make[1]: Leaving directory '/builds/adam-mercer/lalsuite/lalsuite-6.48.1/_build/sub'
Makefile:607: recipe for target 'distcheck' failed
make: *** [distcheck] Error 1
ERROR: Job failed: exit code 1
failed
nightly:top-level:clang Nightly
make[2]: *** [check-recursive] Error 1
Makefile:405: recipe for target 'check-recursive' failed
make[2]: Leaving directory '/builds/adam-mercer/lalsuite/lalsuite-6.48.1/_build'
Makefile:679: recipe for target 'check' failed
make[1]: Leaving directory '/builds/adam-mercer/lalsuite/lalsuite-6.48.1/_build'
make[1]: *** [check] Error 2
Makefile:596: recipe for target 'distcheck' failed
make: *** [distcheck] Error 1
ERROR: Job failed: exit code 1
failed
nightly:openmp:jessie Nightly
Makefile:405: recipe for target 'check-recursive' failed
make[2]: Leaving directory '/builds/adam-mercer/lalsuite/lalsuite-6.48.1/_build'
make[2]: *** [check-recursive] Error 1
Makefile:679: recipe for target 'check' failed
make[1]: *** [check] Error 2
make[1]: Leaving directory '/builds/adam-mercer/lalsuite/lalsuite-6.48.1/_build'
Makefile:596: recipe for target 'distcheck' failed
make: *** [distcheck] Error 1
ERROR: Job failed: exit code 1
failed
nightly:top-level:el7 Nightly
make[4]: Leaving directory `/builds/adam-mercer/lalsuite/lalsuite-6.48.1/_build/lalinference'
make[3]: *** [check] Error 2
make[3]: Leaving directory `/builds/adam-mercer/lalsuite/lalsuite-6.48.1/_build/lalinference'
make[2]: *** [check-recursive] Error 1
make[2]: Leaving directory `/builds/adam-mercer/lalsuite/lalsuite-6.48.1/_build'
make[1]: *** [check] Error 2
make[1]: Leaving directory `/builds/adam-mercer/lalsuite/lalsuite-6.48.1/_build'
make: *** [distcheck] Error 1
ERROR: Job failed: exit code 1
failed
nightly:top-level:artful Nightly
Makefile:416: recipe for target 'check-recursive' failed
make[2]: *** [check-recursive] Error 1
make[2]: Leaving directory '/builds/adam-mercer/lalsuite/lalsuite-6.48.1/_build/sub'
Makefile:690: recipe for target 'check' failed
make[1]: *** [check] Error 2
make[1]: Leaving directory '/builds/adam-mercer/lalsuite/lalsuite-6.48.1/_build/sub'
Makefile:607: recipe for target 'distcheck' failed
make: *** [distcheck] Error 1
ERROR: Job failed: exit code 1
failed
nightly:top-level:buster Nightly
Makefile:416: recipe for target 'check-recursive' failed
make[2]: *** [check-recursive] Error 1
make[2]: Leaving directory '/builds/adam-mercer/lalsuite/lalsuite-6.48.1/_build/sub'
Makefile:690: recipe for target 'check' failed
make[1]: *** [check] Error 2
make[1]: Leaving directory '/builds/adam-mercer/lalsuite/lalsuite-6.48.1/_build/sub'
Makefile:607: recipe for target 'distcheck' failed
make: *** [distcheck] Error 1
ERROR: Job failed: exit code 1
failed
nightly:macos:highsierra Nightly
make[7]: *** [test-suite.log] Error 1
make[6]: *** [check-TESTS] Error 2
make[5]: *** [check-am] Error 2
make[4]: *** [check] Error 2
make[3]: *** [check-recursive] Error 1
make[2]: *** [check] Error 2
make[1]: *** [check-recursive] Error 1
make: *** [check] Error 2
ERROR: Job failed: exit status 1
failed
nightly:top-level:stretch Nightly
Makefile:416: recipe for target 'check-recursive' failed
make[2]: *** [check-recursive] Error 1
make[2]: Leaving directory '/builds/adam-mercer/lalsuite/lalsuite-6.48.1/_build/sub'
make[1]: *** [check] Error 2
Makefile:690: recipe for target 'check' failed
make[1]: Leaving directory '/builds/adam-mercer/lalsuite/lalsuite-6.48.1/_build/sub'
Makefile:607: recipe for target 'distcheck' failed
make: *** [distcheck] Error 1
ERROR: Job failed: exit code 1