WIP: add -lmkl_avx2 -lmkl_def to LDFLAGS

[ci skip]
38 jobs for nightly-mkl-stretch-build in 124 minutes and 2 seconds (queued for 4 seconds)
Status Job ID Name Coverage
  Level0
passed #154396
level0:deb:lal

00:26:08

passed #154395
level0:rpm:lal

00:11:33

 
  Level1
passed #154401
level1:deb:lalframe

00:05:38

passed #154402
level1:deb:lalmetaio

00:06:03

passed #154403
level1:deb:lalsimulation

00:13:07

passed #154404
level1:deb:lalxml

00:03:44

passed #154397
level1:rpm:lalframe

00:02:56

passed #154398
level1:rpm:lalmetaio

00:03:08

passed #154399
level1:rpm:lalsimulation

00:05:21

passed #154400
level1:rpm:lalxml

00:02:23

 
  Level2
passed #154409
level2:deb:lalburst

00:03:36

passed #154410
level2:deb:lalinspiral

00:19:13

passed #154411
level2:deb:lalpulsar

00:16:32

passed #154412
level2:deb:lalstochastic

00:04:56

passed #154405
level2:rpm:lalburst

00:02:20

passed #154406
level2:rpm:lalinspiral

00:08:48

passed #154407
level2:rpm:lalpulsar

00:08:13

passed #154408
level2:rpm:lalstochastic

00:02:34

 
  Level3
passed #154415
level3:deb:laldetchar

00:02:40

passed #154416
level3:deb:lalinference

00:08:41

passed #154413
level3:rpm:laldetchar

00:02:09

passed #154414
level3:rpm:lalinference

00:06:38

 
  Level4
passed #154418
level4:deb:lalapps

00:10:47

passed #154417
level4:rpm:lalapps

00:05:01

 
  Nightly
passed #154432
macos_elcapitan
nightly:macos:elcapitan

00:24:16

passed #154431
macos_highsierra
nightly:macos:highsierra

00:25:14

failed #154430
nightly:mkl:stretch

00:26:28

passed #154428
nightly:openmp:stretch

00:38:20

passed #154429
nightly:python3:stretch

00:45:55

passed #154424
nightly:top-level:bionic

00:36:26

passed #154426
nightly:top-level:buster

00:36:33

passed #154427
nightly:top-level:clang

00:38:28

passed #154425
nightly:top-level:cosmic

00:36:31

passed #154420
nightly:top-level:el7-cr

00:36:21

passed #154419
nightly:top-level:jessie

00:37:44

passed #154421
nightly:top-level:sl7

00:36:15

passed #154422
nightly:top-level:trusty

00:30:10

passed #154423
nightly:top-level:xenial

00:31:52

 
Name Stage Failure
failed
nightly:mkl:stretch Nightly
Makefile:416: recipe for target 'check-recursive' failed
make[2]: *** [check-recursive] Error 1
make[2]: Leaving directory '/builds/adam-mercer/lalsuite/lalsuite-6.48.1/_build/sub'
Makefile:690: recipe for target 'check' failed
make[1]: Leaving directory '/builds/adam-mercer/lalsuite/lalsuite-6.48.1/_build/sub'
make[1]: *** [check] Error 2
Makefile:607: recipe for target 'distcheck' failed
make: *** [distcheck] Error 1
ERROR: Job failed: exit code 1