add nightly gcc7 and gcc8 builds

[ci skip]
44 jobs for gcc-nightly-builds in 155 minutes and 30 seconds (queued for 3 seconds)
Status Job ID Name Coverage
  Level0
passed #233297
level0:deb:lal

00:22:12

passed #233296
level0:rpm:lal

00:09:39

 
  Level1
passed #233301
level1:deb:lalframe

00:04:34

passed #233302
level1:deb:lalmetaio

00:05:10

passed #233303
level1:deb:lalsimulation

00:11:45

passed #233298
level1:rpm:lalframe

00:02:28

passed #233299
level1:rpm:lalmetaio

00:02:35

passed #233300
level1:rpm:lalsimulation

00:04:45

 
  Level2
passed #233307
level2:deb:lalburst

00:03:21

passed #233308
level2:deb:lalinspiral

00:17:34

passed #233309
level2:deb:lalpulsar

00:15:08

passed #233304
level2:rpm:lalburst

00:02:07

passed #233305
level2:rpm:lalinspiral

00:08:03

passed #233306
level2:rpm:lalpulsar

00:07:25

 
  Level3
passed #233311
level3:deb:lalinference

00:07:26

passed #233310
level3:rpm:lalinference

00:06:09

 
  Level4
passed #233313
level4:deb:lalapps

00:09:30

passed #233312
level4:rpm:lalapps

00:05:17

 
  Docker
passed #233314
docker:nightly:el7

00:09:58

passed #233315
docker:nightly:stretch

00:06:57

 
  Nightly
passed #233324
macos_elcapitan
nightly:macos:elcapitan

00:23:34

passed #233323
macos_highsierra
nightly:macos:highsierra

00:24:48

passed #233327
nightly:top-level:bionic

00:24:55

failed #233320
allowed to fail
nightly:top-level:buster

00:04:29

passed #233316
nightly:top-level:clang

00:33:59

failed #233328
allowed to fail
nightly:top-level:cosmic

00:04:14

passed #233321
nightly:top-level:el7-cr

00:32:08

passed #233317
nightly:top-level:gcc7

00:30:46

failed #233318
allowed to fail
nightly:top-level:gcc8

00:17:55

passed #233319
nightly:top-level:jessie

00:34:01

passed #233322
nightly:top-level:sl7

00:31:57

failed #233325
allowed to fail
nightly:top-level:trusty

00:11:14

failed #233326
allowed to fail
nightly:top-level:xenial

00:11:45

 
  Wheels
passed #233335
macos_elcapitan
nightly:wheel:cp27-cp27m-macosx

00:18:16

passed #233329
nightly:wheel:cp27-cp27m-manylinux1

00:14:10

passed #233330
nightly:wheel:cp27-cp27mu-manylinux1

00:14:32

passed #233331
nightly:wheel:cp34-cp34m-manylinux1

00:14:29

passed #233336
macos_elcapitan
nightly:wheel:cp35-cp35m-macosx

00:18:47

passed #233332
nightly:wheel:cp35-cp35m-manylinux1

00:14:34

passed #233337
macos_elcapitan
nightly:wheel:cp36-cp36m-macosx

00:24:21

passed #233333
nightly:wheel:cp36-cp36m-manylinux1

00:14:54

passed #233338
macos_elcapitan
nightly:wheel:cp37-cp37m-macosx

00:21:00

passed #233334
nightly:wheel:cp37-cp37m-manylinux1

00:14:27

 
  Deploy
passed #233339
deploy:wheel

00:00:20

 
Name Stage Failure
failed
nightly:top-level:gcc8 Nightly
Makefile:416: recipe for target 'all-recursive' failed
make[2]: Leaving directory '/builds/adam-mercer/lalsuite/lalsuite-6.49.1/_build/sub'
make[2]: *** [all-recursive] Error 1
Makefile:353: recipe for target 'all' failed
make[1]: *** [all] Error 2
make[1]: Leaving directory '/builds/adam-mercer/lalsuite/lalsuite-6.49.1/_build/sub'
Makefile:607: recipe for target 'distcheck' failed
make: *** [distcheck] Error 1
ERROR: Job failed: exit code 1
failed
nightly:top-level:xenial Nightly
Makefile:416: recipe for target 'all-recursive' failed
make[2]: Leaving directory '/builds/adam-mercer/lalsuite/lalsuite-6.49.1/_build/sub'
make[2]: *** [all-recursive] Error 1
Makefile:353: recipe for target 'all' failed
make[1]: *** [all] Error 2
make[1]: Leaving directory '/builds/adam-mercer/lalsuite/lalsuite-6.49.1/_build/sub'
Makefile:607: recipe for target 'distcheck' failed
make: *** [distcheck] Error 1
ERROR: Job failed: exit code 1
failed
nightly:top-level:trusty Nightly
make[4]: Leaving directory `/builds/adam-mercer/lalsuite/lalsuite-6.49.1/_build/lalinspiral'
make[3]: *** [all] Error 2
make[3]: Leaving directory `/builds/adam-mercer/lalsuite/lalsuite-6.49.1/_build/lalinspiral'
make[2]: *** [all-recursive] Error 1
make[2]: Leaving directory `/builds/adam-mercer/lalsuite/lalsuite-6.49.1/_build'
make[1]: *** [all] Error 2
make[1]: Leaving directory `/builds/adam-mercer/lalsuite/lalsuite-6.49.1/_build'
make: *** [distcheck] Error 1
ERROR: Job failed: exit code 1
failed
nightly:top-level:buster Nightly
make[4]: *** [Makefile:750: distdir-am] Error 1
make[3]: *** [Makefile:744: distdir] Error 2
make[3]: Leaving directory '/builds/adam-mercer/lalsuite/lalapps'
make[2]: *** [Makefile:508: distdir-am] Error 1
make[2]: Leaving directory '/builds/adam-mercer/lalsuite'
make[1]: *** [Makefile:502: distdir] Error 2
make[1]: Leaving directory '/builds/adam-mercer/lalsuite'
make: *** [Makefile:603: dist] Error 2
ERROR: Job failed: exit code 1
failed
nightly:top-level:cosmic Nightly
make[4]: Leaving directory '/builds/adam-mercer/lalsuite/lalapps'
make[3]: *** [Makefile:744: distdir] Error 2
make[3]: Leaving directory '/builds/adam-mercer/lalsuite/lalapps'
make[2]: *** [Makefile:508: distdir-am] Error 1
make[2]: Leaving directory '/builds/adam-mercer/lalsuite'
make[1]: Leaving directory '/builds/adam-mercer/lalsuite'
make[1]: *** [Makefile:502: distdir] Error 2
make: *** [Makefile:603: dist] Error 2
ERROR: Job failed: exit code 1