sync .gitlab-ci.yml with master

34 jobs for lal-intel-fft-point-release in 124 minutes and 52 seconds (queued for 5 seconds)
Status Job ID Name Coverage
  Level0
passed #235672
documentation

00:09:55

passed #235674
level0:deb:lal

00:29:44

passed #235673
level0:rpm:lal

00:14:14

 
  Level1
passed #235678
level1:deb:lalframe

00:05:28

passed #235679
level1:deb:lalmetaio

00:06:11

passed #235680
level1:deb:lalsimulation

00:13:11

passed #235675
level1:rpm:lalframe

00:03:01

passed #235676
level1:rpm:lalmetaio

00:03:11

passed #235677
level1:rpm:lalsimulation

00:05:22

 
  Level2
passed #235684
level2:deb:lalburst

00:04:44

passed #235685
level2:deb:lalinspiral

00:23:50

passed #235686
level2:deb:lalpulsar

00:20:51

passed #235681
level2:rpm:lalburst

00:02:48

passed #235682
level2:rpm:lalinspiral

00:09:53

passed #235683
level2:rpm:lalpulsar

00:09:31

 
  Level3
passed #235688
level3:deb:lalinference

00:10:18

passed #235687
level3:rpm:lalinference

00:08:11

 
  Level4
passed #235690
level4:deb:lalapps

00:11:00

passed #235689
level4:rpm:lalapps

00:06:18

 
  Nightly
passed #235691
nightly:clang:6

00:36:30

passed #235692
nightly:clang:7

00:36:40

passed #235693
nightly:clang:8

00:36:33

failed #235697
allowed to fail
nightly:debian:buster

00:04:41

passed #235696
nightly:debian:jessie

00:35:48

passed #235694
nightly:gcc:7

00:32:42

failed #235695
allowed to fail
nightly:gcc:8

00:19:05

passed #235701
macos_elcapitan
nightly:macos:elcapitan

00:25:59

passed #235700
macos_highsierra
nightly:macos:highsierra

00:25:21

passed #235698
nightly:rhel:el7-cr

00:34:46

passed #235699
nightly:rhel:sl7

00:34:54

passed #235704
nightly:ubuntu:bionic

00:34:47

failed #235705
allowed to fail
nightly:ubuntu:cosmic

00:05:02

passed #235702
nightly:ubuntu:trusty

00:28:49

passed #235703
nightly:ubuntu:xenial

00:30:28

 
Name Stage Failure
failed
nightly:gcc:8 Nightly
make[2]: *** [all-recursive] Error 1
Makefile:416: recipe for target 'all-recursive' failed
make[2]: Leaving directory '/builds/adam-mercer/lalsuite/lalsuite-6.50/_build/sub'
Makefile:353: recipe for target 'all' failed
make[1]: Leaving directory '/builds/adam-mercer/lalsuite/lalsuite-6.50/_build/sub'
make[1]: *** [all] Error 2
Makefile:607: recipe for target 'distcheck' failed
make: *** [distcheck] Error 1
ERROR: Job failed: exit code 1
failed
nightly:ubuntu:cosmic Nightly
make[4]: Leaving directory '/builds/adam-mercer/lalsuite/lalapps'
make[3]: Leaving directory '/builds/adam-mercer/lalsuite/lalapps'
make[3]: *** [Makefile:744: distdir] Error 2
make[2]: *** [Makefile:508: distdir-am] Error 1
make[2]: Leaving directory '/builds/adam-mercer/lalsuite'
make[1]: *** [Makefile:502: distdir] Error 2
make[1]: Leaving directory '/builds/adam-mercer/lalsuite'
make: *** [Makefile:603: dist] Error 2
ERROR: Job failed: exit code 1
failed
nightly:debian:buster Nightly
make[4]: Leaving directory '/builds/adam-mercer/lalsuite/lalapps'
make[3]: *** [Makefile:744: distdir] Error 2
make[3]: Leaving directory '/builds/adam-mercer/lalsuite/lalapps'
make[2]: *** [Makefile:508: distdir-am] Error 1
make[2]: Leaving directory '/builds/adam-mercer/lalsuite'
make[1]: *** [Makefile:502: distdir] Error 2
make[1]: Leaving directory '/builds/adam-mercer/lalsuite'
make: *** [Makefile:603: dist] Error 2
ERROR: Job failed: exit code 1