lalmetaio: fix the zlib check

34 jobs for fix-lalmetaio-zlib-check in 107 minutes and 38 seconds (queued for 4 seconds)
Status Job ID Name Coverage
  Level0
passed documentation #236520

00:05:25

passed level0:deb:lal #236522

00:23:31

passed level0:rpm:lal #236521

00:10:53

 
  Level1
passed level1:deb:lalframe #236526

00:05:00

passed level1:deb:lalmetaio #236527

00:05:32

passed level1:deb:lalsimulation #236528

00:12:37

passed level1:rpm:lalframe #236523

00:02:44

passed level1:rpm:lalmetaio #236524

00:02:53

passed level1:rpm:lalsimulation #236525

00:05:03

 
  Level2
passed level2:deb:lalburst #236532

00:03:49

passed level2:deb:lalinspiral #236533

00:18:40

passed level2:deb:lalpulsar #236534

00:16:15

passed level2:rpm:lalburst #236529

00:02:21

passed level2:rpm:lalinspiral #236530

00:08:42

passed level2:rpm:lalpulsar #236531

00:08:13

 
  Level3
passed level3:deb:lalinference #236536

00:07:59

passed level3:rpm:lalinference #236535

00:06:25

 
  Level4
passed level4:deb:lalapps #236538

00:09:23

passed level4:rpm:lalapps #236537

00:05:17

 
  Nightly
passed nightly:clang:6 #236539

00:34:53

passed nightly:clang:7 #236540

00:35:14

passed nightly:clang:8 #236541

00:35:19

failed nightly:debian:buster #236545
allowed to fail

00:04:54

passed nightly:debian:jessie #236544

00:34:33

passed nightly:gcc:7 #236542

00:31:54

failed nightly:gcc:8 #236543
allowed to fail

00:18:44

passed nightly:macos:elcapitan #236549
macos_elcapitan

00:25:20

passed nightly:macos:highsierra #236548
macos_highsierra

00:25:33

passed nightly:rhel:el7-cr #236546

00:33:21

passed nightly:rhel:sl7 #236547

00:32:51

passed nightly:ubuntu:bionic #236552

00:33:33

failed nightly:ubuntu:cosmic #236553
allowed to fail

00:04:50

failed nightly:ubuntu:trusty #236550
allowed to fail

00:11:28

failed nightly:ubuntu:xenial #236551
allowed to fail

00:11:57

 
Name Stage Failure
failed
nightly:ubuntu:cosmic Nightly
make[4]: Leaving directory '/builds/adam-mercer/lalsuite/lalapps'
make[3]: *** [Makefile:744: distdir] Error 2
make[3]: Leaving directory '/builds/adam-mercer/lalsuite/lalapps'
make[2]: *** [Makefile:508: distdir-am] Error 1
make[2]: Leaving directory '/builds/adam-mercer/lalsuite'
make[1]: *** [Makefile:502: distdir] Error 2
make[1]: Leaving directory '/builds/adam-mercer/lalsuite'
make: *** [Makefile:603: dist] Error 2
ERROR: Job failed: exit code 1
failed
nightly:ubuntu:xenial Nightly
Makefile:416: recipe for target 'all-recursive' failed
make[2]: *** [all-recursive] Error 1
make[2]: Leaving directory '/builds/adam-mercer/lalsuite/lalsuite-6.50.1/_build/sub'
Makefile:353: recipe for target 'all' failed
make[1]: *** [all] Error 2
make[1]: Leaving directory '/builds/adam-mercer/lalsuite/lalsuite-6.50.1/_build/sub'
make: *** [distcheck] Error 1
Makefile:607: recipe for target 'distcheck' failed
ERROR: Job failed: exit code 1
failed
nightly:ubuntu:trusty Nightly
make[4]: Leaving directory `/builds/adam-mercer/lalsuite/lalsuite-6.50.1/_build/lalinspiral'
make[3]: *** [all] Error 2
make[3]: Leaving directory `/builds/adam-mercer/lalsuite/lalsuite-6.50.1/_build/lalinspiral'
make[2]: *** [all-recursive] Error 1
make[2]: Leaving directory `/builds/adam-mercer/lalsuite/lalsuite-6.50.1/_build'
make[1]: *** [all] Error 2
make[1]: Leaving directory `/builds/adam-mercer/lalsuite/lalsuite-6.50.1/_build'
make: *** [distcheck] Error 1
ERROR: Job failed: exit code 1
failed
nightly:debian:buster Nightly
make[4]: Leaving directory '/builds/adam-mercer/lalsuite/lalapps'
make[3]: *** [Makefile:744: distdir] Error 2
make[3]: Leaving directory '/builds/adam-mercer/lalsuite/lalapps'
make[2]: *** [Makefile:508: distdir-am] Error 1
make[2]: Leaving directory '/builds/adam-mercer/lalsuite'
make[1]: *** [Makefile:502: distdir] Error 2
make[1]: Leaving directory '/builds/adam-mercer/lalsuite'
make: *** [Makefile:603: dist] Error 2
ERROR: Job failed: exit code 1
failed
nightly:gcc:8 Nightly
make[2]: *** [all-recursive] Error 1
Makefile:416: recipe for target 'all-recursive' failed
make[2]: Leaving directory '/builds/adam-mercer/lalsuite/lalsuite-6.50.1/_build/sub'
make[1]: *** [all] Error 2
Makefile:353: recipe for target 'all' failed
make[1]: Leaving directory '/builds/adam-mercer/lalsuite/lalsuite-6.50.1/_build/sub'
Makefile:607: recipe for target 'distcheck' failed
make: *** [distcheck] Error 1
ERROR: Job failed: exit code 1