top-level: mark as version 6.60

35 jobs for lalinference-point-release in 138 minutes and 15 seconds (queued for 1 minute and 39 seconds)
Status Job ID Name Coverage
  Level0
passed #388113
documentation

00:12:01

passed #388115
level0:deb:lal

00:38:40

passed #388114
level0:rpm:lal

00:17:09

 
  Level1
passed #388119
level1:deb:lalframe

00:05:40

passed #388120
level1:deb:lalmetaio

00:06:26

passed #388121
level1:deb:lalsimulation

00:13:56

passed #388116
level1:rpm:lalframe

00:03:14

passed #388117
level1:rpm:lalmetaio

00:03:34

passed #388118
level1:rpm:lalsimulation

00:05:55

 
  Level2
passed #388125
level2:deb:lalburst

00:04:34

passed #388126
level2:deb:lalinspiral

00:19:18

passed #388127
level2:deb:lalpulsar

00:18:30

passed #388122
level2:rpm:lalburst

00:03:04

passed #388123
level2:rpm:lalinspiral

00:09:04

passed #388124
level2:rpm:lalpulsar

00:09:19

 
  Level3
passed #388129
level3:deb:lalinference

00:08:42

passed #388128
level3:rpm:lalinference

00:07:15

 
  Level4
passed #388131
level4:deb:lalapps

00:12:58

passed #388130
level4:rpm:lalapps

00:07:55

 
  Nightly
failed #388138
allowed to fail
conda:python27

00:38:55

failed #388139
allowed to fail
conda:python36

00:44:07

failed #388140
allowed to fail
conda:python37

00:32:36

passed #388132
nightly:clang:7

00:42:09

passed #388133
nightly:clang:8

00:41:51

passed #388134
nightly:clang:9

00:42:14

failed #388141
allowed to fail
nightly:debian:buster

00:07:41

passed #388135
nightly:gcc:7

00:38:00

passed #388136
nightly:gcc:8

00:38:50

failed #388137
allowed to fail
nightly:gcc:9

00:25:11

passed #388143
macos_highsierra
nightly:macos:highsierra

00:29:20

passed #388144
macos_sierra
nightly:macos:sierra

00:25:53

passed #388142
nightly:rhel:el7-cr

00:39:28

passed #388146
nightly:ubuntu:bionic

00:39:47

failed #388147
allowed to fail
nightly:ubuntu:cosmic

00:06:44

failed #388145
allowed to fail
nightly:ubuntu:xenial

00:14:32

 
Name Stage Failure
failed
conda:python36 Nightly
make[1]: Leaving directory '/builds/adam-mercer/lalsuite/lalsuite-6.60/_build/sub'
make: *** [Makefile:611: distcheck] Error 1
Uploading artifacts...
config.log: found 1 matching files
*/config.log: found 9 matching files

WARNING: */test/test-suite.log: no matching files
*/*/*/*/test/test-suite.log: found 7 matching files

Uploading artifacts to coordinator... ok
id=388139 responseStatus=201 Created token=4y7yS3--
ERROR: Job failed: exit code 1
failed
conda:python27 Nightly
make[1]: Leaving directory '/builds/adam-mercer/lalsuite/lalsuite-6.60/_build/sub'
make: *** [Makefile:611: distcheck] Error 1
Uploading artifacts...
config.log: found 1 matching files
*/config.log: found 9 matching files

WARNING: */test/test-suite.log: no matching files
*/*/*/*/test/test-suite.log: found 7 matching files

Uploading artifacts to coordinator... ok
id=388138 responseStatus=201 Created token=gCgwLuYX
ERROR: Job failed: exit code 1
failed
conda:python37 Nightly
make[1]: Leaving directory '/builds/adam-mercer/lalsuite/lalsuite-6.60/_build/sub'
make: *** [Makefile:611: distcheck] Error 1
Uploading artifacts...
config.log: found 1 matching files
*/config.log: found 9 matching files

WARNING: */test/test-suite.log: no matching files
*/*/*/*/test/test-suite.log: found 7 matching files

Uploading artifacts to coordinator... ok
id=388140 responseStatus=201 Created token=acj9xspc
ERROR: Job failed: exit code 1
failed
nightly:gcc:9 Nightly
Makefile:416: recipe for target 'check-recursive' failed
make[2]: *** [check-recursive] Error 1
make[2]: Leaving directory '/builds/adam-mercer/lalsuite/lalsuite-6.60/_build/sub'
make[1]: *** [check] Error 2
Makefile:690: recipe for target 'check' failed
make[1]: Leaving directory '/builds/adam-mercer/lalsuite/lalsuite-6.60/_build/sub'
Makefile:607: recipe for target 'distcheck' failed
make: *** [distcheck] Error 1
ERROR: Job failed: exit code 1
failed
nightly:ubuntu:xenial Nightly
make[2]: *** [all-recursive] Error 1
Makefile:416: recipe for target 'all-recursive' failed
make[2]: Leaving directory '/builds/adam-mercer/lalsuite/lalsuite-6.60/_build/sub'
Makefile:353: recipe for target 'all' failed
make[1]: Leaving directory '/builds/adam-mercer/lalsuite/lalsuite-6.60/_build/sub'
make[1]: *** [all] Error 2
Makefile:607: recipe for target 'distcheck' failed
make: *** [distcheck] Error 1
ERROR: Job failed: exit code 1
failed
nightly:debian:buster Nightly
make[4]: Leaving directory '/builds/adam-mercer/lalsuite/lalapps'
make[3]: *** [Makefile:744: distdir] Error 2
make[3]: Leaving directory '/builds/adam-mercer/lalsuite/lalapps'
make[2]: *** [Makefile:508: distdir-am] Error 1
make[2]: Leaving directory '/builds/adam-mercer/lalsuite'
make[1]: Leaving directory '/builds/adam-mercer/lalsuite'
make[1]: *** [Makefile:502: distdir] Error 2
make: *** [Makefile:603: dist] Error 2
ERROR: Job failed: exit code 1
failed
nightly:ubuntu:cosmic Nightly
make[4]: Leaving directory '/builds/adam-mercer/lalsuite/lalapps'
make[3]: *** [Makefile:744: distdir] Error 2
make[3]: Leaving directory '/builds/adam-mercer/lalsuite/lalapps'
make[2]: Leaving directory '/builds/adam-mercer/lalsuite'
make[2]: *** [Makefile:508: distdir-am] Error 1
make[1]: *** [Makefile:502: distdir] Error 2
make[1]: Leaving directory '/builds/adam-mercer/lalsuite'
make: *** [Makefile:603: dist] Error 2
ERROR: Job failed: exit code 1