top-level: mark as version 6.61

35 jobs for lalinference-point-release in 114 minutes and 20 seconds (queued for 6 seconds)
Status Job ID Name Coverage
  Level0
passed #392734
documentation

00:05:34

passed #392736
level0:deb:lal

00:24:36

passed #392735
level0:rpm:lal

00:10:52

 
  Level1
passed #392740
level1:deb:lalframe

00:04:59

passed #392741
level1:deb:lalmetaio

00:05:37

passed #392742
level1:deb:lalsimulation

00:13:22

passed #392737
level1:rpm:lalframe

00:02:40

passed #392738
level1:rpm:lalmetaio

00:02:48

passed #392739
level1:rpm:lalsimulation

00:05:10

 
  Level2
passed #392746
level2:deb:lalburst

00:03:44

passed #392747
level2:deb:lalinspiral

00:17:21

passed #392748
level2:deb:lalpulsar

00:16:51

passed #392743
level2:rpm:lalburst

00:02:27

passed #392744
level2:rpm:lalinspiral

00:07:48

passed #392745
level2:rpm:lalpulsar

00:08:10

 
  Level3
passed #392750
level3:deb:lalinference

00:08:10

passed #392749
level3:rpm:lalinference

00:06:44

 
  Level4
passed #392752
level4:deb:lalapps

00:11:54

passed #392751
level4:rpm:lalapps

00:06:47

 
  Nightly
failed #392759
allowed to fail
conda:python27

00:36:37

failed #392760
allowed to fail
conda:python36

00:37:28

failed #392761
allowed to fail
conda:python37

00:30:16

passed #392753
nightly:clang:7

00:38:30

passed #392754
nightly:clang:8

00:38:30

passed #392755
nightly:clang:9

00:38:50

failed #392762
allowed to fail
nightly:debian:buster

00:05:48

passed #392756
nightly:gcc:7

00:35:36

passed #392757
nightly:gcc:8

00:35:50

failed #392758
allowed to fail
nightly:gcc:9

00:22:15

passed #392764
macos_highsierra
nightly:macos:highsierra

00:26:28

passed #392765
macos_sierra
nightly:macos:sierra

00:27:07

passed #392763
nightly:rhel:el7-cr

00:36:32

passed #392767
nightly:ubuntu:bionic

00:36:25

failed #392768
allowed to fail
nightly:ubuntu:cosmic

00:06:18

failed #392766
allowed to fail
nightly:ubuntu:xenial

00:13:17

 
Name Stage Failure
failed
conda:python36 Nightly
make[1]: Leaving directory '/builds/adam-mercer/lalsuite/lalsuite-6.61/_build/sub'
make: *** [Makefile:611: distcheck] Error 1
Uploading artifacts...
config.log: found 1 matching files
*/config.log: found 9 matching files

WARNING: */test/test-suite.log: no matching files
*/*/*/*/test/test-suite.log: found 7 matching files

Uploading artifacts to coordinator... ok
id=392760 responseStatus=201 Created token=WzKCV6zz
ERROR: Job failed: exit code 1
failed
conda:python27 Nightly
make[1]: Leaving directory '/builds/adam-mercer/lalsuite/lalsuite-6.61/_build/sub'
make: *** [Makefile:611: distcheck] Error 1
Uploading artifacts...
config.log: found 1 matching files
*/config.log: found 9 matching files

WARNING: */test/test-suite.log: no matching files
*/*/*/*/test/test-suite.log: found 7 matching files

Uploading artifacts to coordinator... ok
id=392759 responseStatus=201 Created token=WfBcLrjQ
ERROR: Job failed: exit code 1
failed
conda:python37 Nightly
make[1]: Leaving directory '/builds/adam-mercer/lalsuite/lalsuite-6.61/_build/sub'
make: *** [Makefile:611: distcheck] Error 1
Uploading artifacts...
config.log: found 1 matching files
*/config.log: found 9 matching files

WARNING: */test/test-suite.log: no matching files
*/*/*/*/test/test-suite.log: found 7 matching files

Uploading artifacts to coordinator... ok
id=392761 responseStatus=201 Created token=ZVfatabN
ERROR: Job failed: exit code 1
failed
nightly:gcc:9 Nightly
Makefile:416: recipe for target 'check-recursive' failed
make[2]: Leaving directory '/builds/adam-mercer/lalsuite/lalsuite-6.61/_build/sub'
make[2]: *** [check-recursive] Error 1
Makefile:690: recipe for target 'check' failed
make[1]: Leaving directory '/builds/adam-mercer/lalsuite/lalsuite-6.61/_build/sub'
make[1]: *** [check] Error 2
Makefile:607: recipe for target 'distcheck' failed
make: *** [distcheck] Error 1
ERROR: Job failed: exit code 1
failed
nightly:ubuntu:xenial Nightly
make[2]: *** [all-recursive] Error 1
Makefile:416: recipe for target 'all-recursive' failed
make[2]: Leaving directory '/builds/adam-mercer/lalsuite/lalsuite-6.61/_build/sub'
Makefile:353: recipe for target 'all' failed
make[1]: *** [all] Error 2
make[1]: Leaving directory '/builds/adam-mercer/lalsuite/lalsuite-6.61/_build/sub'
Makefile:607: recipe for target 'distcheck' failed
make: *** [distcheck] Error 1
ERROR: Job failed: exit code 1
failed
nightly:ubuntu:cosmic Nightly
make[4]: Leaving directory '/builds/adam-mercer/lalsuite/lalapps'
make[3]: *** [Makefile:744: distdir] Error 2
make[3]: Leaving directory '/builds/adam-mercer/lalsuite/lalapps'
make[2]: Leaving directory '/builds/adam-mercer/lalsuite'
make[2]: *** [Makefile:508: distdir-am] Error 1
make[1]: *** [Makefile:502: distdir] Error 2
make[1]: Leaving directory '/builds/adam-mercer/lalsuite'
make: *** [Makefile:603: dist] Error 2
ERROR: Job failed: exit code 1
failed
nightly:debian:buster Nightly
make[4]: Leaving directory '/builds/adam-mercer/lalsuite/lalapps'
make[3]: *** [Makefile:744: distdir] Error 2
make[3]: Leaving directory '/builds/adam-mercer/lalsuite/lalapps'
make[2]: *** [Makefile:508: distdir-am] Error 1
make[2]: Leaving directory '/builds/adam-mercer/lalsuite'
make[1]: *** [Makefile:502: distdir] Error 2
make[1]: Leaving directory '/builds/adam-mercer/lalsuite'
make: *** [Makefile:603: dist] Error 2
ERROR: Job failed: exit code 1