LALSimNRHybSurUtilities: silence warnings about unused variables

32 jobs for fix-conda-warnings in 104 minutes and 57 seconds (queued for 4 seconds)
Status Job ID Name Coverage
  Level0
passed #425884
documentation

00:05:22

passed #425886
level0:deb:lal

00:22:52

passed #425885
level0:rpm:lal

00:11:56

 
  Level1
passed #425890
level1:deb:lalframe

00:04:40

passed #425891
level1:deb:lalmetaio

00:04:52

passed #425892
level1:deb:lalsimulation

00:12:33

passed #425887
level1:rpm:lalframe

00:03:14

passed #425888
level1:rpm:lalmetaio

00:03:18

passed #425889
level1:rpm:lalsimulation

00:05:56

 
  Level2
passed #425896
level2:deb:lalburst

00:03:24

passed #425897
level2:deb:lalinspiral

00:13:04

passed #425898
level2:deb:lalpulsar

00:15:42

passed #425893
level2:rpm:lalburst

00:03:06

passed #425894
level2:rpm:lalinspiral

00:07:09

passed #425895
level2:rpm:lalpulsar

00:08:01

 
  Level3
passed #425900
level3:deb:lalinference

00:07:42

passed #425899
level3:rpm:lalinference

00:06:43

 
  Level4
passed #425902
level4:deb:lalapps

00:10:51

passed #425901
level4:rpm:lalapps

00:06:31

 
  Nightly
failed #425909
allowed to fail
conda:python27

00:23:32

failed #425910
allowed to fail
conda:python36

00:27:44

failed #425911
allowed to fail
conda:python37

00:18:08

passed #425903
nightly:clang:7

00:35:02

passed #425904
nightly:clang:8

00:35:09

passed #425905
nightly:clang:9

00:35:00

failed #425912
allowed to fail
nightly:debian:buster

00:05:48

failed #425906
allowed to fail
nightly:gcc:7

00:18:44

failed #425907
allowed to fail
nightly:gcc:8

00:19:37

failed #425908
allowed to fail
nightly:gcc:9

00:20:01

passed #425914
macos_highsierra
nightly:macos:highsierra

00:34:38

passed #425915
macos_sierra
nightly:macos:sierra

00:29:21

failed #425913
allowed to fail
nightly:rhel:el7-cr

00:19:59

 
Name Stage Failure
failed
nightly:rhel:el7-cr Nightly
make[4]: Leaving directory `/builds/adam-mercer/lalsuite/lalsuite-6.62.1/_build/lal'
make[3]: *** [check] Error 2
make[3]: Leaving directory `/builds/adam-mercer/lalsuite/lalsuite-6.62.1/_build/lal'
make[2]: *** [check-recursive] Error 1
make[2]: Leaving directory `/builds/adam-mercer/lalsuite/lalsuite-6.62.1/_build'
make[1]: *** [check] Error 2
make[1]: Leaving directory `/builds/adam-mercer/lalsuite/lalsuite-6.62.1/_build'
make: *** [distcheck] Error 1
ERROR: Job failed: exit code 1
failed
conda:python37 Nightly
make[1]: Leaving directory '/builds/adam-mercer/lalsuite/lalsuite-6.62.1/_build/sub'
make: *** [Makefile:611: distcheck] Error 1
Uploading artifacts...
config.log: found 1 matching files
*/config.log: found 9 matching files

WARNING: */test/test-suite.log: no matching files
WARNING: */*/*/*/test/test-suite.log: no matching files
Uploading artifacts to coordinator... ok
id=425911 responseStatus=201 Created token=BYnxqgGy
ERROR: Job failed: exit code 1
failed
conda:python36 Nightly
make[1]: Leaving directory '/builds/adam-mercer/lalsuite/lalsuite-6.62.1/_build/sub'
make: *** [Makefile:611: distcheck] Error 1
Uploading artifacts...
config.log: found 1 matching files
*/config.log: found 9 matching files

WARNING: */test/test-suite.log: no matching files
WARNING: */*/*/*/test/test-suite.log: no matching files
Uploading artifacts to coordinator... ok
id=425910 responseStatus=201 Created token=EPn5Bhyq
ERROR: Job failed: exit code 1
failed
conda:python27 Nightly
make[1]: Leaving directory '/builds/adam-mercer/lalsuite/lalsuite-6.62.1/_build/sub'
make: *** [Makefile:611: distcheck] Error 1
Uploading artifacts...
config.log: found 1 matching files
*/config.log: found 9 matching files

WARNING: */test/test-suite.log: no matching files
WARNING: */*/*/*/test/test-suite.log: no matching files
Uploading artifacts to coordinator... ok
id=425909 responseStatus=201 Created token=zNxSvduK
ERROR: Job failed: exit code 1
failed
nightly:gcc:9 Nightly
make[2]: *** [check-recursive] Error 1
Makefile:416: recipe for target 'check-recursive' failed
make[2]: Leaving directory '/builds/adam-mercer/lalsuite/lalsuite-6.62.1/_build/sub'
make[1]: *** [check] Error 2
Makefile:690: recipe for target 'check' failed
make[1]: Leaving directory '/builds/adam-mercer/lalsuite/lalsuite-6.62.1/_build/sub'
Makefile:607: recipe for target 'distcheck' failed
make: *** [distcheck] Error 1
ERROR: Job failed: exit code 1
failed
nightly:gcc:8 Nightly
Makefile:416: recipe for target 'check-recursive' failed
make[2]: Leaving directory '/builds/adam-mercer/lalsuite/lalsuite-6.62.1/_build/sub'
make[2]: *** [check-recursive] Error 1
Makefile:690: recipe for target 'check' failed
make[1]: Leaving directory '/builds/adam-mercer/lalsuite/lalsuite-6.62.1/_build/sub'
make[1]: *** [check] Error 2
Makefile:607: recipe for target 'distcheck' failed
make: *** [distcheck] Error 1
ERROR: Job failed: exit code 1
failed
nightly:gcc:7 Nightly
make[2]: *** [check-recursive] Error 1
Makefile:416: recipe for target 'check-recursive' failed
make[2]: Leaving directory '/builds/adam-mercer/lalsuite/lalsuite-6.62.1/_build/sub'
Makefile:690: recipe for target 'check' failed
make[1]: *** [check] Error 2
make[1]: Leaving directory '/builds/adam-mercer/lalsuite/lalsuite-6.62.1/_build/sub'
make: *** [distcheck] Error 1
Makefile:607: recipe for target 'distcheck' failed
ERROR: Job failed: exit code 1
failed
nightly:debian:buster Nightly
make[4]: Leaving directory '/builds/adam-mercer/lalsuite/lalapps'
make[3]: *** [Makefile:740: distdir] Error 2
make[3]: Leaving directory '/builds/adam-mercer/lalsuite/lalapps'
make[2]: *** [Makefile:508: distdir-am] Error 1
make[2]: Leaving directory '/builds/adam-mercer/lalsuite'
make[1]: *** [Makefile:502: distdir] Error 2
make[1]: Leaving directory '/builds/adam-mercer/lalsuite'
make: *** [Makefile:603: dist] Error 2
ERROR: Job failed: exit code 1