allow clang builds to fail

32 jobs for ci-updates in 110 minutes and 43 seconds (queued for 4 seconds)
Status Job ID Name Coverage
  Level0
passed #441976
documentation

00:07:13

passed #441978
level0:deb:lal

00:27:19

passed #441977
level0:rpm:lal

00:12:27

 
  Level1
passed #441982
level1:deb:lalframe

00:06:39

passed #441983
level1:deb:lalmetaio

00:06:45

passed #441984
level1:deb:lalsimulation

00:15:26

passed #441979
level1:rpm:lalframe

00:04:37

passed #441980
level1:rpm:lalmetaio

00:04:32

passed #441981
level1:rpm:lalsimulation

00:07:12

 
  Level2
passed #441988
level2:deb:lalburst

00:05:12

passed #441989
level2:deb:lalinspiral

00:15:43

passed #441990
level2:deb:lalpulsar

00:18:45

passed #441985
level2:rpm:lalburst

00:03:45

passed #441986
level2:rpm:lalinspiral

00:08:16

passed #441987
level2:rpm:lalpulsar

00:10:17

 
  Level3
passed #441992
level3:deb:lalinference

00:08:35

passed #441991
level3:rpm:lalinference

00:07:46

 
  Level4
passed #441994
level4:deb:lalapps

00:12:06

passed #441993
level4:rpm:lalapps

00:07:30

 
  Nightly
failed #442001
allowed to fail
conda:python27

00:24:42

failed #442002
allowed to fail
conda:python36

00:28:20

failed #442003
allowed to fail
conda:python37

00:19:32

failed #441995
allowed to fail
nightly:clang:7

00:21:20

failed #441996
allowed to fail
nightly:clang:8

00:21:24

failed #441997
allowed to fail
nightly:clang:9

00:21:43

failed #442004
allowed to fail
nightly:debian:buster

00:04:52

failed #441998
allowed to fail
nightly:gcc:7

00:18:29

failed #441999
allowed to fail
nightly:gcc:8

00:19:10

failed #442000
allowed to fail
nightly:gcc:9

00:18:55

passed #442006
macos_highsierra
nightly:macos:highsierra

00:27:18

passed #442007
macos_sierra
nightly:macos:sierra

00:25:29

failed #442005
allowed to fail
nightly:rhel:el7-cr

00:19:00

 
Name Stage Failure
failed
conda:python36 Nightly
make: *** [Makefile:611: distcheck] Error 1
Uploading artifacts...
config.log: found 1 matching files
*/config.log: found 9 matching files

WARNING: */test/test-suite.log: no matching files
WARNING: */test/python/test-suite.log: no matching files
WARNING: */*/*/*/test/test-suite.log: no matching files
Uploading artifacts to coordinator... ok
id=442002 responseStatus=201 Created token=jkdfNJpz
ERROR: Job failed: exit code 1
failed
conda:python27 Nightly
make: *** [Makefile:611: distcheck] Error 1
Uploading artifacts...
config.log: found 1 matching files
*/config.log: found 9 matching files

WARNING: */test/test-suite.log: no matching files
WARNING: */test/python/test-suite.log: no matching files
WARNING: */*/*/*/test/test-suite.log: no matching files
Uploading artifacts to coordinator... ok
id=442001 responseStatus=201 Created token=3MFCMpcv
ERROR: Job failed: exit code 1
failed
nightly:clang:9 Nightly
Makefile:416: recipe for target 'check-recursive' failed
make[2]: *** [check-recursive] Error 1
make[2]: Leaving directory '/builds/adam-mercer/lalsuite/lalsuite-6.62.1/_build/sub'
Makefile:690: recipe for target 'check' failed
make[1]: Leaving directory '/builds/adam-mercer/lalsuite/lalsuite-6.62.1/_build/sub'
make[1]: *** [check] Error 2
make: *** [distcheck] Error 1
Makefile:607: recipe for target 'distcheck' failed
ERROR: Job failed: exit code 1
failed
nightly:clang:8 Nightly
make[2]: *** [check-recursive] Error 1
Makefile:416: recipe for target 'check-recursive' failed
make[2]: Leaving directory '/builds/adam-mercer/lalsuite/lalsuite-6.62.1/_build/sub'
Makefile:690: recipe for target 'check' failed
make[1]: Leaving directory '/builds/adam-mercer/lalsuite/lalsuite-6.62.1/_build/sub'
make[1]: *** [check] Error 2
Makefile:607: recipe for target 'distcheck' failed
make: *** [distcheck] Error 1
ERROR: Job failed: exit code 1
failed
nightly:clang:7 Nightly
Makefile:416: recipe for target 'check-recursive' failed
make[2]: Leaving directory '/builds/adam-mercer/lalsuite/lalsuite-6.62.1/_build/sub'
make[2]: *** [check-recursive] Error 1
make[1]: *** [check] Error 2
Makefile:690: recipe for target 'check' failed
make[1]: Leaving directory '/builds/adam-mercer/lalsuite/lalsuite-6.62.1/_build/sub'
Makefile:607: recipe for target 'distcheck' failed
make: *** [distcheck] Error 1
ERROR: Job failed: exit code 1
failed
conda:python37 Nightly
make: *** [Makefile:611: distcheck] Error 1
Uploading artifacts...
config.log: found 1 matching files
*/config.log: found 9 matching files

WARNING: */test/test-suite.log: no matching files
WARNING: */test/python/test-suite.log: no matching files
WARNING: */*/*/*/test/test-suite.log: no matching files
Uploading artifacts to coordinator... ok
id=442003 responseStatus=201 Created token=PJ6suRkS
ERROR: Job failed: exit code 1
failed
nightly:gcc:8 Nightly
Makefile:416: recipe for target 'check-recursive' failed
make[2]: Leaving directory '/builds/adam-mercer/lalsuite/lalsuite-6.62.1/_build/sub'
make[2]: *** [check-recursive] Error 1
Makefile:690: recipe for target 'check' failed
make[1]: *** [check] Error 2
make[1]: Leaving directory '/builds/adam-mercer/lalsuite/lalsuite-6.62.1/_build/sub'
Makefile:607: recipe for target 'distcheck' failed
make: *** [distcheck] Error 1
ERROR: Job failed: exit code 1
failed
nightly:rhel:el7-cr Nightly
make[4]: Leaving directory `/builds/adam-mercer/lalsuite/lalsuite-6.62.1/_build/lal'
make[3]: Leaving directory `/builds/adam-mercer/lalsuite/lalsuite-6.62.1/_build/lal'
make[3]: *** [check] Error 2
make[2]: *** [check-recursive] Error 1
make[2]: Leaving directory `/builds/adam-mercer/lalsuite/lalsuite-6.62.1/_build'
make[1]: *** [check] Error 2
make[1]: Leaving directory `/builds/adam-mercer/lalsuite/lalsuite-6.62.1/_build'
make: *** [distcheck] Error 1
ERROR: Job failed: exit code 1
failed
nightly:gcc:9 Nightly
make[2]: *** [check-recursive] Error 1
Makefile:416: recipe for target 'check-recursive' failed
make[2]: Leaving directory '/builds/adam-mercer/lalsuite/lalsuite-6.62.1/_build/sub'
Makefile:690: recipe for target 'check' failed
make[1]: *** [check] Error 2
make[1]: Leaving directory '/builds/adam-mercer/lalsuite/lalsuite-6.62.1/_build/sub'
make: *** [distcheck] Error 1
Makefile:607: recipe for target 'distcheck' failed
ERROR: Job failed: exit code 1
failed
nightly:gcc:7 Nightly
make[2]: *** [check-recursive] Error 1
Makefile:416: recipe for target 'check-recursive' failed
make[2]: Leaving directory '/builds/adam-mercer/lalsuite/lalsuite-6.62.1/_build/sub'
Makefile:690: recipe for target 'check' failed
make[1]: *** [check] Error 2
make[1]: Leaving directory '/builds/adam-mercer/lalsuite/lalsuite-6.62.1/_build/sub'
Makefile:607: recipe for target 'distcheck' failed
make: *** [distcheck] Error 1
ERROR: Job failed: exit code 1
failed
nightly:debian:buster Nightly
make[4]: Leaving directory '/builds/adam-mercer/lalsuite/lalapps'
make[3]: *** [Makefile:740: distdir] Error 2
make[3]: Leaving directory '/builds/adam-mercer/lalsuite/lalapps'
make[2]: Leaving directory '/builds/adam-mercer/lalsuite'
make[2]: *** [Makefile:508: distdir-am] Error 1
make[1]: *** [Makefile:502: distdir] Error 2
make[1]: Leaving directory '/builds/adam-mercer/lalsuite'
make: *** [Makefile:603: dist] Error 2
ERROR: Job failed: exit code 1