044EXmagNearDoor7Hzramp,1185915159,1185915378
045EXmagNearDoor51Hzramp,1185915159,1185915705
065EXmagOppositeDoor51Hzramp,1186334486,1186338178
065EXmagOppositeDoor7Hzramp,1186334486,1186338343
066EXmagEbayRacks7Hzramp,1186334486,1186338771
067EXmagEbayRacks51Hzramp,1186334486,1186339016