004-CSebay_Mag7p1ramp,1185724255,1185729112
014-CSoutput_Mag7p1ramp,1185724255,1185740678
016-CSoutput_Mag7p1ramp_100to1k,1185724255,1185740998
021-CSvertex_Mag7p1ramp,1185813184,1185816524
022-CSvertex_Mag7p1ramp_bp100to1k,1185813184,1185817312
058-CSinput_Mag7p1ramp,1186418770,1186419910
059-CSinput_Mag14p2rampBp,1186418770,1186420255
060-CSpsl_Mag14p2rampBp,1186418770,1186420659
061-CSpsl_Mag7p1ramp,1186418770,1186420926