024-EYmechdoor_Acou30to2k,1185821207,1185821911
025-EYmechdoor_Acou30to2k_x2,1185821207,1185822107
032-EYneardoor_Acou30to2k,1185821207,1185825354
033-EYneardoor_Acou30to2k_x2,1185821207,1185825515
034-EYebay_Acou30to2k,1185821207,1185826261
035-EYebay_Acou30to2k_x3,1185821207,1185826402
036-EYebay_Acou100to2k,1185821207,1185826607