\relax 
\providecommand\hyper@newdestlabel[2]{}
\@writefile{toc}{\contentsline {section}{\numberline {4}Regression tests}{12}{section.4}\protected@file@percent }
\newlabel{sec:reg_tests}{{4}{12}{Regression tests}{section.4}{}}
\@writefile{toc}{\contentsline {subsection}{\numberline {4.1}Source detection:\newline  unit\_testing.create.trigger\_comparison()}{12}{subsection.4.1}\protected@file@percent }
\newlabel{sec:trigger_comparison}{{4.1}{12}{Source detection:\newline unit\_testing.create.trigger\_comparison()}{subsection.4.1}{}}
\@writefile{toc}{\contentsline {subsection}{\numberline {4.2}Source localisation:\newline  unit\_testing.create.skymap\_comparison()}{12}{subsection.4.2}\protected@file@percent }
\newlabel{sec:skymap_comparison}{{4.2}{12}{Source localisation:\newline unit\_testing.create.skymap\_comparison()}{subsection.4.2}{}}
\@writefile{toc}{\contentsline {subsection}{\numberline {4.3}Template bank generation: \newline  unit\_testing.create.bank\_generation\_comparison()}{12}{subsection.4.3}\protected@file@percent }
\newlabel{sec:bg_comparison}{{4.3}{12}{Template bank generation: \newline unit\_testing.create.bank\_generation\_comparison()}{subsection.4.3}{}}
\@setckpt{sections/unittests}{
\setcounter{page}{14}
\setcounter{equation}{0}
\setcounter{enumi}{3}
\setcounter{enumii}{15}
\setcounter{enumiii}{0}
\setcounter{enumiv}{0}
\setcounter{footnote}{6}
\setcounter{mpfootnote}{0}
\setcounter{part}{0}
\setcounter{section}{4}
\setcounter{subsection}{3}
\setcounter{subsubsection}{0}
\setcounter{paragraph}{0}
\setcounter{subparagraph}{0}
\setcounter{figure}{0}
\setcounter{table}{0}
\setcounter{blindtext}{1}
\setcounter{Blindtext}{5}
\setcounter{blind@countparstart}{0}
\setcounter{blindlist}{0}
\setcounter{blindlistlevel}{0}
\setcounter{blindlist@level}{0}
\setcounter{blind@listcount}{0}
\setcounter{blind@levelcount}{0}
\setcounter{blind@randomcount}{0}
\setcounter{blind@randommax}{0}
\setcounter{blind@pangramcount}{0}
\setcounter{blind@pangrammax}{0}
\setcounter{lstnumber}{38}
\setcounter{Item}{39}
\setcounter{Hfootnote}{6}
\setcounter{bookmark@seq@number}{17}
\setcounter{LT@tables}{0}
\setcounter{LT@chunks}{0}
\setcounter{tcbbreakpart}{0}
\setcounter{tcblayer}{0}
\setcounter{tcbrastercolumn}{0}
\setcounter{tcbrasterrow}{0}
\setcounter{tcbraster}{0}
\setcounter{parentequation}{0}
\setcounter{tcblisting}{0}
\setcounter{lstlisting}{0}
\setcounter{section@level}{2}
}
