\relax 
\providecommand\hyper@newdestlabel[2]{}
\@writefile{toc}{\contentsline {section}{\numberline {F}Git workflow}{23}{appendix.F}\protected@file@percent }
\newlabel{sec:gitworkflow}{{F}{23}{Git workflow}{appendix.F}{}}
\@writefile{lof}{\contentsline {figure}{\numberline {3}{\ignorespaces Conceptual illustration of the branching workflow. New features are created in short-lived branches from \texttt  {master}{}. These branches live only a short time and are merged back to \texttt  {master}{} regularly. Periodically, LSC code reviews result in \texttt  {master}{} being merged into \texttt  {reviewed}.}}{24}{figure.3}\protected@file@percent }
\newlabel{fig:branchflow}{{3}{24}{Conceptual illustration of the branching workflow. New features are created in short-lived branches from \master {}. These branches live only a short time and are merged back to \master {} regularly. Periodically, LSC code reviews result in \master {} being merged into \texttt {reviewed}}{figure.3}{}}
\@writefile{toc}{\contentsline {subsection}{\numberline {F.1}Using \texttt  {git}{} and GitLab}{24}{subsection.F.1}\protected@file@percent }
\@setckpt{appendix/git_workflow}{
\setcounter{page}{27}
\setcounter{equation}{0}
\setcounter{enumi}{2}
\setcounter{enumii}{8}
\setcounter{enumiii}{5}
\setcounter{enumiv}{0}
\setcounter{footnote}{34}
\setcounter{mpfootnote}{0}
\setcounter{part}{0}
\setcounter{section}{6}
\setcounter{subsection}{1}
\setcounter{subsubsection}{0}
\setcounter{paragraph}{0}
\setcounter{subparagraph}{0}
\setcounter{figure}{3}
\setcounter{table}{0}
\setcounter{blindtext}{1}
\setcounter{Blindtext}{5}
\setcounter{blind@countparstart}{0}
\setcounter{blindlist}{0}
\setcounter{blindlistlevel}{0}
\setcounter{blindlist@level}{0}
\setcounter{blind@listcount}{0}
\setcounter{blind@levelcount}{0}
\setcounter{blind@randomcount}{0}
\setcounter{blind@randommax}{0}
\setcounter{blind@pangramcount}{0}
\setcounter{blind@pangrammax}{0}
\setcounter{lstnumber}{2}
\setcounter{Item}{74}
\setcounter{Hfootnote}{38}
\setcounter{bookmark@seq@number}{27}
\setcounter{LT@tables}{0}
\setcounter{LT@chunks}{0}
\setcounter{tcbbreakpart}{1}
\setcounter{tcblayer}{0}
\setcounter{tcbrastercolumn}{0}
\setcounter{tcbrasterrow}{0}
\setcounter{tcbraster}{0}
\setcounter{parentequation}{0}
\setcounter{tcblisting}{0}
\setcounter{lstlisting}{0}
\setcounter{section@level}{2}
}
