\relax 
\providecommand\hyper@newdestlabel[2]{}
\@writefile{toc}{\contentsline {section}{\numberline {A}bank\_utils}{14}{appendix.A}\protected@file@percent }
\newlabel{sec:bank_utils}{{A}{14}{bank\_utils}{appendix.A}{}}
\@writefile{toc}{\contentsline {subsection}{\numberline {A.1}create.py}{14}{subsection.A.1}\protected@file@percent }
\newlabel{sec:bank_utils_create}{{A.1}{14}{create.py}{subsection.A.1}{}}
\@writefile{toc}{\contentsline {subsubsection}{\numberline {A.1.1}err\_file\_information\_report}{14}{subsubsection.A.1.1}\protected@file@percent }
\newlabel{sec:bank_utils_err_file_information_report}{{A.1.1}{14}{err\_file\_information\_report}{subsubsection.A.1.1}{}}
\@writefile{lol}{\contentsline {lstlisting}{code\textunderscore documentation/bank\textunderscore utils/err\textunderscore file\textunderscore information\textunderscore report\textunderscore bank\textunderscore utils\textunderscore create.py}{14}{lstlisting.-7}\protected@file@percent }
\@writefile{toc}{\contentsline {subsubsection}{\numberline {A.1.2}select\_templates\_from\_full\_banks}{14}{subsubsection.A.1.2}\protected@file@percent }
\newlabel{sec:bank_utils_select_templates_from_full_banks}{{A.1.2}{14}{select\_templates\_from\_full\_banks}{subsubsection.A.1.2}{}}
\@writefile{lol}{\contentsline {lstlisting}{code\textunderscore documentation/bank\textunderscore utils/select\textunderscore templates\textunderscore from\textunderscore full\textunderscore banks\textunderscore bank\textunderscore utils\textunderscore create.py}{14}{lstlisting.-8}\protected@file@percent }
\@writefile{toc}{\contentsline {subsection}{\numberline {A.2}base.py}{15}{subsection.A.2}\protected@file@percent }
\newlabel{sec:bank_utils_base}{{A.2}{15}{base.py}{subsection.A.2}{}}
\@writefile{toc}{\contentsline {subsubsection}{\numberline {A.2.1}get\_approximant}{15}{subsubsection.A.2.1}\protected@file@percent }
\newlabel{sec:bank_utils_get_approximant}{{A.2.1}{15}{get\_approximant}{subsubsection.A.2.1}{}}
\@writefile{lol}{\contentsline {lstlisting}{code\textunderscore documentation/bank\textunderscore utils/get\textunderscore approximant\textunderscore bank\textunderscore utils\textunderscore base.py}{15}{lstlisting.-9}\protected@file@percent }
\@writefile{toc}{\contentsline {subsubsection}{\numberline {A.2.2}get\_num\_jobs}{15}{subsubsection.A.2.2}\protected@file@percent }
\newlabel{sec:bank_utils_get_num_jobs}{{A.2.2}{15}{get\_num\_jobs}{subsubsection.A.2.2}{}}
\@writefile{lol}{\contentsline {lstlisting}{code\textunderscore documentation/bank\textunderscore utils/get\textunderscore num\textunderscore jobs\textunderscore bank\textunderscore utils\textunderscore base.py}{15}{lstlisting.-10}\protected@file@percent }
\@writefile{toc}{\contentsline {subsubsection}{\numberline {A.2.3}extract\_job\_parameters\_from\_directory\_name}{15}{subsubsection.A.2.3}\protected@file@percent }
\newlabel{sec:bank_utils_extract_job_parameters_from_directory_name}{{A.2.3}{15}{extract\_job\_parameters\_from\_directory\_name}{subsubsection.A.2.3}{}}
\@writefile{lol}{\contentsline {lstlisting}{code\textunderscore documentation/bank\textunderscore utils/extract\textunderscore job\textunderscore parameters\textunderscore from\textunderscore directory\textunderscore name\textunderscore bank\textunderscore utils\textunderscore base.py}{15}{lstlisting.-11}\protected@file@percent }
\@writefile{toc}{\contentsline {subsubsection}{\numberline {A.2.4}write\_header\_for\_error\_status\_file}{15}{subsubsection.A.2.4}\protected@file@percent }
\newlabel{sec:bank_utils_write_header_for_error_status_file}{{A.2.4}{15}{write\_header\_for\_error\_status\_file}{subsubsection.A.2.4}{}}
\@writefile{lol}{\contentsline {lstlisting}{code\textunderscore documentation/bank\textunderscore utils/write\textunderscore header\textunderscore for\textunderscore error\textunderscore status\textunderscore file\textunderscore bank\textunderscore utils\textunderscore base.py}{15}{lstlisting.-12}\protected@file@percent }
\@writefile{toc}{\contentsline {subsubsection}{\numberline {A.2.5}parse\_relevant\_err\_file\_line}{16}{subsubsection.A.2.5}\protected@file@percent }
\newlabel{sec:bank_utils_parse_relevant_err_file_line}{{A.2.5}{16}{parse\_relevant\_err\_file\_line}{subsubsection.A.2.5}{}}
\@writefile{lol}{\contentsline {lstlisting}{code\textunderscore documentation/bank\textunderscore utils/parse\textunderscore relevant\textunderscore err\textunderscore file\textunderscore line\textunderscore bank\textunderscore utils\textunderscore base.py}{16}{lstlisting.-13}\protected@file@percent }
\@writefile{toc}{\contentsline {subsubsection}{\numberline {A.2.6}create\_err\_status\_file}{16}{subsubsection.A.2.6}\protected@file@percent }
\newlabel{sec:bank_utils_create_err_status_file}{{A.2.6}{16}{create\_err\_status\_file}{subsubsection.A.2.6}{}}
\@writefile{lol}{\contentsline {lstlisting}{code\textunderscore documentation/bank\textunderscore utils/create\textunderscore err\textunderscore status\textunderscore file\textunderscore bank\textunderscore utils\textunderscore base.py}{16}{lstlisting.-14}\protected@file@percent }
\@writefile{toc}{\contentsline {subsubsection}{\numberline {A.2.7}create\_single\_bank\_report\_file}{16}{subsubsection.A.2.7}\protected@file@percent }
\newlabel{sec:bank_utils_create_single_bank_report_file}{{A.2.7}{16}{create\_single\_bank\_report\_file}{subsubsection.A.2.7}{}}
\@writefile{lol}{\contentsline {lstlisting}{code\textunderscore documentation/bank\textunderscore utils/create\textunderscore single\textunderscore bank\textunderscore report\textunderscore file\textunderscore bank\textunderscore utils\textunderscore base.py}{16}{lstlisting.-15}\protected@file@percent }
\@writefile{toc}{\contentsline {subsubsection}{\numberline {A.2.8}get\_bank\_object}{17}{subsubsection.A.2.8}\protected@file@percent }
\newlabel{sec:bank_utils_get_bank_object}{{A.2.8}{17}{get\_bank\_object}{subsubsection.A.2.8}{}}
\@writefile{lol}{\contentsline {lstlisting}{code\textunderscore documentation/bank\textunderscore utils/get\textunderscore bank\textunderscore object\textunderscore bank\textunderscore utils\textunderscore base.py}{17}{lstlisting.-16}\protected@file@percent }
\@writefile{toc}{\contentsline {subsubsection}{\numberline {A.2.9}get\_single\_template\_parameters\_from\_bank\_object}{17}{subsubsection.A.2.9}\protected@file@percent }
\newlabel{sec:bank_utils_get_single_template_parameters_from_bank_object}{{A.2.9}{17}{get\_single\_template\_parameters\_from\_bank\_object}{subsubsection.A.2.9}{}}
\@writefile{lol}{\contentsline {lstlisting}{code\textunderscore documentation/bank\textunderscore utils/get\textunderscore single\textunderscore template\textunderscore parameters\textunderscore from\textunderscore bank\textunderscore object\textunderscore bank\textunderscore utils\textunderscore base.py}{17}{lstlisting.-17}\protected@file@percent }
\@writefile{toc}{\contentsline {subsubsection}{\numberline {A.2.10}compare\_template\_parameters}{17}{subsubsection.A.2.10}\protected@file@percent }
\newlabel{sec:bank_utils_compare_template_parameters}{{A.2.10}{17}{compare\_template\_parameters}{subsubsection.A.2.10}{}}
\@writefile{lol}{\contentsline {lstlisting}{code\textunderscore documentation/bank\textunderscore utils/compare\textunderscore template\textunderscore parameters\textunderscore bank\textunderscore utils\textunderscore base.py}{17}{lstlisting.-18}\protected@file@percent }
\@writefile{toc}{\contentsline {subsubsection}{\numberline {A.2.11}get\_reference\_bank\_object}{17}{subsubsection.A.2.11}\protected@file@percent }
\newlabel{sec:bank_utils_get_reference_bank_object}{{A.2.11}{17}{get\_reference\_bank\_object}{subsubsection.A.2.11}{}}
\@writefile{lol}{\contentsline {lstlisting}{code\textunderscore documentation/bank\textunderscore utils/get\textunderscore reference\textunderscore bank\textunderscore object\textunderscore bank\textunderscore utils\textunderscore base.py}{17}{lstlisting.-19}\protected@file@percent }
\@writefile{toc}{\contentsline {subsubsection}{\numberline {A.2.12}make\_dictionary}{18}{subsubsection.A.2.12}\protected@file@percent }
\newlabel{sec:bank_utils_make_dictionary}{{A.2.12}{18}{make\_dictionary}{subsubsection.A.2.12}{}}
\@writefile{lol}{\contentsline {lstlisting}{code\textunderscore documentation/bank\textunderscore utils/make\textunderscore dictionary\textunderscore bank\textunderscore utils\textunderscore base.py}{18}{lstlisting.-20}\protected@file@percent }
\@writefile{toc}{\contentsline {section}{\numberline {B}postprocess\_utils}{18}{appendix.B}\protected@file@percent }
\newlabel{sec:postprocess_utils}{{B}{18}{postprocess\_utils}{appendix.B}{}}
\@writefile{toc}{\contentsline {subsection}{\numberline {B.1}create.py}{18}{subsection.B.1}\protected@file@percent }
\newlabel{sec:postprocess_utils_create}{{B.1}{18}{create.py}{subsection.B.1}{}}
\@writefile{toc}{\contentsline {subsubsection}{\numberline {B.1.1}combined\_dataframe\_from\_xml\_files}{18}{subsubsection.B.1.1}\protected@file@percent }
\newlabel{sec:postprocess_utils_combined_dataframe_from_xml_files}{{B.1.1}{18}{combined\_dataframe\_from\_xml\_files}{subsubsection.B.1.1}{}}
\@writefile{lol}{\contentsline {lstlisting}{code\textunderscore documentation/postprocess\textunderscore utils/combined\textunderscore dataframe\textunderscore from\textunderscore xml\textunderscore files\textunderscore postprocess\textunderscore utils\textunderscore create.py}{18}{lstlisting.-21}\protected@file@percent }
\@writefile{toc}{\contentsline {subsubsection}{\numberline {B.1.2}csv\_file\_from\_parsed\_command\_line\_arguments}{19}{subsubsection.B.1.2}\protected@file@percent }
\newlabel{sec:postprocess_utils_csv_file_from_parsed_command_line_arguments}{{B.1.2}{19}{csv\_file\_from\_parsed\_command\_line\_arguments}{subsubsection.B.1.2}{}}
\@writefile{lol}{\contentsline {lstlisting}{code\textunderscore documentation/postprocess\textunderscore utils/csv\textunderscore file\textunderscore from\textunderscore parsed\textunderscore command\textunderscore line\textunderscore arguments\textunderscore postprocess\textunderscore utils\textunderscore create.py}{19}{lstlisting.-22}\protected@file@percent }
\@writefile{toc}{\contentsline {subsection}{\numberline {B.2}base.py}{19}{subsection.B.2}\protected@file@percent }
\newlabel{sec:postprocess_utils_base}{{B.2}{19}{base.py}{subsection.B.2}{}}
\@writefile{toc}{\contentsline {subsubsection}{\numberline {B.2.1}use\_ligolw\_to\_extract\_parameters}{19}{subsubsection.B.2.1}\protected@file@percent }
\newlabel{sec:postprocess_utils_use_ligolw_to_extract_parameters}{{B.2.1}{19}{use\_ligolw\_to\_extract\_parameters}{subsubsection.B.2.1}{}}
\@writefile{lol}{\contentsline {lstlisting}{code\textunderscore documentation/postprocess\textunderscore utils/use\textunderscore ligolw\textunderscore to\textunderscore extract\textunderscore parameters\textunderscore postprocess\textunderscore utils\textunderscore base.py}{19}{lstlisting.-23}\protected@file@percent }
\@writefile{toc}{\contentsline {subsubsection}{\numberline {B.2.2}get\_line\_elements}{19}{subsubsection.B.2.2}\protected@file@percent }
\newlabel{sec:postprocess_utils_get_line_elements}{{B.2.2}{19}{get\_line\_elements}{subsubsection.B.2.2}{}}
\@writefile{lol}{\contentsline {lstlisting}{code\textunderscore documentation/postprocess\textunderscore utils/get\textunderscore line\textunderscore elements\textunderscore postprocess\textunderscore utils\textunderscore base.py}{19}{lstlisting.-24}\protected@file@percent }
\@writefile{toc}{\contentsline {subsubsection}{\numberline {B.2.3}get\_all\_variable\_flags}{20}{subsubsection.B.2.3}\protected@file@percent }
\newlabel{sec:postprocess_utils_get_all_variable_flags}{{B.2.3}{20}{get\_all\_variable\_flags}{subsubsection.B.2.3}{}}
\@writefile{lol}{\contentsline {lstlisting}{code\textunderscore documentation/postprocess\textunderscore utils/get\textunderscore all\textunderscore variable\textunderscore flags\textunderscore postprocess\textunderscore utils\textunderscore base.py}{20}{lstlisting.-25}\protected@file@percent }
\@writefile{toc}{\contentsline {subsubsection}{\numberline {B.2.4}get\_output\_string}{20}{subsubsection.B.2.4}\protected@file@percent }
\newlabel{sec:postprocess_utils_get_output_string}{{B.2.4}{20}{get\_output\_string}{subsubsection.B.2.4}{}}
\@writefile{lol}{\contentsline {lstlisting}{code\textunderscore documentation/postprocess\textunderscore utils/get\textunderscore output\textunderscore string\textunderscore postprocess\textunderscore utils\textunderscore base.py}{20}{lstlisting.-26}\protected@file@percent }
\@writefile{toc}{\contentsline {section}{\numberline {C}db\_utils}{20}{appendix.C}\protected@file@percent }
\newlabel{sec:db_utils}{{C}{20}{db\_utils}{appendix.C}{}}
\@writefile{toc}{\contentsline {subsection}{\numberline {C.1}base.py}{20}{subsection.C.1}\protected@file@percent }
\newlabel{sec:db_utils_base}{{C.1}{20}{base.py}{subsection.C.1}{}}
\@writefile{toc}{\contentsline {subsubsection}{\numberline {C.1.1}get\_current\_time\_string}{20}{subsubsection.C.1.1}\protected@file@percent }
\newlabel{sec:db_utils_get_current_time_string}{{C.1.1}{20}{get\_current\_time\_string}{subsubsection.C.1.1}{}}
\@writefile{lol}{\contentsline {lstlisting}{code\textunderscore documentation/db\textunderscore utils/get\textunderscore current\textunderscore time\textunderscore string\textunderscore db\textunderscore utils\textunderscore base.py}{20}{lstlisting.-27}\protected@file@percent }
\@writefile{toc}{\contentsline {subsubsection}{\numberline {C.1.2}get\_GraceDB\_client}{20}{subsubsection.C.1.2}\protected@file@percent }
\newlabel{sec:db_utils_get_GraceDB_client}{{C.1.2}{20}{get\_GraceDB\_client}{subsubsection.C.1.2}{}}
\@writefile{lol}{\contentsline {lstlisting}{code\textunderscore documentation/db\textunderscore utils/get\textunderscore GraceDB\textunderscore client\textunderscore db\textunderscore utils\textunderscore base.py}{20}{lstlisting.-28}\protected@file@percent }
\@writefile{toc}{\contentsline {subsubsection}{\numberline {C.1.3}clean\_gracedb\_row}{20}{subsubsection.C.1.3}\protected@file@percent }
\newlabel{sec:db_utils_clean_gracedb_row}{{C.1.3}{20}{clean\_gracedb\_row}{subsubsection.C.1.3}{}}
\@writefile{lol}{\contentsline {lstlisting}{code\textunderscore documentation/db\textunderscore utils/clean\textunderscore gracedb\textunderscore row\textunderscore db\textunderscore utils\textunderscore base.py}{21}{lstlisting.-29}\protected@file@percent }
\@writefile{toc}{\contentsline {subsubsection}{\numberline {C.1.4}get\_event\_df}{21}{subsubsection.C.1.4}\protected@file@percent }
\newlabel{sec:db_utils_get_event_df}{{C.1.4}{21}{get\_event\_df}{subsubsection.C.1.4}{}}
\@writefile{lol}{\contentsline {lstlisting}{code\textunderscore documentation/db\textunderscore utils/get\textunderscore event\textunderscore df\textunderscore db\textunderscore utils\textunderscore base.py}{21}{lstlisting.-30}\protected@file@percent }
\@writefile{toc}{\contentsline {subsubsection}{\numberline {C.1.5}get\_autocorr\_and\_latency}{21}{subsubsection.C.1.5}\protected@file@percent }
\newlabel{sec:db_utils_get_autocorr_and_latency}{{C.1.5}{21}{get\_autocorr\_and\_latency}{subsubsection.C.1.5}{}}
\@writefile{lol}{\contentsline {lstlisting}{code\textunderscore documentation/db\textunderscore utils/get\textunderscore autocorr\textunderscore and\textunderscore latency\textunderscore db\textunderscore utils\textunderscore base.py}{21}{lstlisting.-31}\protected@file@percent }
\@writefile{toc}{\contentsline {subsection}{\numberline {C.2}GwdcDb.py}{22}{subsection.C.2}\protected@file@percent }
\newlabel{sec:db_utils_GwdcDb}{{C.2}{22}{GwdcDb.py}{subsection.C.2}{}}
\@writefile{toc}{\contentsline {section}{\numberline {D}plot\_utils}{22}{appendix.D}\protected@file@percent }
\newlabel{sec:plot_utils}{{D}{22}{plot\_utils}{appendix.D}{}}
\@writefile{toc}{\contentsline {subsection}{\numberline {D.1}create.py}{22}{subsection.D.1}\protected@file@percent }
\newlabel{sec:plot_utils_create}{{D.1}{22}{create.py}{subsection.D.1}{}}
\@writefile{toc}{\contentsline {subsubsection}{\numberline {D.1.1}heatmap\_plot}{22}{subsubsection.D.1.1}\protected@file@percent }
\newlabel{sec:plot_utils_heatmap_plot}{{D.1.1}{22}{heatmap\_plot}{subsubsection.D.1.1}{}}
\@writefile{lol}{\contentsline {lstlisting}{code\textunderscore documentation/plot\textunderscore utils/heatmap\textunderscore plot\textunderscore plot\textunderscore utils\textunderscore create.py}{22}{lstlisting.-32}\protected@file@percent }
\@writefile{toc}{\contentsline {subsubsection}{\numberline {D.1.2}scatter\_plot\_2hist}{22}{subsubsection.D.1.2}\protected@file@percent }
\newlabel{sec:plot_utils_scatter_plot_2hist}{{D.1.2}{22}{scatter\_plot\_2hist}{subsubsection.D.1.2}{}}
\@writefile{lol}{\contentsline {lstlisting}{code\textunderscore documentation/plot\textunderscore utils/scatter\textunderscore plot\textunderscore 2hist\textunderscore plot\textunderscore utils\textunderscore create.py}{22}{lstlisting.-33}\protected@file@percent }
\@writefile{toc}{\contentsline {subsubsection}{\numberline {D.1.3}scatter\_plot}{23}{subsubsection.D.1.3}\protected@file@percent }
\newlabel{sec:plot_utils_scatter_plot}{{D.1.3}{23}{scatter\_plot}{subsubsection.D.1.3}{}}
\@writefile{lol}{\contentsline {lstlisting}{code\textunderscore documentation/plot\textunderscore utils/scatter\textunderscore plot\textunderscore plot\textunderscore utils\textunderscore create.py}{23}{lstlisting.-34}\protected@file@percent }
\@writefile{toc}{\contentsline {subsection}{\numberline {D.2}base.py}{24}{subsection.D.2}\protected@file@percent }
\newlabel{sec:plot_utils_base}{{D.2}{24}{base.py}{subsection.D.2}{}}
\@writefile{toc}{\contentsline {section}{\numberline {E}unit\_testing}{24}{appendix.E}\protected@file@percent }
\newlabel{sec:unit_testing}{{E}{24}{unit\_testing}{appendix.E}{}}
\@writefile{toc}{\contentsline {subsection}{\numberline {E.1}create.py}{24}{subsection.E.1}\protected@file@percent }
\newlabel{sec:unit_testing_create}{{E.1}{24}{create.py}{subsection.E.1}{}}
\@writefile{toc}{\contentsline {subsubsection}{\numberline {E.1.1}trigger\_comparison}{24}{subsubsection.E.1.1}\protected@file@percent }
\newlabel{sec:unit_testing_trigger_comparison}{{E.1.1}{24}{trigger\_comparison}{subsubsection.E.1.1}{}}
\@writefile{lol}{\contentsline {lstlisting}{code\textunderscore documentation/unit\textunderscore testing/trigger\textunderscore comparison\textunderscore unit\textunderscore testing\textunderscore create.py}{24}{lstlisting.-35}\protected@file@percent }
\@writefile{toc}{\contentsline {subsubsection}{\numberline {E.1.2}skymap\_comparison}{24}{subsubsection.E.1.2}\protected@file@percent }
\newlabel{sec:unit_testing_skymap_comparison}{{E.1.2}{24}{skymap\_comparison}{subsubsection.E.1.2}{}}
\@writefile{lol}{\contentsline {lstlisting}{code\textunderscore documentation/unit\textunderscore testing/skymap\textunderscore comparison\textunderscore unit\textunderscore testing\textunderscore create.py}{24}{lstlisting.-36}\protected@file@percent }
\@writefile{toc}{\contentsline {subsubsection}{\numberline {E.1.3}bank\_generation\_comparison}{24}{subsubsection.E.1.3}\protected@file@percent }
\newlabel{sec:unit_testing_bank_generation_comparison}{{E.1.3}{24}{bank\_generation\_comparison}{subsubsection.E.1.3}{}}
\@writefile{lol}{\contentsline {lstlisting}{code\textunderscore documentation/unit\textunderscore testing/bank\textunderscore generation\textunderscore comparison\textunderscore unit\textunderscore testing\textunderscore create.py}{24}{lstlisting.-37}\protected@file@percent }
\@writefile{toc}{\contentsline {subsection}{\numberline {E.2}base.py}{25}{subsection.E.2}\protected@file@percent }
\newlabel{sec:unit_testing_base}{{E.2}{25}{base.py}{subsection.E.2}{}}
\@writefile{toc}{\contentsline {subsubsection}{\numberline {E.2.1}append\_line\_to\_file}{25}{subsubsection.E.2.1}\protected@file@percent }
\newlabel{sec:unit_testing_append_line_to_file}{{E.2.1}{25}{append\_line\_to\_file}{subsubsection.E.2.1}{}}
\@writefile{lol}{\contentsline {lstlisting}{code\textunderscore documentation/unit\textunderscore testing/append\textunderscore line\textunderscore to\textunderscore file\textunderscore unit\textunderscore testing\textunderscore base.py}{25}{lstlisting.-38}\protected@file@percent }
\@writefile{toc}{\contentsline {subsubsection}{\numberline {E.2.2}append\_line\_to\_fh}{25}{subsubsection.E.2.2}\protected@file@percent }
\newlabel{sec:unit_testing_append_line_to_fh}{{E.2.2}{25}{append\_line\_to\_fh}{subsubsection.E.2.2}{}}
\@writefile{lol}{\contentsline {lstlisting}{code\textunderscore documentation/unit\textunderscore testing/append\textunderscore line\textunderscore to\textunderscore fh\textunderscore unit\textunderscore testing\textunderscore base.py}{25}{lstlisting.-39}\protected@file@percent }
\@writefile{toc}{\contentsline {subsubsection}{\numberline {E.2.3}record\_machine\_info\_to\_fh}{25}{subsubsection.E.2.3}\protected@file@percent }
\newlabel{sec:unit_testing_record_machine_info_to_fh}{{E.2.3}{25}{record\_machine\_info\_to\_fh}{subsubsection.E.2.3}{}}
\@writefile{lol}{\contentsline {lstlisting}{code\textunderscore documentation/unit\textunderscore testing/record\textunderscore machine\textunderscore info\textunderscore to\textunderscore fh\textunderscore unit\textunderscore testing\textunderscore base.py}{25}{lstlisting.-40}\protected@file@percent }
\@writefile{toc}{\contentsline {subsubsection}{\numberline {E.2.4}images\_similar}{25}{subsubsection.E.2.4}\protected@file@percent }
\newlabel{sec:unit_testing_images_similar}{{E.2.4}{25}{images\_similar}{subsubsection.E.2.4}{}}
\@writefile{lol}{\contentsline {lstlisting}{code\textunderscore documentation/unit\textunderscore testing/images\textunderscore similar\textunderscore unit\textunderscore testing\textunderscore base.py}{26}{lstlisting.-41}\protected@file@percent }
\@writefile{toc}{\contentsline {subsubsection}{\numberline {E.2.5}get\_uid}{26}{subsubsection.E.2.5}\protected@file@percent }
\newlabel{sec:unit_testing_get_uid}{{E.2.5}{26}{get\_uid}{subsubsection.E.2.5}{}}
\@writefile{lol}{\contentsline {lstlisting}{code\textunderscore documentation/unit\textunderscore testing/get\textunderscore uid\textunderscore unit\textunderscore testing\textunderscore base.py}{26}{lstlisting.-42}\protected@file@percent }
\@writefile{toc}{\contentsline {subsubsection}{\numberline {E.2.6}get\_gid}{26}{subsubsection.E.2.6}\protected@file@percent }
\newlabel{sec:unit_testing_get_gid}{{E.2.6}{26}{get\_gid}{subsubsection.E.2.6}{}}
\@writefile{lol}{\contentsline {lstlisting}{code\textunderscore documentation/unit\textunderscore testing/get\textunderscore gid\textunderscore unit\textunderscore testing\textunderscore base.py}{26}{lstlisting.-43}\protected@file@percent }
\@writefile{toc}{\contentsline {subsubsection}{\numberline {E.2.7}get\_user}{26}{subsubsection.E.2.7}\protected@file@percent }
\newlabel{sec:unit_testing_get_user}{{E.2.7}{26}{get\_user}{subsubsection.E.2.7}{}}
\@writefile{lol}{\contentsline {lstlisting}{code\textunderscore documentation/unit\textunderscore testing/get\textunderscore user\textunderscore unit\textunderscore testing\textunderscore base.py}{26}{lstlisting.-44}\protected@file@percent }
\@writefile{toc}{\contentsline {subsubsection}{\numberline {E.2.8}get\_group}{26}{subsubsection.E.2.8}\protected@file@percent }
\newlabel{sec:unit_testing_get_group}{{E.2.8}{26}{get\_group}{subsubsection.E.2.8}{}}
\@writefile{lol}{\contentsline {lstlisting}{code\textunderscore documentation/unit\textunderscore testing/get\textunderscore group\textunderscore unit\textunderscore testing\textunderscore base.py}{26}{lstlisting.-45}\protected@file@percent }
\@writefile{toc}{\contentsline {subsubsection}{\numberline {E.2.9}get\_current\_time\_string}{26}{subsubsection.E.2.9}\protected@file@percent }
\newlabel{sec:unit_testing_get_current_time_string}{{E.2.9}{26}{get\_current\_time\_string}{subsubsection.E.2.9}{}}
\@writefile{lol}{\contentsline {lstlisting}{code\textunderscore documentation/unit\textunderscore testing/get\textunderscore current\textunderscore time\textunderscore string\textunderscore unit\textunderscore testing\textunderscore base.py}{26}{lstlisting.-46}\protected@file@percent }
\@writefile{toc}{\contentsline {subsubsection}{\numberline {E.2.10}compare\_zerolag\_trigger\_files}{26}{subsubsection.E.2.10}\protected@file@percent }
\newlabel{sec:unit_testing_compare_zerolag_trigger_files}{{E.2.10}{26}{compare\_zerolag\_trigger\_files}{subsubsection.E.2.10}{}}
\@writefile{lol}{\contentsline {lstlisting}{code\textunderscore documentation/unit\textunderscore testing/compare\textunderscore zerolag\textunderscore trigger\textunderscore files\textunderscore unit\textunderscore testing\textunderscore base.py}{26}{lstlisting.-47}\protected@file@percent }
\@writefile{toc}{\contentsline {subsubsection}{\numberline {E.2.11}write\_submission\_script}{27}{subsubsection.E.2.11}\protected@file@percent }
\newlabel{sec:unit_testing_write_submission_script}{{E.2.11}{27}{write\_submission\_script}{subsubsection.E.2.11}{}}
\@writefile{lol}{\contentsline {lstlisting}{code\textunderscore documentation/unit\textunderscore testing/write\textunderscore submission\textunderscore script\textunderscore unit\textunderscore testing\textunderscore base.py}{27}{lstlisting.-48}\protected@file@percent }
\@writefile{toc}{\contentsline {subsubsection}{\numberline {E.2.12}compare\_bank\_template}{27}{subsubsection.E.2.12}\protected@file@percent }
\newlabel{sec:unit_testing_compare_bank_template}{{E.2.12}{27}{compare\_bank\_template}{subsubsection.E.2.12}{}}
\@writefile{lol}{\contentsline {lstlisting}{code\textunderscore documentation/unit\textunderscore testing/compare\textunderscore bank\textunderscore template\textunderscore unit\textunderscore testing\textunderscore base.py}{27}{lstlisting.-49}\protected@file@percent }
\@writefile{toc}{\contentsline {subsubsection}{\numberline {E.2.13}compare\_full\_banks}{27}{subsubsection.E.2.13}\protected@file@percent }
\newlabel{sec:unit_testing_compare_full_banks}{{E.2.13}{27}{compare\_full\_banks}{subsubsection.E.2.13}{}}
\@writefile{lol}{\contentsline {lstlisting}{code\textunderscore documentation/unit\textunderscore testing/compare\textunderscore full\textunderscore banks\textunderscore unit\textunderscore testing\textunderscore base.py}{27}{lstlisting.-50}\protected@file@percent }
\@writefile{toc}{\contentsline {subsubsection}{\numberline {E.2.14}write\_output\_file\_for\_bank\_comparison}{28}{subsubsection.E.2.14}\protected@file@percent }
\newlabel{sec:unit_testing_write_output_file_for_bank_comparison}{{E.2.14}{28}{write\_output\_file\_for\_bank\_comparison}{subsubsection.E.2.14}{}}
\@writefile{lol}{\contentsline {lstlisting}{code\textunderscore documentation/unit\textunderscore testing/write\textunderscore output\textunderscore file\textunderscore for\textunderscore bank\textunderscore comparison\textunderscore unit\textunderscore testing\textunderscore base.py}{28}{lstlisting.-51}\protected@file@percent }
\@setckpt{code_documentation/documentation}{
\setcounter{page}{29}
\setcounter{equation}{0}
\setcounter{enumi}{3}
\setcounter{enumii}{15}
\setcounter{enumiii}{0}
\setcounter{enumiv}{0}
\setcounter{footnote}{6}
\setcounter{mpfootnote}{0}
\setcounter{part}{0}
\setcounter{section}{5}
\setcounter{subsection}{2}
\setcounter{subsubsection}{14}
\setcounter{paragraph}{0}
\setcounter{subparagraph}{0}
\setcounter{figure}{0}
\setcounter{table}{0}
\setcounter{blindtext}{1}
\setcounter{Blindtext}{5}
\setcounter{blind@countparstart}{0}
\setcounter{blindlist}{0}
\setcounter{blindlistlevel}{0}
\setcounter{blindlist@level}{0}
\setcounter{blind@listcount}{0}
\setcounter{blind@levelcount}{0}
\setcounter{blind@randomcount}{0}
\setcounter{blind@randommax}{0}
\setcounter{blind@pangramcount}{0}
\setcounter{blind@pangrammax}{0}
\setcounter{lstnumber}{13}
\setcounter{Item}{39}
\setcounter{Hfootnote}{6}
\setcounter{bookmark@seq@number}{77}
\setcounter{LT@tables}{0}
\setcounter{LT@chunks}{0}
\setcounter{tcbbreakpart}{0}
\setcounter{tcblayer}{0}
\setcounter{tcbrastercolumn}{0}
\setcounter{tcbrasterrow}{0}
\setcounter{tcbraster}{0}
\setcounter{parentequation}{0}
\setcounter{tcblisting}{0}
\setcounter{lstlisting}{0}
\setcounter{section@level}{3}
}
