<?xml version="1.0" encoding="UTF-8" standalone="no"?>
<!-- Created with Inkscape (http://www.inkscape.org/) -->

<svg
   xmlns:dc="http://purl.org/dc/elements/1.1/"
   xmlns:cc="http://creativecommons.org/ns#"
   xmlns:rdf="http://www.w3.org/1999/02/22-rdf-syntax-ns#"
   xmlns:svg="http://www.w3.org/2000/svg"
   xmlns="http://www.w3.org/2000/svg"
   xmlns:sodipodi="http://sodipodi.sourceforge.net/DTD/sodipodi-0.dtd"
   xmlns:inkscape="http://www.inkscape.org/namespaces/inkscape"
   width="210mm"
   height="297mm"
   viewBox="0 0 210 297"
   version="1.1"
   id="svg4873"
   inkscape:version="0.92.4 (5da689c313, 2019-01-14)"
   sodipodi:docname="after_rebase.svg">
  <defs
     id="defs4867" />
  <sodipodi:namedview
     id="base"
     pagecolor="#ffffff"
     bordercolor="#666666"
     borderopacity="1.0"
     inkscape:pageopacity="0.0"
     inkscape:pageshadow="2"
     inkscape:zoom="0.98994949"
     inkscape:cx="532.36503"
     inkscape:cy="1141.1819"
     inkscape:document-units="mm"
     inkscape:current-layer="layer1"
     showgrid="false"
     inkscape:window-width="1920"
     inkscape:window-height="1007"
     inkscape:window-x="0"
     inkscape:window-y="0"
     inkscape:window-maximized="1" />
  <metadata
     id="metadata4870">
    <rdf:RDF>
      <cc:Work
         rdf:about="">
        <dc:format>image/svg+xml</dc:format>
        <dc:type
           rdf:resource="http://purl.org/dc/dcmitype/StillImage" />
        <dc:title></dc:title>
      </cc:Work>
    </rdf:RDF>
  </metadata>
  <g
     inkscape:label="Layer 1"
     inkscape:groupmode="layer"
     id="layer1">
    <g
       id="g4580"
       transform="matrix(0.88711569,0,0,0.88711569,4.7077825,14.47508)">
      <path
         sodipodi:nodetypes="cc"
         inkscape:connector-curvature="0"
         id="path4746"
         d="M 150.2078,38.039386 H 57.012531"
         style="fill:none;stroke:#999999;stroke-width:1;stroke-linecap:round;stroke-linejoin:miter;stroke-miterlimit:4;stroke-dasharray:1.99999996, 3.99999992;stroke-dashoffset:0;stroke-opacity:1" />
      <path
         style="fill:none;stroke:#000000;stroke-width:1;stroke-linecap:round;stroke-linejoin:miter;stroke-miterlimit:4;stroke-dasharray:none;stroke-opacity:1"
         d="M 77.243548,25.875152 73.984151,38.039386 H 57.012531 L 53.724603,25.768671"
         id="path4572"
         inkscape:connector-curvature="0"
         sodipodi:nodetypes="cc" />
      <text
         xml:space="preserve"
         style="font-style:normal;font-weight:normal;font-size:10.58333302px;line-height:1.25;font-family:sans-serif;letter-spacing:0px;word-spacing:0px;fill:#000000;fill-opacity:1;stroke:none;stroke-width:0.26458332"
         x="156.92902"
         y="39.368187"
         id="text4576"><tspan
           sodipodi:role="line"
           id="tspan4574"
           x="156.92902"
           y="39.368187"
           style="font-style:normal;font-variant:normal;font-weight:normal;font-stretch:normal;font-size:5.64444447px;font-family:Hack;-inkscape-font-specification:Hack;stroke-width:0.26458332">bob</tspan></text>
      <circle
         r="2.8348215"
         cy="38.039387"
         cx="65.498344"
         id="circle4578"
         style="fill:#ff8080;stroke:#000000;stroke-width:1;stroke-linecap:round;stroke-miterlimit:4;stroke-dasharray:none" />
    </g>
    <g
       id="g4531"
       transform="matrix(0.88711569,0,0,0.88711569,4.7077825,3.5471701)">
      <path
         inkscape:connector-curvature="0"
         id="path10"
         d="M 39.640012,38.039386 H 145.21148"
         style="fill:none;stroke:#000000;stroke-width:1;stroke-linecap:round;stroke-linejoin:miter;stroke-miterlimit:4;stroke-dasharray:none;stroke-opacity:1" />
      <text
         id="text4522"
         y="40.561195"
         x="156.92902"
         style="font-style:normal;font-weight:normal;font-size:10.58333302px;line-height:1.25;font-family:sans-serif;letter-spacing:0px;word-spacing:0px;fill:#000000;fill-opacity:1;stroke:none;stroke-width:0.26458332"
         xml:space="preserve"><tspan
           style="font-style:normal;font-variant:normal;font-weight:normal;font-stretch:normal;font-size:5.64444447px;font-family:Hack;-inkscape-font-specification:Hack;stroke-width:0.26458332"
           y="40.561195"
           x="156.92902"
           id="tspan4520"
           sodipodi:role="line">master</tspan></text>
      <circle
         style="fill:#008080;stroke:#000000;stroke-width:1;stroke-linecap:round;stroke-miterlimit:4;stroke-dasharray:none"
         id="path4541"
         cx="46.607346"
         cy="38.039387"
         r="2.8348215" />
      <circle
         r="2.8348215"
         cy="38.039387"
         cx="77.343338"
         id="circle4582"
         style="fill:#008080;stroke:#000000;stroke-width:1;stroke-linecap:round;stroke-miterlimit:4;stroke-dasharray:none" />
    </g>
    <path
       style="fill:none;stroke:#000000;stroke-width:1;stroke-linecap:round;stroke-linejoin:miter;stroke-miterlimit:4;stroke-dasharray:none;stroke-opacity:1"
       d="m 51.600561,42.23171 2.815379,2.13787 0.922558,-3.14689"
       id="path4755"
       inkscape:connector-curvature="0"
       sodipodi:nodetypes="ccc" />
    <path
       sodipodi:nodetypes="ccc"
       inkscape:connector-curvature="0"
       id="path4757"
       d="m 73.36348,45.23891 -1.232366,-3.31333 -2.464615,2.16327"
       style="fill:none;stroke:#000000;stroke-width:1;stroke-linecap:round;stroke-linejoin:miter;stroke-miterlimit:4;stroke-dasharray:none;stroke-opacity:1" />
    <text
       xml:space="preserve"
       style="font-style:normal;font-weight:normal;font-size:9.3886404px;line-height:1.25;font-family:sans-serif;letter-spacing:0px;word-spacing:0px;fill:#000000;fill-opacity:1;stroke:none;stroke-width:0.23471601"
       x="143.92198"
       y="28.238998"
       id="text4836"><tspan
         sodipodi:role="line"
         id="tspan4834"
         x="143.92198"
         y="28.238998"
         style="font-style:normal;font-variant:normal;font-weight:normal;font-stretch:normal;font-size:5.0072751px;font-family:Hack;-inkscape-font-specification:Hack;stroke-width:0.23471601">alice</tspan></text>
    <g
       id="g4971"
       transform="translate(26.458334,0.1889881)">
      <path
         style="fill:none;stroke:#999999;stroke-width:0.887;stroke-linecap:round;stroke-linejoin:miter;stroke-miterlimit:4;stroke-dasharray:1.774,3.548;stroke-dashoffset:0;stroke-opacity:1"
         d="M 112.91856,25.684346 H 55.284493"
         id="path4830"
         inkscape:connector-curvature="0"
         sodipodi:nodetypes="cc" />
      <path
         sodipodi:nodetypes="ccc"
         inkscape:connector-curvature="0"
         id="path4832"
         d="M 95.998161,25.684346 H 55.284493 L 52.367721,36.56989"
         style="fill:none;stroke:#000000;stroke-width:0.88711572;stroke-linecap:round;stroke-linejoin:miter;stroke-miterlimit:4;stroke-dasharray:none;stroke-opacity:1" />
      <circle
         transform="scale(1,-1)"
         style="fill:#ff8080;stroke:#000000;stroke-width:0.88711572;stroke-linecap:round;stroke-miterlimit:4;stroke-dasharray:none"
         id="circle4838"
         cx="62.812393"
         cy="-25.684345"
         r="2.5148146" />
      <circle
         transform="scale(1,-1)"
         r="2.5148146"
         cy="-25.684345"
         cx="76.309509"
         id="circle4844"
         style="fill:#ff8080;stroke:#000000;stroke-width:0.88711572;stroke-linecap:round;stroke-miterlimit:4;stroke-dasharray:none" />
      <circle
         transform="scale(1,-1)"
         style="fill:#ff8080;stroke:#000000;stroke-width:0.88711572;stroke-linecap:round;stroke-miterlimit:4;stroke-dasharray:none"
         id="circle4846"
         cx="89.80661"
         cy="-25.684345"
         r="2.5148146" />
    </g>
    <path
       style="fill:none;stroke:#000000;stroke-width:1;stroke-linecap:round;stroke-linejoin:miter;stroke-miterlimit:4;stroke-dasharray:none;stroke-opacity:1"
       d="m 82.048392,32.276338 -1.232368,-3.313331 -2.464615,2.163271"
       id="path4842"
       inkscape:connector-curvature="0"
       sodipodi:nodetypes="ccc" />
  </g>
</svg>
