\relax 
\providecommand\hyper@newdestlabel[2]{}
\@writefile{toc}{\contentsline {section}{\numberline {2}Ozstar Supercomputer}{4}{section.2}\protected@file@percent }
\@writefile{lof}{\contentsline {figure}{\numberline {1}{\ignorespaces Visual representation of the OzStar cluster. Purple denotes a computing resource and yellow highlights the disk space available. The login nodes are {\it  farnakle1/2}.}}{5}{figure.1}\protected@file@percent }
\newlabel{fig:ozstarfig}{{1}{5}{Visual representation of the OzStar cluster. Purple denotes a computing resource and yellow highlights the disk space available. The login nodes are {\it farnakle1/2}}{figure.1}{}}
\@writefile{toc}{\contentsline {subsection}{\numberline {2.1}OzStar environment}{5}{subsection.2.1}\protected@file@percent }
\newlabel{sec:ozstar_env}{{2.1}{5}{OzStar environment}{subsection.2.1}{}}
\@writefile{toc}{\contentsline {subsection}{\numberline {2.2}Development/testing on OzStar}{6}{subsection.2.2}\protected@file@percent }
\newlabel{sec:ozstar_env}{{2.2}{6}{Development/testing on OzStar}{subsection.2.2}{}}
\@setckpt{sections/ozstar}{
\setcounter{page}{8}
\setcounter{equation}{0}
\setcounter{enumi}{0}
\setcounter{enumii}{0}
\setcounter{enumiii}{0}
\setcounter{enumiv}{0}
\setcounter{footnote}{13}
\setcounter{mpfootnote}{0}
\setcounter{part}{0}
\setcounter{section}{2}
\setcounter{subsection}{2}
\setcounter{subsubsection}{0}
\setcounter{paragraph}{0}
\setcounter{subparagraph}{0}
\setcounter{figure}{1}
\setcounter{table}{0}
\setcounter{blindtext}{1}
\setcounter{Blindtext}{5}
\setcounter{blind@countparstart}{0}
\setcounter{blindlist}{0}
\setcounter{blindlistlevel}{0}
\setcounter{blindlist@level}{0}
\setcounter{blind@listcount}{0}
\setcounter{blind@levelcount}{0}
\setcounter{blind@randomcount}{0}
\setcounter{blind@randommax}{0}
\setcounter{blind@pangramcount}{0}
\setcounter{blind@pangrammax}{0}
\setcounter{lstnumber}{1}
\setcounter{Item}{0}
\setcounter{Hfootnote}{16}
\setcounter{bookmark@seq@number}{4}
\setcounter{LT@tables}{0}
\setcounter{LT@chunks}{0}
\setcounter{tcbbreakpart}{1}
\setcounter{tcblayer}{0}
\setcounter{tcbrastercolumn}{0}
\setcounter{tcbrasterrow}{0}
\setcounter{tcbraster}{0}
\setcounter{parentequation}{0}
\setcounter{tcblisting}{0}
\setcounter{lstlisting}{0}
\setcounter{section@level}{2}
}
