\relax 
\providecommand\hyper@newdestlabel[2]{}
\providecommand\HyperFirstAtBeginDocument{\AtBeginDocument}
\HyperFirstAtBeginDocument{\ifx\hyper@anchor\@undefined
\global\let\oldcontentsline\contentsline
\gdef\contentsline#1#2#3#4{\oldcontentsline{#1}{#2}{#3}}
\global\let\oldnewlabel\newlabel
\gdef\newlabel#1#2{\newlabelxx{#1}#2}
\gdef\newlabelxx#1#2#3#4#5#6{\oldnewlabel{#1}{{#2}{#3}}}
\AtEndDocument{\ifx\hyper@anchor\@undefined
\let\contentsline\oldcontentsline
\let\newlabel\oldnewlabel
\fi}
\fi}
\global\let\hyper@last\relax 
\gdef\HyperFirstAtBeginDocument#1{#1}
\providecommand\HyField@AuxAddToFields[1]{}
\providecommand\HyField@AuxAddToCoFields[2]{}
\@input{sections/introduction.aux}
\@input{sections/codestyle.aux}
\@input{sections/usecase.aux}
\@input{sections/unittests.aux}
\@input{code_documentation/documentation.aux}
\@writefile{toc}{\contentsline {section}{\numberline {F}banks.sh}{29}{appendix.F}\protected@file@percent }
\newlabel{sec:banks}{{F}{29}{banks.sh}{appendix.F}{}}
\@writefile{lol}{\contentsline {lstlisting}{example\textunderscore code\textunderscore use/banks.sh}{29}{lstlisting.-52}\protected@file@percent }
\@writefile{toc}{\contentsline {subsubsection}{\numberline {F.0.1}verbose output of create.err\_file\_information\_report}{30}{subsubsection.F.0.1}\protected@file@percent }
\newlabel{sec:verbose_output}{{F.0.1}{30}{verbose output of create.err\_file\_information\_report}{subsubsection.F.0.1}{}}
\@writefile{lol}{\contentsline {lstlisting}{example\textunderscore code\textunderscore use/create\textunderscore dot\textunderscore err\textunderscore file\textunderscore information\textunderscore test}{30}{lstlisting.-53}\protected@file@percent }
\@writefile{toc}{\contentsline {section}{\numberline {G}create\_docs.py}{30}{appendix.G}\protected@file@percent }
\newlabel{sec:auto_doc}{{G}{30}{create\_docs.py}{appendix.G}{}}
\@writefile{lol}{\contentsline {lstlisting}{../create\textunderscore docs.py}{30}{lstlisting.-54}\protected@file@percent }
