variable;value;type
flow;15;int
waveform_domain;FD;string
padding;1.3;float
autocorrelation_length;351;int
sampleRate;2048;int
negative_latency;0;int
snr_cut;0.998;float
verbose_bool;FALSE;bool
num_passes;16;int
downsample_bool;TRUE;bool
indv_bool;TRUE;bool
hessian_bool;TRUE;bool
debug_bool;FALSE;bool
keep_track_bool;TRUE;bool
overwrite_file;TRUE;bool
optimizer_options;'{"verbose": True, "passes": 16, "indv": True, "hessian": True}';dict
epsilon_options;{"epsilon_start": 1.0,  "nround_max": 25, "initial_overlap_min": 0.95, "b0_optimized_overlap_min": 0.97, "epsilon_factor": 1.2,  "filters_max": 350}';dict
