TABLE,PARAMETERS
postcoh,end_time
postcoh,cohsnr
postcoh,far
postcoh,bankid
postcoh,tmplt_idx
postcoh,chisq_H1
postcoh,snglsnr_H1
postcoh,chisq_L1
postcoh,snglsnr_L1
postcoh,chisq_V1
postcoh,snglsnr_V1
postcoh,cmbchisq
postcoh,spearman_pval
postcoh,event_id
postcoh,far
postcoh,mass1
postcoh,mass2
postcoh,mchirp
postcoh,pivotal_ifo
