\relax 
\providecommand\hyper@newdestlabel[2]{}
\@writefile{toc}{\contentsline {section}{\numberline {C}Setup PyCharm on OzStar and use the SPIIR pipeline}{15}{appendix.C}\protected@file@percent }
\@writefile{toc}{\contentsline {subsection}{\numberline {C.1}Introduction}{15}{subsection.C.1}\protected@file@percent }
\@writefile{toc}{\contentsline {subsection}{\numberline {C.2}Intial Setup Requirements}{16}{subsection.C.2}\protected@file@percent }
\newlabel{sec:setup_requirements}{{C.2}{16}{Intial Setup Requirements}{subsection.C.2}{}}
\@writefile{toc}{\contentsline {subsection}{\numberline {C.3}SPIIR environment}{16}{subsection.C.3}\protected@file@percent }
\newlabel{sec:activate}{{C.3}{16}{SPIIR environment}{subsection.C.3}{}}
\@writefile{toc}{\contentsline {subsection}{\numberline {C.4}Connect local PyCharm distribution to OzStar cluster}{17}{subsection.C.4}\protected@file@percent }
\newlabel{sec:connect}{{C.4}{17}{Connect local PyCharm distribution to OzStar cluster}{subsection.C.4}{}}
\@writefile{toc}{\contentsline {subsection}{\numberline {C.5}Synchronise local files to remote cluster}{18}{subsection.C.5}\protected@file@percent }
\newlabel{sec:sync}{{C.5}{18}{Synchronise local files to remote cluster}{subsection.C.5}{}}
\@writefile{toc}{\contentsline {subsection}{\numberline {C.6}Run/Debug configuration}{18}{subsection.C.6}\protected@file@percent }
\newlabel{sec:run_debug_config}{{C.6}{18}{Run/Debug configuration}{subsection.C.6}{}}
\@writefile{toc}{\contentsline {subsection}{\numberline {C.7}Some productivity suggestions}{19}{subsection.C.7}\protected@file@percent }
\newlabel{sec:productivity}{{C.7}{19}{Some productivity suggestions}{subsection.C.7}{}}
\@setckpt{appendix/connect_pycharm}{
\setcounter{page}{20}
\setcounter{equation}{0}
\setcounter{enumi}{5}
\setcounter{enumii}{8}
\setcounter{enumiii}{5}
\setcounter{enumiv}{0}
\setcounter{footnote}{27}
\setcounter{mpfootnote}{0}
\setcounter{part}{0}
\setcounter{section}{3}
\setcounter{subsection}{7}
\setcounter{subsubsection}{0}
\setcounter{paragraph}{0}
\setcounter{subparagraph}{0}
\setcounter{figure}{2}
\setcounter{table}{0}
\setcounter{blindtext}{1}
\setcounter{Blindtext}{5}
\setcounter{blind@countparstart}{0}
\setcounter{blindlist}{0}
\setcounter{blindlistlevel}{0}
\setcounter{blindlist@level}{0}
\setcounter{blind@listcount}{0}
\setcounter{blind@levelcount}{0}
\setcounter{blind@randomcount}{0}
\setcounter{blind@randommax}{0}
\setcounter{blind@pangramcount}{0}
\setcounter{blind@pangrammax}{0}
\setcounter{lstnumber}{37}
\setcounter{Item}{61}
\setcounter{Hfootnote}{31}
\setcounter{bookmark@seq@number}{20}
\setcounter{LT@tables}{0}
\setcounter{LT@chunks}{0}
\setcounter{tcbbreakpart}{1}
\setcounter{tcblayer}{0}
\setcounter{tcbrastercolumn}{0}
\setcounter{tcbrasterrow}{0}
\setcounter{tcbraster}{0}
\setcounter{parentequation}{0}
\setcounter{tcblisting}{0}
\setcounter{lstlisting}{0}
\setcounter{section@level}{2}
}
