<?xml version="1.0" encoding="UTF-8" standalone="no"?>
<!DOCTYPE svg PUBLIC "-//W3C//DTD SVG 1.1//EN" "http://www.w3.org/Graphics/SVG/1.1/DTD/svg11.dtd">
<!-- Created with matplotlib (https://matplotlib.org/) -->
<svg height="432pt" version="1.1" viewBox="0 0 576 432" width="576pt" xmlns="http://www.w3.org/2000/svg" xmlns:xlink="http://www.w3.org/1999/xlink">
 <defs>
  <style type="text/css">
*{stroke-linecap:butt;stroke-linejoin:round;white-space:pre;}
  </style>
 </defs>
 <g id="figure_1">
  <g id="patch_1">
   <path d="M 0 432  L 576 432  L 576 0  L 0 0  z " style="fill:#ffffff;"/>
  </g>
  <g id="axes_1">
   <g id="patch_2">
    <path d="M 60.77 182.669757  L 565.2 182.669757  L 565.2 12.683514  L 60.77 12.683514  z " style="fill:#ffffff;"/>
   </g>
   <g id="matplotlib.axis_1">
    <g id="xtick_1">
     <g id="line2d_1">
      <path clip-path="url(#pf86e6e071b)" d="M 83.698636 182.669757  L 83.698636 12.683514  " style="fill:none;stroke:#b0b0b0;stroke-linecap:square;stroke-width:0.8;"/>
     </g>
     <g id="line2d_2">
      <defs>
       <path d="M 0 0  L 0 3.5  " id="mdbdc128688" style="stroke:#000000;stroke-width:0.8;"/>
      </defs>
      <g>
       <use style="stroke:#000000;stroke-width:0.8;" x="83.698636" xlink:href="#mdbdc128688" y="182.669757"/>
      </g>
     </g>
     <g id="text_1">
      <!-- $\mathdefault{10^{5}}$ -->
      <defs>
       <path d="M 12.40625 8.296875  L 28.515625 8.296875  L 28.515625 63.921875  L 10.984375 60.40625  L 10.984375 69.390625  L 28.421875 72.90625  L 38.28125 72.90625  L 38.28125 8.296875  L 54.390625 8.296875  L 54.390625 0  L 12.40625 0  z " id="DejaVuSans-49"/>
       <path d="M 31.78125 66.40625  Q 24.171875 66.40625 20.328125 58.90625  Q 16.5 51.421875 16.5 36.375  Q 16.5 21.390625 20.328125 13.890625  Q 24.171875 6.390625 31.78125 6.390625  Q 39.453125 6.390625 43.28125 13.890625  Q 47.125 21.390625 47.125 36.375  Q 47.125 51.421875 43.28125 58.90625  Q 39.453125 66.40625 31.78125 66.40625  z M 31.78125 74.21875  Q 44.046875 74.21875 50.515625 64.515625  Q 56.984375 54.828125 56.984375 36.375  Q 56.984375 17.96875 50.515625 8.265625  Q 44.046875 -1.421875 31.78125 -1.421875  Q 19.53125 -1.421875 13.0625 8.265625  Q 6.59375 17.96875 6.59375 36.375  Q 6.59375 54.828125 13.0625 64.515625  Q 19.53125 74.21875 31.78125 74.21875  z " id="DejaVuSans-48"/>
       <path d="M 10.796875 72.90625  L 49.515625 72.90625  L 49.515625 64.59375  L 19.828125 64.59375  L 19.828125 46.734375  Q 21.96875 47.46875 24.109375 47.828125  Q 26.265625 48.1875 28.421875 48.1875  Q 40.625 48.1875 47.75 41.5  Q 54.890625 34.8125 54.890625 23.390625  Q 54.890625 11.625 47.5625 5.09375  Q 40.234375 -1.421875 26.90625 -1.421875  Q 22.3125 -1.421875 17.546875 -0.640625  Q 12.796875 0.140625 7.71875 1.703125  L 7.71875 11.625  Q 12.109375 9.234375 16.796875 8.0625  Q 21.484375 6.890625 26.703125 6.890625  Q 35.15625 6.890625 40.078125 11.328125  Q 45.015625 15.765625 45.015625 23.390625  Q 45.015625 31 40.078125 35.4375  Q 35.15625 39.890625 26.703125 39.890625  Q 22.75 39.890625 18.8125 39.015625  Q 14.890625 38.140625 10.796875 36.28125  z " id="DejaVuSans-53"/>
      </defs>
      <g transform="translate(74.898636 197.268194)scale(0.1 -0.1)">
       <use transform="translate(0 0.684375)" xlink:href="#DejaVuSans-49"/>
       <use transform="translate(63.623047 0.684375)" xlink:href="#DejaVuSans-48"/>
       <use transform="translate(128.203125 38.965625)scale(0.7)" xlink:href="#DejaVuSans-53"/>
      </g>
     </g>
    </g>
    <g id="xtick_2">
     <g id="line2d_3">
      <path clip-path="url(#pf86e6e071b)" d="M 236.556212 182.669757  L 236.556212 12.683514  " style="fill:none;stroke:#b0b0b0;stroke-linecap:square;stroke-width:0.8;"/>
     </g>
     <g id="line2d_4">
      <g>
       <use style="stroke:#000000;stroke-width:0.8;" x="236.556212" xlink:href="#mdbdc128688" y="182.669757"/>
      </g>
     </g>
     <g id="text_2">
      <!-- $\mathdefault{10^{6}}$ -->
      <defs>
       <path d="M 33.015625 40.375  Q 26.375 40.375 22.484375 35.828125  Q 18.609375 31.296875 18.609375 23.390625  Q 18.609375 15.53125 22.484375 10.953125  Q 26.375 6.390625 33.015625 6.390625  Q 39.65625 6.390625 43.53125 10.953125  Q 47.40625 15.53125 47.40625 23.390625  Q 47.40625 31.296875 43.53125 35.828125  Q 39.65625 40.375 33.015625 40.375  z M 52.59375 71.296875  L 52.59375 62.3125  Q 48.875 64.0625 45.09375 64.984375  Q 41.3125 65.921875 37.59375 65.921875  Q 27.828125 65.921875 22.671875 59.328125  Q 17.53125 52.734375 16.796875 39.40625  Q 19.671875 43.65625 24.015625 45.921875  Q 28.375 48.1875 33.59375 48.1875  Q 44.578125 48.1875 50.953125 41.515625  Q 57.328125 34.859375 57.328125 23.390625  Q 57.328125 12.15625 50.6875 5.359375  Q 44.046875 -1.421875 33.015625 -1.421875  Q 20.359375 -1.421875 13.671875 8.265625  Q 6.984375 17.96875 6.984375 36.375  Q 6.984375 53.65625 15.1875 63.9375  Q 23.390625 74.21875 37.203125 74.21875  Q 40.921875 74.21875 44.703125 73.484375  Q 48.484375 72.75 52.59375 71.296875  z " id="DejaVuSans-54"/>
      </defs>
      <g transform="translate(227.756212 197.268194)scale(0.1 -0.1)">
       <use transform="translate(0 0.765625)" xlink:href="#DejaVuSans-49"/>
       <use transform="translate(63.623047 0.765625)" xlink:href="#DejaVuSans-48"/>
       <use transform="translate(128.203125 39.046875)scale(0.7)" xlink:href="#DejaVuSans-54"/>
      </g>
     </g>
    </g>
    <g id="xtick_3">
     <g id="line2d_5">
      <path clip-path="url(#pf86e6e071b)" d="M 389.413788 182.669757  L 389.413788 12.683514  " style="fill:none;stroke:#b0b0b0;stroke-linecap:square;stroke-width:0.8;"/>
     </g>
     <g id="line2d_6">
      <g>
       <use style="stroke:#000000;stroke-width:0.8;" x="389.413788" xlink:href="#mdbdc128688" y="182.669757"/>
      </g>
     </g>
     <g id="text_3">
      <!-- $\mathdefault{10^{7}}$ -->
      <defs>
       <path d="M 8.203125 72.90625  L 55.078125 72.90625  L 55.078125 68.703125  L 28.609375 0  L 18.3125 0  L 43.21875 64.59375  L 8.203125 64.59375  z " id="DejaVuSans-55"/>
      </defs>
      <g transform="translate(380.613788 197.268194)scale(0.1 -0.1)">
       <use transform="translate(0 0.684375)" xlink:href="#DejaVuSans-49"/>
       <use transform="translate(63.623047 0.684375)" xlink:href="#DejaVuSans-48"/>
       <use transform="translate(128.203125 38.965625)scale(0.7)" xlink:href="#DejaVuSans-55"/>
      </g>
     </g>
    </g>
    <g id="xtick_4">
     <g id="line2d_7">
      <path clip-path="url(#pf86e6e071b)" d="M 542.271364 182.669757  L 542.271364 12.683514  " style="fill:none;stroke:#b0b0b0;stroke-linecap:square;stroke-width:0.8;"/>
     </g>
     <g id="line2d_8">
      <g>
       <use style="stroke:#000000;stroke-width:0.8;" x="542.271364" xlink:href="#mdbdc128688" y="182.669757"/>
      </g>
     </g>
     <g id="text_4">
      <!-- $\mathdefault{10^{8}}$ -->
      <defs>
       <path d="M 31.78125 34.625  Q 24.75 34.625 20.71875 30.859375  Q 16.703125 27.09375 16.703125 20.515625  Q 16.703125 13.921875 20.71875 10.15625  Q 24.75 6.390625 31.78125 6.390625  Q 38.8125 6.390625 42.859375 10.171875  Q 46.921875 13.96875 46.921875 20.515625  Q 46.921875 27.09375 42.890625 30.859375  Q 38.875 34.625 31.78125 34.625  z M 21.921875 38.8125  Q 15.578125 40.375 12.03125 44.71875  Q 8.5 49.078125 8.5 55.328125  Q 8.5 64.0625 14.71875 69.140625  Q 20.953125 74.21875 31.78125 74.21875  Q 42.671875 74.21875 48.875 69.140625  Q 55.078125 64.0625 55.078125 55.328125  Q 55.078125 49.078125 51.53125 44.71875  Q 48 40.375 41.703125 38.8125  Q 48.828125 37.15625 52.796875 32.3125  Q 56.78125 27.484375 56.78125 20.515625  Q 56.78125 9.90625 50.3125 4.234375  Q 43.84375 -1.421875 31.78125 -1.421875  Q 19.734375 -1.421875 13.25 4.234375  Q 6.78125 9.90625 6.78125 20.515625  Q 6.78125 27.484375 10.78125 32.3125  Q 14.796875 37.15625 21.921875 38.8125  z M 18.3125 54.390625  Q 18.3125 48.734375 21.84375 45.5625  Q 25.390625 42.390625 31.78125 42.390625  Q 38.140625 42.390625 41.71875 45.5625  Q 45.3125 48.734375 45.3125 54.390625  Q 45.3125 60.0625 41.71875 63.234375  Q 38.140625 66.40625 31.78125 66.40625  Q 25.390625 66.40625 21.84375 63.234375  Q 18.3125 60.0625 18.3125 54.390625  z " id="DejaVuSans-56"/>
      </defs>
      <g transform="translate(533.471364 197.268194)scale(0.1 -0.1)">
       <use transform="translate(0 0.765625)" xlink:href="#DejaVuSans-49"/>
       <use transform="translate(63.623047 0.765625)" xlink:href="#DejaVuSans-48"/>
       <use transform="translate(128.203125 39.046875)scale(0.7)" xlink:href="#DejaVuSans-56"/>
      </g>
     </g>
    </g>
    <g id="xtick_5">
     <g id="line2d_9">
      <defs>
       <path d="M 0 0  L 0 2  " id="m8faf25157a" style="stroke:#000000;stroke-width:0.6;"/>
      </defs>
      <g>
       <use style="stroke:#000000;stroke-width:0.6;" x="68.885207" xlink:href="#m8faf25157a" y="182.669757"/>
      </g>
     </g>
    </g>
    <g id="xtick_6">
     <g id="line2d_10">
      <g>
       <use style="stroke:#000000;stroke-width:0.6;" x="76.704257" xlink:href="#m8faf25157a" y="182.669757"/>
      </g>
     </g>
    </g>
    <g id="xtick_7">
     <g id="line2d_11">
      <g>
       <use style="stroke:#000000;stroke-width:0.6;" x="129.713352" xlink:href="#m8faf25157a" y="182.669757"/>
      </g>
     </g>
    </g>
    <g id="xtick_8">
     <g id="line2d_12">
      <g>
       <use style="stroke:#000000;stroke-width:0.6;" x="156.630235" xlink:href="#m8faf25157a" y="182.669757"/>
      </g>
     </g>
    </g>
    <g id="xtick_9">
     <g id="line2d_13">
      <g>
       <use style="stroke:#000000;stroke-width:0.6;" x="175.728067" xlink:href="#m8faf25157a" y="182.669757"/>
      </g>
     </g>
    </g>
    <g id="xtick_10">
     <g id="line2d_14">
      <g>
       <use style="stroke:#000000;stroke-width:0.6;" x="190.541497" xlink:href="#m8faf25157a" y="182.669757"/>
      </g>
     </g>
    </g>
    <g id="xtick_11">
     <g id="line2d_15">
      <g>
       <use style="stroke:#000000;stroke-width:0.6;" x="202.64495" xlink:href="#m8faf25157a" y="182.669757"/>
      </g>
     </g>
    </g>
    <g id="xtick_12">
     <g id="line2d_16">
      <g>
       <use style="stroke:#000000;stroke-width:0.6;" x="212.878274" xlink:href="#m8faf25157a" y="182.669757"/>
      </g>
     </g>
    </g>
    <g id="xtick_13">
     <g id="line2d_17">
      <g>
       <use style="stroke:#000000;stroke-width:0.6;" x="221.742782" xlink:href="#m8faf25157a" y="182.669757"/>
      </g>
     </g>
    </g>
    <g id="xtick_14">
     <g id="line2d_18">
      <g>
       <use style="stroke:#000000;stroke-width:0.6;" x="229.561833" xlink:href="#m8faf25157a" y="182.669757"/>
      </g>
     </g>
    </g>
    <g id="xtick_15">
     <g id="line2d_19">
      <g>
       <use style="stroke:#000000;stroke-width:0.6;" x="282.570927" xlink:href="#m8faf25157a" y="182.669757"/>
      </g>
     </g>
    </g>
    <g id="xtick_16">
     <g id="line2d_20">
      <g>
       <use style="stroke:#000000;stroke-width:0.6;" x="309.48781" xlink:href="#m8faf25157a" y="182.669757"/>
      </g>
     </g>
    </g>
    <g id="xtick_17">
     <g id="line2d_21">
      <g>
       <use style="stroke:#000000;stroke-width:0.6;" x="328.585643" xlink:href="#m8faf25157a" y="182.669757"/>
      </g>
     </g>
    </g>
    <g id="xtick_18">
     <g id="line2d_22">
      <g>
       <use style="stroke:#000000;stroke-width:0.6;" x="343.399073" xlink:href="#m8faf25157a" y="182.669757"/>
      </g>
     </g>
    </g>
    <g id="xtick_19">
     <g id="line2d_23">
      <g>
       <use style="stroke:#000000;stroke-width:0.6;" x="355.502526" xlink:href="#m8faf25157a" y="182.669757"/>
      </g>
     </g>
    </g>
    <g id="xtick_20">
     <g id="line2d_24">
      <g>
       <use style="stroke:#000000;stroke-width:0.6;" x="365.73585" xlink:href="#m8faf25157a" y="182.669757"/>
      </g>
     </g>
    </g>
    <g id="xtick_21">
     <g id="line2d_25">
      <g>
       <use style="stroke:#000000;stroke-width:0.6;" x="374.600358" xlink:href="#m8faf25157a" y="182.669757"/>
      </g>
     </g>
    </g>
    <g id="xtick_22">
     <g id="line2d_26">
      <g>
       <use style="stroke:#000000;stroke-width:0.6;" x="382.419409" xlink:href="#m8faf25157a" y="182.669757"/>
      </g>
     </g>
    </g>
    <g id="xtick_23">
     <g id="line2d_27">
      <g>
       <use style="stroke:#000000;stroke-width:0.6;" x="435.428503" xlink:href="#m8faf25157a" y="182.669757"/>
      </g>
     </g>
    </g>
    <g id="xtick_24">
     <g id="line2d_28">
      <g>
       <use style="stroke:#000000;stroke-width:0.6;" x="462.345386" xlink:href="#m8faf25157a" y="182.669757"/>
      </g>
     </g>
    </g>
    <g id="xtick_25">
     <g id="line2d_29">
      <g>
       <use style="stroke:#000000;stroke-width:0.6;" x="481.443219" xlink:href="#m8faf25157a" y="182.669757"/>
      </g>
     </g>
    </g>
    <g id="xtick_26">
     <g id="line2d_30">
      <g>
       <use style="stroke:#000000;stroke-width:0.6;" x="496.256648" xlink:href="#m8faf25157a" y="182.669757"/>
      </g>
     </g>
    </g>
    <g id="xtick_27">
     <g id="line2d_31">
      <g>
       <use style="stroke:#000000;stroke-width:0.6;" x="508.360102" xlink:href="#m8faf25157a" y="182.669757"/>
      </g>
     </g>
    </g>
    <g id="xtick_28">
     <g id="line2d_32">
      <g>
       <use style="stroke:#000000;stroke-width:0.6;" x="518.593426" xlink:href="#m8faf25157a" y="182.669757"/>
      </g>
     </g>
    </g>
    <g id="xtick_29">
     <g id="line2d_33">
      <g>
       <use style="stroke:#000000;stroke-width:0.6;" x="527.457934" xlink:href="#m8faf25157a" y="182.669757"/>
      </g>
     </g>
    </g>
    <g id="xtick_30">
     <g id="line2d_34">
      <g>
       <use style="stroke:#000000;stroke-width:0.6;" x="535.276985" xlink:href="#m8faf25157a" y="182.669757"/>
      </g>
     </g>
    </g>
   </g>
   <g id="matplotlib.axis_2">
    <g id="ytick_1">
     <g id="line2d_35">
      <path clip-path="url(#pf86e6e071b)" d="M 60.77 174.276397  L 565.2 174.276397  " style="fill:none;stroke:#b0b0b0;stroke-linecap:square;stroke-width:0.8;"/>
     </g>
     <g id="line2d_36">
      <defs>
       <path d="M 0 0  L -3.5 0  " id="ma8e05ee773" style="stroke:#000000;stroke-width:0.8;"/>
      </defs>
      <g>
       <use style="stroke:#000000;stroke-width:0.8;" x="60.77" xlink:href="#ma8e05ee773" y="174.276397"/>
      </g>
     </g>
     <g id="text_5">
      <!-- −80 -->
      <defs>
       <path d="M 10.59375 35.5  L 73.1875 35.5  L 73.1875 27.203125  L 10.59375 27.203125  z " id="DejaVuSans-8722"/>
      </defs>
      <g transform="translate(32.665313 178.075616)scale(0.1 -0.1)">
       <use xlink:href="#DejaVuSans-8722"/>
       <use x="83.789062" xlink:href="#DejaVuSans-56"/>
       <use x="147.412109" xlink:href="#DejaVuSans-48"/>
      </g>
     </g>
    </g>
    <g id="ytick_2">
     <g id="line2d_37">
      <path clip-path="url(#pf86e6e071b)" d="M 60.77 147.733331  L 565.2 147.733331  " style="fill:none;stroke:#b0b0b0;stroke-linecap:square;stroke-width:0.8;"/>
     </g>
     <g id="line2d_38">
      <g>
       <use style="stroke:#000000;stroke-width:0.8;" x="60.77" xlink:href="#ma8e05ee773" y="147.733331"/>
      </g>
     </g>
     <g id="text_6">
      <!-- −60 -->
      <g transform="translate(32.665313 151.532549)scale(0.1 -0.1)">
       <use xlink:href="#DejaVuSans-8722"/>
       <use x="83.789062" xlink:href="#DejaVuSans-54"/>
       <use x="147.412109" xlink:href="#DejaVuSans-48"/>
      </g>
     </g>
    </g>
    <g id="ytick_3">
     <g id="line2d_39">
      <path clip-path="url(#pf86e6e071b)" d="M 60.77 121.190264  L 565.2 121.190264  " style="fill:none;stroke:#b0b0b0;stroke-linecap:square;stroke-width:0.8;"/>
     </g>
     <g id="line2d_40">
      <g>
       <use style="stroke:#000000;stroke-width:0.8;" x="60.77" xlink:href="#ma8e05ee773" y="121.190264"/>
      </g>
     </g>
     <g id="text_7">
      <!-- −40 -->
      <defs>
       <path d="M 37.796875 64.3125  L 12.890625 25.390625  L 37.796875 25.390625  z M 35.203125 72.90625  L 47.609375 72.90625  L 47.609375 25.390625  L 58.015625 25.390625  L 58.015625 17.1875  L 47.609375 17.1875  L 47.609375 0  L 37.796875 0  L 37.796875 17.1875  L 4.890625 17.1875  L 4.890625 26.703125  z " id="DejaVuSans-52"/>
      </defs>
      <g transform="translate(32.665313 124.989483)scale(0.1 -0.1)">
       <use xlink:href="#DejaVuSans-8722"/>
       <use x="83.789062" xlink:href="#DejaVuSans-52"/>
       <use x="147.412109" xlink:href="#DejaVuSans-48"/>
      </g>
     </g>
    </g>
    <g id="ytick_4">
     <g id="line2d_41">
      <path clip-path="url(#pf86e6e071b)" d="M 60.77 94.647198  L 565.2 94.647198  " style="fill:none;stroke:#b0b0b0;stroke-linecap:square;stroke-width:0.8;"/>
     </g>
     <g id="line2d_42">
      <g>
       <use style="stroke:#000000;stroke-width:0.8;" x="60.77" xlink:href="#ma8e05ee773" y="94.647198"/>
      </g>
     </g>
     <g id="text_8">
      <!-- −20 -->
      <defs>
       <path d="M 19.1875 8.296875  L 53.609375 8.296875  L 53.609375 0  L 7.328125 0  L 7.328125 8.296875  Q 12.9375 14.109375 22.625 23.890625  Q 32.328125 33.6875 34.8125 36.53125  Q 39.546875 41.84375 41.421875 45.53125  Q 43.3125 49.21875 43.3125 52.78125  Q 43.3125 58.59375 39.234375 62.25  Q 35.15625 65.921875 28.609375 65.921875  Q 23.96875 65.921875 18.8125 64.3125  Q 13.671875 62.703125 7.8125 59.421875  L 7.8125 69.390625  Q 13.765625 71.78125 18.9375 73  Q 24.125 74.21875 28.421875 74.21875  Q 39.75 74.21875 46.484375 68.546875  Q 53.21875 62.890625 53.21875 53.421875  Q 53.21875 48.921875 51.53125 44.890625  Q 49.859375 40.875 45.40625 35.40625  Q 44.1875 33.984375 37.640625 27.21875  Q 31.109375 20.453125 19.1875 8.296875  z " id="DejaVuSans-50"/>
      </defs>
      <g transform="translate(32.665313 98.446417)scale(0.1 -0.1)">
       <use xlink:href="#DejaVuSans-8722"/>
       <use x="83.789062" xlink:href="#DejaVuSans-50"/>
       <use x="147.412109" xlink:href="#DejaVuSans-48"/>
      </g>
     </g>
    </g>
    <g id="ytick_5">
     <g id="line2d_43">
      <path clip-path="url(#pf86e6e071b)" d="M 60.77 68.104131  L 565.2 68.104131  " style="fill:none;stroke:#b0b0b0;stroke-linecap:square;stroke-width:0.8;"/>
     </g>
     <g id="line2d_44">
      <g>
       <use style="stroke:#000000;stroke-width:0.8;" x="60.77" xlink:href="#ma8e05ee773" y="68.104131"/>
      </g>
     </g>
     <g id="text_9">
      <!-- 0 -->
      <g transform="translate(47.4075 71.90335)scale(0.1 -0.1)">
       <use xlink:href="#DejaVuSans-48"/>
      </g>
     </g>
    </g>
    <g id="ytick_6">
     <g id="line2d_45">
      <path clip-path="url(#pf86e6e071b)" d="M 60.77 41.561065  L 565.2 41.561065  " style="fill:none;stroke:#b0b0b0;stroke-linecap:square;stroke-width:0.8;"/>
     </g>
     <g id="line2d_46">
      <g>
       <use style="stroke:#000000;stroke-width:0.8;" x="60.77" xlink:href="#ma8e05ee773" y="41.561065"/>
      </g>
     </g>
     <g id="text_10">
      <!-- 20 -->
      <g transform="translate(41.045 45.360284)scale(0.1 -0.1)">
       <use xlink:href="#DejaVuSans-50"/>
       <use x="63.623047" xlink:href="#DejaVuSans-48"/>
      </g>
     </g>
    </g>
    <g id="ytick_7">
     <g id="line2d_47">
      <path clip-path="url(#pf86e6e071b)" d="M 60.77 15.017999  L 565.2 15.017999  " style="fill:none;stroke:#b0b0b0;stroke-linecap:square;stroke-width:0.8;"/>
     </g>
     <g id="line2d_48">
      <g>
       <use style="stroke:#000000;stroke-width:0.8;" x="60.77" xlink:href="#ma8e05ee773" y="15.017999"/>
      </g>
     </g>
     <g id="text_11">
      <!-- 40 -->
      <g transform="translate(41.045 18.817217)scale(0.1 -0.1)">
       <use xlink:href="#DejaVuSans-52"/>
       <use x="63.623047" xlink:href="#DejaVuSans-48"/>
      </g>
     </g>
    </g>
    <g id="ytick_8">
     <g id="line2d_49">
      <defs>
       <path d="M 0 0  L -2 0  " id="m02f00c2870" style="stroke:#000000;stroke-width:0.6;"/>
      </defs>
      <g>
       <use style="stroke:#000000;stroke-width:0.6;" x="60.77" xlink:href="#m02f00c2870" y="161.004864"/>
      </g>
     </g>
    </g>
    <g id="ytick_9">
     <g id="line2d_50">
      <g>
       <use style="stroke:#000000;stroke-width:0.6;" x="60.77" xlink:href="#m02f00c2870" y="134.461797"/>
      </g>
     </g>
    </g>
    <g id="ytick_10">
     <g id="line2d_51">
      <g>
       <use style="stroke:#000000;stroke-width:0.6;" x="60.77" xlink:href="#m02f00c2870" y="107.918731"/>
      </g>
     </g>
    </g>
    <g id="ytick_11">
     <g id="line2d_52">
      <g>
       <use style="stroke:#000000;stroke-width:0.6;" x="60.77" xlink:href="#m02f00c2870" y="81.375665"/>
      </g>
     </g>
    </g>
    <g id="ytick_12">
     <g id="line2d_53">
      <g>
       <use style="stroke:#000000;stroke-width:0.6;" x="60.77" xlink:href="#m02f00c2870" y="54.832598"/>
      </g>
     </g>
    </g>
    <g id="ytick_13">
     <g id="line2d_54">
      <g>
       <use style="stroke:#000000;stroke-width:0.6;" x="60.77" xlink:href="#m02f00c2870" y="28.289532"/>
      </g>
     </g>
    </g>
    <g id="text_12">
     <!-- $\bf{Magnitude}$ (dB) -->
     <defs>
      <path d="M 9.1875 72.90625  L 33.109375 72.90625  L 49.703125 33.890625  L 66.40625 72.90625  L 90.28125 72.90625  L 90.28125 0  L 72.515625 0  L 72.515625 53.328125  L 55.71875 14.015625  L 43.796875 14.015625  L 27 53.328125  L 27 0  L 9.1875 0  z " id="DejaVuSans-Bold-77"/>
      <path d="M 32.90625 24.609375  Q 27.4375 24.609375 24.671875 22.75  Q 21.921875 20.90625 21.921875 17.28125  Q 21.921875 13.96875 24.140625 12.078125  Q 26.375 10.203125 30.328125 10.203125  Q 35.25 10.203125 38.625 13.734375  Q 42 17.28125 42 22.609375  L 42 24.609375  z M 59.625 31.203125  L 59.625 0  L 42 0  L 42 8.109375  Q 38.484375 3.125 34.078125 0.84375  Q 29.6875 -1.421875 23.390625 -1.421875  Q 14.890625 -1.421875 9.59375 3.53125  Q 4.296875 8.5 4.296875 16.40625  Q 4.296875 26.03125 10.90625 30.515625  Q 17.53125 35.015625 31.6875 35.015625  L 42 35.015625  L 42 36.375  Q 42 40.53125 38.71875 42.453125  Q 35.453125 44.390625 28.515625 44.390625  Q 22.90625 44.390625 18.0625 43.265625  Q 13.234375 42.140625 9.078125 39.890625  L 9.078125 53.21875  Q 14.703125 54.59375 20.359375 55.296875  Q 26.03125 56 31.6875 56  Q 46.484375 56 53.046875 50.171875  Q 59.625 44.34375 59.625 31.203125  z " id="DejaVuSans-Bold-97"/>
      <path d="M 45.609375 9.28125  Q 42 4.5 37.640625 2.25  Q 33.296875 0 27.59375 0  Q 17.578125 0 11.03125 7.875  Q 4.5 15.765625 4.5 27.984375  Q 4.5 40.234375 11.03125 48.0625  Q 17.578125 55.90625 27.59375 55.90625  Q 33.296875 55.90625 37.640625 53.65625  Q 42 51.421875 45.609375 46.578125  L 45.609375 54.6875  L 63.1875 54.6875  L 63.1875 5.515625  Q 63.1875 -7.671875 54.859375 -14.625  Q 46.53125 -21.578125 30.71875 -21.578125  Q 25.59375 -21.578125 20.796875 -20.796875  Q 16.015625 -20.015625 11.1875 -18.40625  L 11.1875 -4.78125  Q 15.765625 -7.421875 20.15625 -8.71875  Q 24.5625 -10.015625 29 -10.015625  Q 37.59375 -10.015625 41.59375 -6.25  Q 45.609375 -2.484375 45.609375 5.515625  z M 34.078125 43.3125  Q 28.65625 43.3125 25.625 39.296875  Q 22.609375 35.296875 22.609375 27.984375  Q 22.609375 20.453125 25.53125 16.578125  Q 28.46875 12.703125 34.078125 12.703125  Q 39.546875 12.703125 42.578125 16.703125  Q 45.609375 20.703125 45.609375 27.984375  Q 45.609375 35.296875 42.578125 39.296875  Q 39.546875 43.3125 34.078125 43.3125  z " id="DejaVuSans-Bold-103"/>
      <path d="M 63.375 33.296875  L 63.375 0  L 45.796875 0  L 45.796875 5.421875  L 45.796875 25.484375  Q 45.796875 32.5625 45.484375 35.25  Q 45.171875 37.9375 44.390625 39.203125  Q 43.359375 40.921875 41.59375 41.875  Q 39.84375 42.828125 37.59375 42.828125  Q 32.125 42.828125 29 38.59375  Q 25.875 34.375 25.875 26.90625  L 25.875 0  L 8.40625 0  L 8.40625 54.6875  L 25.875 54.6875  L 25.875 46.6875  Q 29.828125 51.46875 34.265625 53.734375  Q 38.71875 56 44.09375 56  Q 53.5625 56 58.46875 50.1875  Q 63.375 44.390625 63.375 33.296875  z " id="DejaVuSans-Bold-110"/>
      <path d="M 8.40625 54.6875  L 25.875 54.6875  L 25.875 0  L 8.40625 0  z M 8.40625 75.984375  L 25.875 75.984375  L 25.875 61.71875  L 8.40625 61.71875  z " id="DejaVuSans-Bold-105"/>
      <path d="M 27.484375 70.21875  L 27.484375 54.6875  L 45.515625 54.6875  L 45.515625 42.1875  L 27.484375 42.1875  L 27.484375 19  Q 27.484375 15.1875 29 13.84375  Q 30.515625 12.5 35.015625 12.5  L 44 12.5  L 44 0  L 29 0  Q 18.65625 0 14.328125 4.3125  Q 10.015625 8.640625 10.015625 19  L 10.015625 42.1875  L 1.3125 42.1875  L 1.3125 54.6875  L 10.015625 54.6875  L 10.015625 70.21875  z " id="DejaVuSans-Bold-116"/>
      <path d="M 7.8125 21.296875  L 7.8125 54.6875  L 25.390625 54.6875  L 25.390625 49.21875  Q 25.390625 44.78125 25.34375 38.0625  Q 25.296875 31.34375 25.296875 29.109375  Q 25.296875 22.515625 25.640625 19.609375  Q 25.984375 16.703125 26.8125 15.375  Q 27.875 13.671875 29.609375 12.734375  Q 31.34375 11.8125 33.59375 11.8125  Q 39.0625 11.8125 42.1875 16.015625  Q 45.3125 20.21875 45.3125 27.6875  L 45.3125 54.6875  L 62.796875 54.6875  L 62.796875 0  L 45.3125 0  L 45.3125 7.90625  Q 41.359375 3.125 36.9375 0.84375  Q 32.515625 -1.421875 27.203125 -1.421875  Q 17.71875 -1.421875 12.765625 4.390625  Q 7.8125 10.203125 7.8125 21.296875  z " id="DejaVuSans-Bold-117"/>
      <path d="M 45.609375 46.6875  L 45.609375 75.984375  L 63.1875 75.984375  L 63.1875 0  L 45.609375 0  L 45.609375 7.90625  Q 42 3.078125 37.640625 0.828125  Q 33.296875 -1.421875 27.59375 -1.421875  Q 17.484375 -1.421875 10.984375 6.609375  Q 4.5 14.65625 4.5 27.296875  Q 4.5 39.9375 10.984375 47.96875  Q 17.484375 56 27.59375 56  Q 33.25 56 37.625 53.734375  Q 42 51.46875 45.609375 46.6875  z M 34.078125 11.28125  Q 39.703125 11.28125 42.65625 15.375  Q 45.609375 19.484375 45.609375 27.296875  Q 45.609375 35.109375 42.65625 39.203125  Q 39.703125 43.3125 34.078125 43.3125  Q 28.515625 43.3125 25.5625 39.203125  Q 22.609375 35.109375 22.609375 27.296875  Q 22.609375 19.484375 25.5625 15.375  Q 28.515625 11.28125 34.078125 11.28125  z " id="DejaVuSans-Bold-100"/>
      <path d="M 62.984375 27.484375  L 62.984375 22.515625  L 22.125 22.515625  Q 22.75 16.359375 26.5625 13.28125  Q 30.375 10.203125 37.203125 10.203125  Q 42.71875 10.203125 48.5 11.84375  Q 54.296875 13.484375 60.40625 16.796875  L 60.40625 3.328125  Q 54.203125 0.984375 48 -0.21875  Q 41.796875 -1.421875 35.59375 -1.421875  Q 20.75 -1.421875 12.515625 6.125  Q 4.296875 13.671875 4.296875 27.296875  Q 4.296875 40.671875 12.375 48.328125  Q 20.453125 56 34.625 56  Q 47.515625 56 55.25 48.234375  Q 62.984375 40.484375 62.984375 27.484375  z M 45.015625 33.296875  Q 45.015625 38.28125 42.109375 41.328125  Q 39.203125 44.390625 34.515625 44.390625  Q 29.4375 44.390625 26.265625 41.53125  Q 23.09375 38.671875 22.3125 33.296875  z " id="DejaVuSans-Bold-101"/>
      <path id="DejaVuSans-32"/>
      <path d="M 31 75.875  Q 24.46875 64.65625 21.28125 53.65625  Q 18.109375 42.671875 18.109375 31.390625  Q 18.109375 20.125 21.3125 9.0625  Q 24.515625 -2 31 -13.1875  L 23.1875 -13.1875  Q 15.875 -1.703125 12.234375 9.375  Q 8.59375 20.453125 8.59375 31.390625  Q 8.59375 42.28125 12.203125 53.3125  Q 15.828125 64.359375 23.1875 75.875  z " id="DejaVuSans-40"/>
      <path d="M 45.40625 46.390625  L 45.40625 75.984375  L 54.390625 75.984375  L 54.390625 0  L 45.40625 0  L 45.40625 8.203125  Q 42.578125 3.328125 38.25 0.953125  Q 33.9375 -1.421875 27.875 -1.421875  Q 17.96875 -1.421875 11.734375 6.484375  Q 5.515625 14.40625 5.515625 27.296875  Q 5.515625 40.1875 11.734375 48.09375  Q 17.96875 56 27.875 56  Q 33.9375 56 38.25 53.625  Q 42.578125 51.265625 45.40625 46.390625  z M 14.796875 27.296875  Q 14.796875 17.390625 18.875 11.75  Q 22.953125 6.109375 30.078125 6.109375  Q 37.203125 6.109375 41.296875 11.75  Q 45.40625 17.390625 45.40625 27.296875  Q 45.40625 37.203125 41.296875 42.84375  Q 37.203125 48.484375 30.078125 48.484375  Q 22.953125 48.484375 18.875 42.84375  Q 14.796875 37.203125 14.796875 27.296875  z " id="DejaVuSans-100"/>
      <path d="M 19.671875 34.8125  L 19.671875 8.109375  L 35.5 8.109375  Q 43.453125 8.109375 47.28125 11.40625  Q 51.125 14.703125 51.125 21.484375  Q 51.125 28.328125 47.28125 31.5625  Q 43.453125 34.8125 35.5 34.8125  z M 19.671875 64.796875  L 19.671875 42.828125  L 34.28125 42.828125  Q 41.5 42.828125 45.03125 45.53125  Q 48.578125 48.25 48.578125 53.8125  Q 48.578125 59.328125 45.03125 62.0625  Q 41.5 64.796875 34.28125 64.796875  z M 9.8125 72.90625  L 35.015625 72.90625  Q 46.296875 72.90625 52.390625 68.21875  Q 58.5 63.53125 58.5 54.890625  Q 58.5 48.1875 55.375 44.234375  Q 52.25 40.28125 46.1875 39.3125  Q 53.46875 37.75 57.5 32.78125  Q 61.53125 27.828125 61.53125 20.40625  Q 61.53125 10.640625 54.890625 5.3125  Q 48.25 0 35.984375 0  L 9.8125 0  z " id="DejaVuSans-66"/>
      <path d="M 8.015625 75.875  L 15.828125 75.875  Q 23.140625 64.359375 26.78125 53.3125  Q 30.421875 42.28125 30.421875 31.390625  Q 30.421875 20.453125 26.78125 9.375  Q 23.140625 -1.703125 15.828125 -13.1875  L 8.015625 -13.1875  Q 14.5 -2 17.703125 9.0625  Q 20.90625 20.125 20.90625 31.390625  Q 20.90625 42.671875 17.703125 53.65625  Q 14.5 64.65625 8.015625 75.875  z " id="DejaVuSans-41"/>
     </defs>
     <g transform="translate(26.465313 139.926635)rotate(-90)scale(0.1 -0.1)">
      <use transform="translate(0 0.015625)" xlink:href="#DejaVuSans-Bold-77"/>
      <use transform="translate(99.511719 0.015625)" xlink:href="#DejaVuSans-Bold-97"/>
      <use transform="translate(166.992188 0.015625)" xlink:href="#DejaVuSans-Bold-103"/>
      <use transform="translate(238.574219 0.015625)" xlink:href="#DejaVuSans-Bold-110"/>
      <use transform="translate(309.765625 0.015625)" xlink:href="#DejaVuSans-Bold-105"/>
      <use transform="translate(344.042969 0.015625)" xlink:href="#DejaVuSans-Bold-116"/>
      <use transform="translate(391.845703 0.015625)" xlink:href="#DejaVuSans-Bold-117"/>
      <use transform="translate(463.037109 0.015625)" xlink:href="#DejaVuSans-Bold-100"/>
      <use transform="translate(534.619141 0.015625)" xlink:href="#DejaVuSans-Bold-101"/>
      <use transform="translate(602.441406 0.015625)" xlink:href="#DejaVuSans-32"/>
      <use transform="translate(634.228516 0.015625)" xlink:href="#DejaVuSans-40"/>
      <use transform="translate(673.242188 0.015625)" xlink:href="#DejaVuSans-100"/>
      <use transform="translate(736.71875 0.015625)" xlink:href="#DejaVuSans-66"/>
      <use transform="translate(805.322266 0.015625)" xlink:href="#DejaVuSans-41"/>
     </g>
    </g>
   </g>
   <g id="line2d_55">
    <path clip-path="url(#pf86e6e071b)" d="M 83.698636 68.104036  L 317.570727 67.99235  L 353.797973 67.758419  L 374.892318 67.416317  L 389.108073 66.980226  L 399.655245 66.445058  L 407.450982 65.843203  L 413.871 65.12636  L 418.9153 64.338059  L 423.042455 63.462919  L 426.252464 62.566261  L 429.0039 61.576156  L 431.296764 60.525893  L 433.131055 59.476779  L 434.965345 58.164154  L 436.341064 56.936554  L 437.716782 55.410526  L 439.0925 53.44573  L 440.009645 51.771713  L 440.926791 49.652823  L 441.843936 46.832101  L 442.761082 42.74926  L 443.219655 39.826959  L 443.678227 35.766521  L 444.1368 29.42752  L 444.595373 20.410161  L 445.512518 35.632066  L 445.971091 40.507832  L 446.888236 46.943113  L 447.805382 51.387962  L 448.722527 54.861628  L 450.098245 59.07282  L 451.473964 62.5876  L 453.308255 66.66158  L 456.059691 72.098336  L 462.938282 85.307482  L 464.772573 89.34373  L 466.606864 93.926304  L 467.982582 97.921921  L 469.3583 102.671358  L 470.275445 106.481207  L 471.192591 111.108661  L 472.109736 117.120419  L 472.568309 121.040132  L 473.026882 126.094455  L 473.485455 133.480724  L 473.944027 149.530966  L 474.4026 145.377341  L 474.861173 135.858426  L 475.319745 132.147831  L 475.778318 130.612809  L 476.236891 130.508963  L 476.695464 131.733592  L 477.612609 137.605754  L 478.071182 134.608477  L 478.988327 122.344538  L 479.905473 114.119724  L 480.822618 108.06462  L 482.198336 101.009275  L 483.574055 95.271148  L 485.408345 88.687964  L 491.369791 68.347376  L 492.286936 64.266214  L 493.204082 59.225856  L 493.662655 56.059821  L 494.121227 52.116154  L 494.5798 46.746709  L 495.496945 30.965536  L 495.955518 41.319498  L 496.414091 47.303079  L 496.872664 51.067997  L 497.789809 55.790267  L 498.706955 58.764673  L 499.6241 60.863363  L 500.541245 62.441627  L 501.458391 63.678401  L 502.834109 65.106143  L 504.209827 66.187814  L 506.044118 67.276838  L 507.878409 68.094894  L 510.171273 68.864519  L 512.922709 69.541712  L 516.591291 70.178404  L 521.177018 70.713327  L 527.138464 71.159275  L 535.392773 71.52694  L 542.271364 71.713872  L 542.271364 71.713872  " style="fill:none;stroke:#1f76b4;stroke-linecap:square;stroke-width:1.5;"/>
   </g>
   <g id="line2d_56">
    <path clip-path="url(#pf86e6e071b)" d="M 83.698636 174.943109  L 161.197427 161.336653  L 194.673236 155.246288  L 217.1433 150.945059  L 235.027636 147.303373  L 250.160536 144.003353  L 263.917718 140.782082  L 277.216327 137.436292  L 290.056364 133.973881  L 302.8964 130.282092  L 316.195009 126.226542  L 329.952191 121.798215  L 343.709373 117.142476  L 357.007982 112.416607  L 369.389445 107.782872  L 379.936618 103.604927  L 389.108073 99.735784  L 396.903809 96.207301  L 403.323827 93.073042  L 408.8267 90.162431  L 413.871 87.247812  L 417.998155 84.626322  L 421.666736 82.054624  L 424.876745 79.553712  L 427.628182 77.159123  L 430.379618 74.447  L 432.672482 71.849114  L 434.506773 69.459343  L 436.341064 66.674099  L 437.716782 64.213198  L 439.0925 61.279617  L 440.009645 58.940621  L 440.926791 56.146091  L 441.843936 52.66247  L 442.761082 48.056335  L 443.678227 41.7053  L 444.1368 38.399262  L 444.595373 37.426388  L 445.053945 39.778733  L 445.971091 45.968178  L 446.888236 50.428363  L 447.805382 53.624696  L 448.722527 56.054604  L 449.639673 57.985688  L 451.015391 60.260564  L 452.391109 62.028445  L 453.766827 63.444454  L 455.601118 64.939386  L 457.435409 66.10217  L 459.2697 67.012502  L 461.562564 67.870932  L 463.855427 68.475949  L 466.148291 68.865719  L 468.899727 69.079657  L 471.651164 69.031413  L 473.944027 68.788808  L 476.236891 68.348623  L 478.529755 67.685072  L 480.822618 66.754515  L 482.656909 65.770689  L 484.4912 64.511706  L 485.866918 63.332016  L 487.242636 61.882825  L 488.618355 60.06424  L 489.5355 58.566353  L 490.452645 56.745856  L 491.369791 54.461668  L 492.286936 51.451971  L 493.204082 47.141046  L 493.662655 44.072087  L 494.121227 39.799507  L 494.5798 32.969463  L 495.038373 21.826086  L 495.955518 39.42866  L 496.414091 44.22297  L 497.331236 50.398048  L 498.248382 54.548293  L 499.165527 57.704257  L 500.541245 61.394549  L 501.916964 64.329957  L 503.292682 66.787357  L 505.126973 69.566295  L 506.961264 71.950105  L 509.254127 74.541797  L 511.546991 76.821952  L 514.298427 79.258426  L 517.508436 81.795768  L 521.177018 84.398897  L 525.304173 87.047635  L 529.8899 89.732159  L 535.392773 92.686624  L 541.812791 95.861661  L 542.271364 96.079396  L 542.271364 96.079396  " style="fill:none;stroke:#7fbde9;stroke-dasharray:5.55,2.4;stroke-dashoffset:0;stroke-width:1.5;"/>
   </g>
   <g id="patch_3">
    <path d="M 60.77 182.669757  L 60.77 12.683514  " style="fill:none;stroke:#000000;stroke-linecap:square;stroke-linejoin:miter;stroke-width:0.8;"/>
   </g>
   <g id="patch_4">
    <path d="M 565.2 182.669757  L 565.2 12.683514  " style="fill:none;stroke:#000000;stroke-linecap:square;stroke-linejoin:miter;stroke-width:0.8;"/>
   </g>
   <g id="patch_5">
    <path d="M 60.77 182.669757  L 565.2 182.669757  " style="fill:none;stroke:#000000;stroke-linecap:square;stroke-linejoin:miter;stroke-width:0.8;"/>
   </g>
   <g id="patch_6">
    <path d="M 60.77 12.683514  L 565.2 12.683514  " style="fill:none;stroke:#000000;stroke-linecap:square;stroke-linejoin:miter;stroke-width:0.8;"/>
   </g>
   <g id="legend_1">
    <g id="patch_7">
     <path d="M 67.07 46.304139  L 227.27 46.304139  Q 229.07 46.304139 229.07 44.504139  L 229.07 18.983514  Q 229.07 17.183514 227.27 17.183514  L 67.07 17.183514  Q 65.27 17.183514 65.27 18.983514  L 65.27 44.504139  Q 65.27 46.304139 67.07 46.304139  z " style="fill:#ffffff;opacity:0.8;stroke:#cccccc;stroke-linejoin:miter;"/>
    </g>
    <g id="line2d_57">
     <path d="M 68.87 24.472107  L 86.87 24.472107  " style="fill:none;stroke:#1f76b4;stroke-linecap:square;stroke-width:1.5;"/>
    </g>
    <g id="line2d_58"/>
    <g id="text_13">
     <!-- $\bf{nlf}$ to $\bf{nout}$ (V/V) (LF Circuit) -->
     <defs>
      <path d="M 8.40625 75.984375  L 25.875 75.984375  L 25.875 0  L 8.40625 0  z " id="DejaVuSans-Bold-108"/>
      <path d="M 44.390625 75.984375  L 44.390625 64.5  L 34.71875 64.5  Q 31 64.5 29.53125 63.15625  Q 28.078125 61.8125 28.078125 58.5  L 28.078125 54.6875  L 43.015625 54.6875  L 43.015625 42.1875  L 28.078125 42.1875  L 28.078125 0  L 10.59375 0  L 10.59375 42.1875  L 1.90625 42.1875  L 1.90625 54.6875  L 10.59375 54.6875  L 10.59375 58.5  Q 10.59375 67.4375 15.578125 71.703125  Q 20.5625 75.984375 31 75.984375  z " id="DejaVuSans-Bold-102"/>
      <path d="M 18.3125 70.21875  L 18.3125 54.6875  L 36.8125 54.6875  L 36.8125 47.703125  L 18.3125 47.703125  L 18.3125 18.015625  Q 18.3125 11.328125 20.140625 9.421875  Q 21.96875 7.515625 27.59375 7.515625  L 36.8125 7.515625  L 36.8125 0  L 27.59375 0  Q 17.1875 0 13.234375 3.875  Q 9.28125 7.765625 9.28125 18.015625  L 9.28125 47.703125  L 2.6875 47.703125  L 2.6875 54.6875  L 9.28125 54.6875  L 9.28125 70.21875  z " id="DejaVuSans-116"/>
      <path d="M 30.609375 48.390625  Q 23.390625 48.390625 19.1875 42.75  Q 14.984375 37.109375 14.984375 27.296875  Q 14.984375 17.484375 19.15625 11.84375  Q 23.34375 6.203125 30.609375 6.203125  Q 37.796875 6.203125 41.984375 11.859375  Q 46.1875 17.53125 46.1875 27.296875  Q 46.1875 37.015625 41.984375 42.703125  Q 37.796875 48.390625 30.609375 48.390625  z M 30.609375 56  Q 42.328125 56 49.015625 48.375  Q 55.71875 40.765625 55.71875 27.296875  Q 55.71875 13.875 49.015625 6.21875  Q 42.328125 -1.421875 30.609375 -1.421875  Q 18.84375 -1.421875 12.171875 6.21875  Q 5.515625 13.875 5.515625 27.296875  Q 5.515625 40.765625 12.171875 48.375  Q 18.84375 56 30.609375 56  z " id="DejaVuSans-111"/>
      <path d="M 34.421875 43.5  Q 28.609375 43.5 25.5625 39.328125  Q 22.515625 35.15625 22.515625 27.296875  Q 22.515625 19.4375 25.5625 15.25  Q 28.609375 11.078125 34.421875 11.078125  Q 40.140625 11.078125 43.15625 15.25  Q 46.1875 19.4375 46.1875 27.296875  Q 46.1875 35.15625 43.15625 39.328125  Q 40.140625 43.5 34.421875 43.5  z M 34.421875 56  Q 48.53125 56 56.46875 48.375  Q 64.40625 40.765625 64.40625 27.296875  Q 64.40625 13.8125 56.46875 6.1875  Q 48.53125 -1.421875 34.421875 -1.421875  Q 20.265625 -1.421875 12.28125 6.1875  Q 4.296875 13.8125 4.296875 27.296875  Q 4.296875 40.765625 12.28125 48.375  Q 20.265625 56 34.421875 56  z " id="DejaVuSans-Bold-111"/>
      <path d="M 28.609375 0  L 0.78125 72.90625  L 11.078125 72.90625  L 34.1875 11.53125  L 57.328125 72.90625  L 67.578125 72.90625  L 39.796875 0  z " id="DejaVuSans-86"/>
      <path d="M 25.390625 72.90625  L 33.6875 72.90625  L 8.296875 -9.28125  L 0 -9.28125  z " id="DejaVuSans-47"/>
      <path d="M 9.8125 72.90625  L 19.671875 72.90625  L 19.671875 8.296875  L 55.171875 8.296875  L 55.171875 0  L 9.8125 0  z " id="DejaVuSans-76"/>
      <path d="M 9.8125 72.90625  L 51.703125 72.90625  L 51.703125 64.59375  L 19.671875 64.59375  L 19.671875 43.109375  L 48.578125 43.109375  L 48.578125 34.8125  L 19.671875 34.8125  L 19.671875 0  L 9.8125 0  z " id="DejaVuSans-70"/>
      <path d="M 64.40625 67.28125  L 64.40625 56.890625  Q 59.421875 61.53125 53.78125 63.8125  Q 48.140625 66.109375 41.796875 66.109375  Q 29.296875 66.109375 22.65625 58.46875  Q 16.015625 50.828125 16.015625 36.375  Q 16.015625 21.96875 22.65625 14.328125  Q 29.296875 6.6875 41.796875 6.6875  Q 48.140625 6.6875 53.78125 8.984375  Q 59.421875 11.28125 64.40625 15.921875  L 64.40625 5.609375  Q 59.234375 2.09375 53.4375 0.328125  Q 47.65625 -1.421875 41.21875 -1.421875  Q 24.65625 -1.421875 15.125 8.703125  Q 5.609375 18.84375 5.609375 36.375  Q 5.609375 53.953125 15.125 64.078125  Q 24.65625 74.21875 41.21875 74.21875  Q 47.75 74.21875 53.53125 72.484375  Q 59.328125 70.75 64.40625 67.28125  z " id="DejaVuSans-67"/>
      <path d="M 9.421875 54.6875  L 18.40625 54.6875  L 18.40625 0  L 9.421875 0  z M 9.421875 75.984375  L 18.40625 75.984375  L 18.40625 64.59375  L 9.421875 64.59375  z " id="DejaVuSans-105"/>
      <path d="M 41.109375 46.296875  Q 39.59375 47.171875 37.8125 47.578125  Q 36.03125 48 33.890625 48  Q 26.265625 48 22.1875 43.046875  Q 18.109375 38.09375 18.109375 28.8125  L 18.109375 0  L 9.078125 0  L 9.078125 54.6875  L 18.109375 54.6875  L 18.109375 46.1875  Q 20.953125 51.171875 25.484375 53.578125  Q 30.03125 56 36.53125 56  Q 37.453125 56 38.578125 55.875  Q 39.703125 55.765625 41.0625 55.515625  z " id="DejaVuSans-114"/>
      <path d="M 48.78125 52.59375  L 48.78125 44.1875  Q 44.96875 46.296875 41.140625 47.34375  Q 37.3125 48.390625 33.40625 48.390625  Q 24.65625 48.390625 19.8125 42.84375  Q 14.984375 37.3125 14.984375 27.296875  Q 14.984375 17.28125 19.8125 11.734375  Q 24.65625 6.203125 33.40625 6.203125  Q 37.3125 6.203125 41.140625 7.25  Q 44.96875 8.296875 48.78125 10.40625  L 48.78125 2.09375  Q 45.015625 0.34375 40.984375 -0.53125  Q 36.96875 -1.421875 32.421875 -1.421875  Q 20.0625 -1.421875 12.78125 6.34375  Q 5.515625 14.109375 5.515625 27.296875  Q 5.515625 40.671875 12.859375 48.328125  Q 20.21875 56 33.015625 56  Q 37.15625 56 41.109375 55.140625  Q 45.0625 54.296875 48.78125 52.59375  z " id="DejaVuSans-99"/>
      <path d="M 8.5 21.578125  L 8.5 54.6875  L 17.484375 54.6875  L 17.484375 21.921875  Q 17.484375 14.15625 20.5 10.265625  Q 23.53125 6.390625 29.59375 6.390625  Q 36.859375 6.390625 41.078125 11.03125  Q 45.3125 15.671875 45.3125 23.6875  L 45.3125 54.6875  L 54.296875 54.6875  L 54.296875 0  L 45.3125 0  L 45.3125 8.40625  Q 42.046875 3.421875 37.71875 1  Q 33.40625 -1.421875 27.6875 -1.421875  Q 18.265625 -1.421875 13.375 4.4375  Q 8.5 10.296875 8.5 21.578125  z M 31.109375 56  z " id="DejaVuSans-117"/>
     </defs>
     <g transform="translate(94.07 27.622107)scale(0.09 -0.09)">
      <use transform="translate(0 0.015625)" xlink:href="#DejaVuSans-Bold-110"/>
      <use transform="translate(71.191406 0.015625)" xlink:href="#DejaVuSans-Bold-108"/>
      <use transform="translate(105.46875 0.015625)" xlink:href="#DejaVuSans-Bold-102"/>
      <use transform="translate(148.974609 0.015625)" xlink:href="#DejaVuSans-32"/>
      <use transform="translate(180.761719 0.015625)" xlink:href="#DejaVuSans-116"/>
      <use transform="translate(219.970703 0.015625)" xlink:href="#DejaVuSans-111"/>
      <use transform="translate(281.152344 0.015625)" xlink:href="#DejaVuSans-32"/>
      <use transform="translate(312.939453 0.015625)" xlink:href="#DejaVuSans-Bold-110"/>
      <use transform="translate(384.130859 0.015625)" xlink:href="#DejaVuSans-Bold-111"/>
      <use transform="translate(452.832031 0.015625)" xlink:href="#DejaVuSans-Bold-117"/>
      <use transform="translate(524.023438 0.015625)" xlink:href="#DejaVuSans-Bold-116"/>
      <use transform="translate(571.826172 0.015625)" xlink:href="#DejaVuSans-32"/>
      <use transform="translate(603.613281 0.015625)" xlink:href="#DejaVuSans-40"/>
      <use transform="translate(642.626953 0.015625)" xlink:href="#DejaVuSans-86"/>
      <use transform="translate(711.035156 0.015625)" xlink:href="#DejaVuSans-47"/>
      <use transform="translate(744.726562 0.015625)" xlink:href="#DejaVuSans-86"/>
      <use transform="translate(813.134766 0.015625)" xlink:href="#DejaVuSans-41"/>
      <use transform="translate(852.148438 0.015625)" xlink:href="#DejaVuSans-32"/>
      <use transform="translate(883.935547 0.015625)" xlink:href="#DejaVuSans-40"/>
      <use transform="translate(922.949219 0.015625)" xlink:href="#DejaVuSans-76"/>
      <use transform="translate(978.662109 0.015625)" xlink:href="#DejaVuSans-70"/>
      <use transform="translate(1036.181641 0.015625)" xlink:href="#DejaVuSans-32"/>
      <use transform="translate(1067.96875 0.015625)" xlink:href="#DejaVuSans-67"/>
      <use transform="translate(1137.792969 0.015625)" xlink:href="#DejaVuSans-105"/>
      <use transform="translate(1165.576172 0.015625)" xlink:href="#DejaVuSans-114"/>
      <use transform="translate(1206.689453 0.015625)" xlink:href="#DejaVuSans-99"/>
      <use transform="translate(1261.669922 0.015625)" xlink:href="#DejaVuSans-117"/>
      <use transform="translate(1325.048828 0.015625)" xlink:href="#DejaVuSans-105"/>
      <use transform="translate(1352.832031 0.015625)" xlink:href="#DejaVuSans-116"/>
      <use transform="translate(1392.041016 0.015625)" xlink:href="#DejaVuSans-41"/>
     </g>
    </g>
    <g id="line2d_59">
     <path d="M 68.87 37.68242  L 86.87 37.68242  " style="fill:none;stroke:#7fbde9;stroke-dasharray:5.55,2.4;stroke-dashoffset:0;stroke-width:1.5;"/>
    </g>
    <g id="line2d_60"/>
    <g id="text_14">
     <!-- $\bf{nrf}$ to $\bf{nout}$ (V/V) (RF Circuit) -->
     <defs>
      <path d="M 49.03125 39.796875  Q 46.734375 40.875 44.453125 41.375  Q 42.1875 41.890625 39.890625 41.890625  Q 33.15625 41.890625 29.515625 37.5625  Q 25.875 33.25 25.875 25.203125  L 25.875 0  L 8.40625 0  L 8.40625 54.6875  L 25.875 54.6875  L 25.875 45.703125  Q 29.25 51.078125 33.609375 53.53125  Q 37.984375 56 44.09375 56  Q 44.96875 56 45.984375 55.921875  Q 47.015625 55.859375 48.96875 55.609375  z " id="DejaVuSans-Bold-114"/>
      <path d="M 44.390625 34.1875  Q 47.5625 33.109375 50.5625 29.59375  Q 53.5625 26.078125 56.59375 19.921875  L 66.609375 0  L 56 0  L 46.6875 18.703125  Q 43.0625 26.03125 39.671875 28.421875  Q 36.28125 30.8125 30.421875 30.8125  L 19.671875 30.8125  L 19.671875 0  L 9.8125 0  L 9.8125 72.90625  L 32.078125 72.90625  Q 44.578125 72.90625 50.734375 67.671875  Q 56.890625 62.453125 56.890625 51.90625  Q 56.890625 45.015625 53.6875 40.46875  Q 50.484375 35.9375 44.390625 34.1875  z M 19.671875 64.796875  L 19.671875 38.921875  L 32.078125 38.921875  Q 39.203125 38.921875 42.84375 42.21875  Q 46.484375 45.515625 46.484375 51.90625  Q 46.484375 58.296875 42.84375 61.546875  Q 39.203125 64.796875 32.078125 64.796875  z " id="DejaVuSans-82"/>
     </defs>
     <g transform="translate(94.07 40.83242)scale(0.09 -0.09)">
      <use transform="translate(0 0.015625)" xlink:href="#DejaVuSans-Bold-110"/>
      <use transform="translate(71.191406 0.015625)" xlink:href="#DejaVuSans-Bold-114"/>
      <use transform="translate(120.507812 0.015625)" xlink:href="#DejaVuSans-Bold-102"/>
      <use transform="translate(164.013672 0.015625)" xlink:href="#DejaVuSans-32"/>
      <use transform="translate(195.800781 0.015625)" xlink:href="#DejaVuSans-116"/>
      <use transform="translate(235.009766 0.015625)" xlink:href="#DejaVuSans-111"/>
      <use transform="translate(296.191406 0.015625)" xlink:href="#DejaVuSans-32"/>
      <use transform="translate(327.978516 0.015625)" xlink:href="#DejaVuSans-Bold-110"/>
      <use transform="translate(399.169922 0.015625)" xlink:href="#DejaVuSans-Bold-111"/>
      <use transform="translate(467.871094 0.015625)" xlink:href="#DejaVuSans-Bold-117"/>
      <use transform="translate(539.0625 0.015625)" xlink:href="#DejaVuSans-Bold-116"/>
      <use transform="translate(586.865234 0.015625)" xlink:href="#DejaVuSans-32"/>
      <use transform="translate(618.652344 0.015625)" xlink:href="#DejaVuSans-40"/>
      <use transform="translate(657.666016 0.015625)" xlink:href="#DejaVuSans-86"/>
      <use transform="translate(726.074219 0.015625)" xlink:href="#DejaVuSans-47"/>
      <use transform="translate(759.765625 0.015625)" xlink:href="#DejaVuSans-86"/>
      <use transform="translate(828.173828 0.015625)" xlink:href="#DejaVuSans-41"/>
      <use transform="translate(867.1875 0.015625)" xlink:href="#DejaVuSans-32"/>
      <use transform="translate(898.974609 0.015625)" xlink:href="#DejaVuSans-40"/>
      <use transform="translate(937.988281 0.015625)" xlink:href="#DejaVuSans-82"/>
      <use transform="translate(1007.470703 0.015625)" xlink:href="#DejaVuSans-70"/>
      <use transform="translate(1064.990234 0.015625)" xlink:href="#DejaVuSans-32"/>
      <use transform="translate(1096.777344 0.015625)" xlink:href="#DejaVuSans-67"/>
      <use transform="translate(1166.601562 0.015625)" xlink:href="#DejaVuSans-105"/>
      <use transform="translate(1194.384766 0.015625)" xlink:href="#DejaVuSans-114"/>
      <use transform="translate(1235.498047 0.015625)" xlink:href="#DejaVuSans-99"/>
      <use transform="translate(1290.478516 0.015625)" xlink:href="#DejaVuSans-117"/>
      <use transform="translate(1353.857422 0.015625)" xlink:href="#DejaVuSans-105"/>
      <use transform="translate(1381.640625 0.015625)" xlink:href="#DejaVuSans-116"/>
      <use transform="translate(1420.849609 0.015625)" xlink:href="#DejaVuSans-41"/>
     </g>
    </g>
   </g>
  </g>
  <g id="axes_2">
   <g id="patch_8">
    <path d="M 60.77 383.848  L 565.2 383.848  L 565.2 213.861757  L 60.77 213.861757  z " style="fill:#ffffff;"/>
   </g>
   <g id="matplotlib.axis_3">
    <g id="xtick_31">
     <g id="line2d_61">
      <path clip-path="url(#pa22044111c)" d="M 83.698636 383.848  L 83.698636 213.861757  " style="fill:none;stroke:#b0b0b0;stroke-linecap:square;stroke-width:0.8;"/>
     </g>
     <g id="line2d_62">
      <g>
       <use style="stroke:#000000;stroke-width:0.8;" x="83.698636" xlink:href="#mdbdc128688" y="383.848"/>
      </g>
     </g>
     <g id="text_15">
      <!-- $\mathdefault{10^{5}}$ -->
      <g transform="translate(74.898636 398.446438)scale(0.1 -0.1)">
       <use transform="translate(0 0.684375)" xlink:href="#DejaVuSans-49"/>
       <use transform="translate(63.623047 0.684375)" xlink:href="#DejaVuSans-48"/>
       <use transform="translate(128.203125 38.965625)scale(0.7)" xlink:href="#DejaVuSans-53"/>
      </g>
     </g>
    </g>
    <g id="xtick_32">
     <g id="line2d_63">
      <path clip-path="url(#pa22044111c)" d="M 236.556212 383.848  L 236.556212 213.861757  " style="fill:none;stroke:#b0b0b0;stroke-linecap:square;stroke-width:0.8;"/>
     </g>
     <g id="line2d_64">
      <g>
       <use style="stroke:#000000;stroke-width:0.8;" x="236.556212" xlink:href="#mdbdc128688" y="383.848"/>
      </g>
     </g>
     <g id="text_16">
      <!-- $\mathdefault{10^{6}}$ -->
      <g transform="translate(227.756212 398.446438)scale(0.1 -0.1)">
       <use transform="translate(0 0.765625)" xlink:href="#DejaVuSans-49"/>
       <use transform="translate(63.623047 0.765625)" xlink:href="#DejaVuSans-48"/>
       <use transform="translate(128.203125 39.046875)scale(0.7)" xlink:href="#DejaVuSans-54"/>
      </g>
     </g>
    </g>
    <g id="xtick_33">
     <g id="line2d_65">
      <path clip-path="url(#pa22044111c)" d="M 389.413788 383.848  L 389.413788 213.861757  " style="fill:none;stroke:#b0b0b0;stroke-linecap:square;stroke-width:0.8;"/>
     </g>
     <g id="line2d_66">
      <g>
       <use style="stroke:#000000;stroke-width:0.8;" x="389.413788" xlink:href="#mdbdc128688" y="383.848"/>
      </g>
     </g>
     <g id="text_17">
      <!-- $\mathdefault{10^{7}}$ -->
      <g transform="translate(380.613788 398.446438)scale(0.1 -0.1)">
       <use transform="translate(0 0.684375)" xlink:href="#DejaVuSans-49"/>
       <use transform="translate(63.623047 0.684375)" xlink:href="#DejaVuSans-48"/>
       <use transform="translate(128.203125 38.965625)scale(0.7)" xlink:href="#DejaVuSans-55"/>
      </g>
     </g>
    </g>
    <g id="xtick_34">
     <g id="line2d_67">
      <path clip-path="url(#pa22044111c)" d="M 542.271364 383.848  L 542.271364 213.861757  " style="fill:none;stroke:#b0b0b0;stroke-linecap:square;stroke-width:0.8;"/>
     </g>
     <g id="line2d_68">
      <g>
       <use style="stroke:#000000;stroke-width:0.8;" x="542.271364" xlink:href="#mdbdc128688" y="383.848"/>
      </g>
     </g>
     <g id="text_18">
      <!-- $\mathdefault{10^{8}}$ -->
      <g transform="translate(533.471364 398.446438)scale(0.1 -0.1)">
       <use transform="translate(0 0.765625)" xlink:href="#DejaVuSans-49"/>
       <use transform="translate(63.623047 0.765625)" xlink:href="#DejaVuSans-48"/>
       <use transform="translate(128.203125 39.046875)scale(0.7)" xlink:href="#DejaVuSans-56"/>
      </g>
     </g>
    </g>
    <g id="xtick_35">
     <g id="line2d_69">
      <g>
       <use style="stroke:#000000;stroke-width:0.6;" x="68.885207" xlink:href="#m8faf25157a" y="383.848"/>
      </g>
     </g>
    </g>
    <g id="xtick_36">
     <g id="line2d_70">
      <g>
       <use style="stroke:#000000;stroke-width:0.6;" x="76.704257" xlink:href="#m8faf25157a" y="383.848"/>
      </g>
     </g>
    </g>
    <g id="xtick_37">
     <g id="line2d_71">
      <g>
       <use style="stroke:#000000;stroke-width:0.6;" x="129.713352" xlink:href="#m8faf25157a" y="383.848"/>
      </g>
     </g>
    </g>
    <g id="xtick_38">
     <g id="line2d_72">
      <g>
       <use style="stroke:#000000;stroke-width:0.6;" x="156.630235" xlink:href="#m8faf25157a" y="383.848"/>
      </g>
     </g>
    </g>
    <g id="xtick_39">
     <g id="line2d_73">
      <g>
       <use style="stroke:#000000;stroke-width:0.6;" x="175.728067" xlink:href="#m8faf25157a" y="383.848"/>
      </g>
     </g>
    </g>
    <g id="xtick_40">
     <g id="line2d_74">
      <g>
       <use style="stroke:#000000;stroke-width:0.6;" x="190.541497" xlink:href="#m8faf25157a" y="383.848"/>
      </g>
     </g>
    </g>
    <g id="xtick_41">
     <g id="line2d_75">
      <g>
       <use style="stroke:#000000;stroke-width:0.6;" x="202.64495" xlink:href="#m8faf25157a" y="383.848"/>
      </g>
     </g>
    </g>
    <g id="xtick_42">
     <g id="line2d_76">
      <g>
       <use style="stroke:#000000;stroke-width:0.6;" x="212.878274" xlink:href="#m8faf25157a" y="383.848"/>
      </g>
     </g>
    </g>
    <g id="xtick_43">
     <g id="line2d_77">
      <g>
       <use style="stroke:#000000;stroke-width:0.6;" x="221.742782" xlink:href="#m8faf25157a" y="383.848"/>
      </g>
     </g>
    </g>
    <g id="xtick_44">
     <g id="line2d_78">
      <g>
       <use style="stroke:#000000;stroke-width:0.6;" x="229.561833" xlink:href="#m8faf25157a" y="383.848"/>
      </g>
     </g>
    </g>
    <g id="xtick_45">
     <g id="line2d_79">
      <g>
       <use style="stroke:#000000;stroke-width:0.6;" x="282.570927" xlink:href="#m8faf25157a" y="383.848"/>
      </g>
     </g>
    </g>
    <g id="xtick_46">
     <g id="line2d_80">
      <g>
       <use style="stroke:#000000;stroke-width:0.6;" x="309.48781" xlink:href="#m8faf25157a" y="383.848"/>
      </g>
     </g>
    </g>
    <g id="xtick_47">
     <g id="line2d_81">
      <g>
       <use style="stroke:#000000;stroke-width:0.6;" x="328.585643" xlink:href="#m8faf25157a" y="383.848"/>
      </g>
     </g>
    </g>
    <g id="xtick_48">
     <g id="line2d_82">
      <g>
       <use style="stroke:#000000;stroke-width:0.6;" x="343.399073" xlink:href="#m8faf25157a" y="383.848"/>
      </g>
     </g>
    </g>
    <g id="xtick_49">
     <g id="line2d_83">
      <g>
       <use style="stroke:#000000;stroke-width:0.6;" x="355.502526" xlink:href="#m8faf25157a" y="383.848"/>
      </g>
     </g>
    </g>
    <g id="xtick_50">
     <g id="line2d_84">
      <g>
       <use style="stroke:#000000;stroke-width:0.6;" x="365.73585" xlink:href="#m8faf25157a" y="383.848"/>
      </g>
     </g>
    </g>
    <g id="xtick_51">
     <g id="line2d_85">
      <g>
       <use style="stroke:#000000;stroke-width:0.6;" x="374.600358" xlink:href="#m8faf25157a" y="383.848"/>
      </g>
     </g>
    </g>
    <g id="xtick_52">
     <g id="line2d_86">
      <g>
       <use style="stroke:#000000;stroke-width:0.6;" x="382.419409" xlink:href="#m8faf25157a" y="383.848"/>
      </g>
     </g>
    </g>
    <g id="xtick_53">
     <g id="line2d_87">
      <g>
       <use style="stroke:#000000;stroke-width:0.6;" x="435.428503" xlink:href="#m8faf25157a" y="383.848"/>
      </g>
     </g>
    </g>
    <g id="xtick_54">
     <g id="line2d_88">
      <g>
       <use style="stroke:#000000;stroke-width:0.6;" x="462.345386" xlink:href="#m8faf25157a" y="383.848"/>
      </g>
     </g>
    </g>
    <g id="xtick_55">
     <g id="line2d_89">
      <g>
       <use style="stroke:#000000;stroke-width:0.6;" x="481.443219" xlink:href="#m8faf25157a" y="383.848"/>
      </g>
     </g>
    </g>
    <g id="xtick_56">
     <g id="line2d_90">
      <g>
       <use style="stroke:#000000;stroke-width:0.6;" x="496.256648" xlink:href="#m8faf25157a" y="383.848"/>
      </g>
     </g>
    </g>
    <g id="xtick_57">
     <g id="line2d_91">
      <g>
       <use style="stroke:#000000;stroke-width:0.6;" x="508.360102" xlink:href="#m8faf25157a" y="383.848"/>
      </g>
     </g>
    </g>
    <g id="xtick_58">
     <g id="line2d_92">
      <g>
       <use style="stroke:#000000;stroke-width:0.6;" x="518.593426" xlink:href="#m8faf25157a" y="383.848"/>
      </g>
     </g>
    </g>
    <g id="xtick_59">
     <g id="line2d_93">
      <g>
       <use style="stroke:#000000;stroke-width:0.6;" x="527.457934" xlink:href="#m8faf25157a" y="383.848"/>
      </g>
     </g>
    </g>
    <g id="xtick_60">
     <g id="line2d_94">
      <g>
       <use style="stroke:#000000;stroke-width:0.6;" x="535.276985" xlink:href="#m8faf25157a" y="383.848"/>
      </g>
     </g>
    </g>
    <g id="text_19">
     <!-- $\bf{Frequency}$ (Hz) -->
     <defs>
      <path d="M 9.1875 72.90625  L 59.90625 72.90625  L 59.90625 58.6875  L 27.984375 58.6875  L 27.984375 45.125  L 58.015625 45.125  L 58.015625 30.90625  L 27.984375 30.90625  L 27.984375 0  L 9.1875 0  z " id="DejaVuSans-Bold-70"/>
      <path d="M 34.078125 43.3125  Q 28.515625 43.3125 25.5625 39.203125  Q 22.609375 35.109375 22.609375 27.296875  Q 22.609375 19.484375 25.5625 15.375  Q 28.515625 11.28125 34.078125 11.28125  Q 39.703125 11.28125 42.65625 15.375  Q 45.609375 19.484375 45.609375 27.296875  Q 45.609375 35.109375 42.65625 39.203125  Q 39.703125 43.3125 34.078125 43.3125  z M 45.609375 7.90625  Q 42 3.078125 37.640625 0.828125  Q 33.296875 -1.421875 27.59375 -1.421875  Q 17.484375 -1.421875 10.984375 6.609375  Q 4.5 14.65625 4.5 27.296875  Q 4.5 39.9375 10.984375 47.921875  Q 17.484375 55.90625 27.59375 55.90625  Q 33.296875 55.90625 37.640625 53.65625  Q 42 51.421875 45.609375 46.578125  L 45.609375 54.6875  L 63.1875 54.6875  L 63.1875 -20.796875  L 45.609375 -20.796875  z " id="DejaVuSans-Bold-113"/>
      <path d="M 52.59375 52.984375  L 52.59375 38.71875  Q 49.03125 41.15625 45.4375 42.328125  Q 41.84375 43.5 37.984375 43.5  Q 30.671875 43.5 26.59375 39.234375  Q 22.515625 34.96875 22.515625 27.296875  Q 22.515625 19.625 26.59375 15.34375  Q 30.671875 11.078125 37.984375 11.078125  Q 42.09375 11.078125 45.78125 12.296875  Q 49.46875 13.53125 52.59375 15.921875  L 52.59375 1.609375  Q 48.484375 0.09375 44.265625 -0.65625  Q 40.046875 -1.421875 35.796875 -1.421875  Q 21 -1.421875 12.640625 6.171875  Q 4.296875 13.765625 4.296875 27.296875  Q 4.296875 40.828125 12.640625 48.40625  Q 21 56 35.796875 56  Q 40.09375 56 44.265625 55.25  Q 48.4375 54.5 52.59375 52.984375  z " id="DejaVuSans-Bold-99"/>
      <path d="M 1.21875 54.6875  L 18.703125 54.6875  L 33.40625 17.578125  L 45.90625 54.6875  L 63.375 54.6875  L 40.375 -5.171875  Q 36.921875 -14.3125 32.296875 -17.9375  Q 27.6875 -21.578125 20.125 -21.578125  L 10.015625 -21.578125  L 10.015625 -10.109375  L 15.484375 -10.109375  Q 19.921875 -10.109375 21.9375 -8.6875  Q 23.96875 -7.28125 25.09375 -3.609375  L 25.59375 -2.09375  z " id="DejaVuSans-Bold-121"/>
      <path d="M 9.8125 72.90625  L 19.671875 72.90625  L 19.671875 43.015625  L 55.515625 43.015625  L 55.515625 72.90625  L 65.375 72.90625  L 65.375 0  L 55.515625 0  L 55.515625 34.71875  L 19.671875 34.71875  L 19.671875 0  L 9.8125 0  z " id="DejaVuSans-72"/>
      <path d="M 5.515625 54.6875  L 48.1875 54.6875  L 48.1875 46.484375  L 14.40625 7.171875  L 48.1875 7.171875  L 48.1875 0  L 4.296875 0  L 4.296875 8.203125  L 38.09375 47.515625  L 5.515625 47.515625  z " id="DejaVuSans-122"/>
     </defs>
     <g transform="translate(271.485 412.126125)scale(0.1 -0.1)">
      <use transform="translate(0 0.125)" xlink:href="#DejaVuSans-Bold-70"/>
      <use transform="translate(68.310547 0.125)" xlink:href="#DejaVuSans-Bold-114"/>
      <use transform="translate(117.626953 0.125)" xlink:href="#DejaVuSans-Bold-101"/>
      <use transform="translate(185.449219 0.125)" xlink:href="#DejaVuSans-Bold-113"/>
      <use transform="translate(257.03125 0.125)" xlink:href="#DejaVuSans-Bold-117"/>
      <use transform="translate(328.222656 0.125)" xlink:href="#DejaVuSans-Bold-101"/>
      <use transform="translate(396.044922 0.125)" xlink:href="#DejaVuSans-Bold-110"/>
      <use transform="translate(467.236328 0.125)" xlink:href="#DejaVuSans-Bold-99"/>
      <use transform="translate(526.513672 0.125)" xlink:href="#DejaVuSans-Bold-121"/>
      <use transform="translate(591.699219 0.125)" xlink:href="#DejaVuSans-32"/>
      <use transform="translate(623.486328 0.125)" xlink:href="#DejaVuSans-40"/>
      <use transform="translate(662.5 0.125)" xlink:href="#DejaVuSans-72"/>
      <use transform="translate(737.695312 0.125)" xlink:href="#DejaVuSans-122"/>
      <use transform="translate(790.185547 0.125)" xlink:href="#DejaVuSans-41"/>
     </g>
    </g>
   </g>
   <g id="matplotlib.axis_4">
    <g id="ytick_14">
     <g id="line2d_95">
      <path clip-path="url(#pa22044111c)" d="M 60.77 377.076834  L 565.2 377.076834  " style="fill:none;stroke:#b0b0b0;stroke-linecap:square;stroke-width:0.8;"/>
     </g>
     <g id="line2d_96">
      <g>
       <use style="stroke:#000000;stroke-width:0.8;" x="60.77" xlink:href="#ma8e05ee773" y="377.076834"/>
      </g>
     </g>
     <g id="text_20">
      <!-- −180 -->
      <g transform="translate(26.302813 380.876053)scale(0.1 -0.1)">
       <use xlink:href="#DejaVuSans-8722"/>
       <use x="83.789062" xlink:href="#DejaVuSans-49"/>
       <use x="147.412109" xlink:href="#DejaVuSans-56"/>
       <use x="211.035156" xlink:href="#DejaVuSans-48"/>
      </g>
     </g>
    </g>
    <g id="ytick_15">
     <g id="line2d_97">
      <path clip-path="url(#pa22044111c)" d="M 60.77 363.974639  L 565.2 363.974639  " style="fill:none;stroke:#b0b0b0;stroke-linecap:square;stroke-width:0.8;"/>
     </g>
     <g id="line2d_98">
      <g>
       <use style="stroke:#000000;stroke-width:0.8;" x="60.77" xlink:href="#ma8e05ee773" y="363.974639"/>
      </g>
     </g>
     <g id="text_21">
      <!-- −150 -->
      <g transform="translate(26.302813 367.773858)scale(0.1 -0.1)">
       <use xlink:href="#DejaVuSans-8722"/>
       <use x="83.789062" xlink:href="#DejaVuSans-49"/>
       <use x="147.412109" xlink:href="#DejaVuSans-53"/>
       <use x="211.035156" xlink:href="#DejaVuSans-48"/>
      </g>
     </g>
    </g>
    <g id="ytick_16">
     <g id="line2d_99">
      <path clip-path="url(#pa22044111c)" d="M 60.77 350.872444  L 565.2 350.872444  " style="fill:none;stroke:#b0b0b0;stroke-linecap:square;stroke-width:0.8;"/>
     </g>
     <g id="line2d_100">
      <g>
       <use style="stroke:#000000;stroke-width:0.8;" x="60.77" xlink:href="#ma8e05ee773" y="350.872444"/>
      </g>
     </g>
     <g id="text_22">
      <!-- −120 -->
      <g transform="translate(26.302813 354.671663)scale(0.1 -0.1)">
       <use xlink:href="#DejaVuSans-8722"/>
       <use x="83.789062" xlink:href="#DejaVuSans-49"/>
       <use x="147.412109" xlink:href="#DejaVuSans-50"/>
       <use x="211.035156" xlink:href="#DejaVuSans-48"/>
      </g>
     </g>
    </g>
    <g id="ytick_17">
     <g id="line2d_101">
      <path clip-path="url(#pa22044111c)" d="M 60.77 337.770249  L 565.2 337.770249  " style="fill:none;stroke:#b0b0b0;stroke-linecap:square;stroke-width:0.8;"/>
     </g>
     <g id="line2d_102">
      <g>
       <use style="stroke:#000000;stroke-width:0.8;" x="60.77" xlink:href="#ma8e05ee773" y="337.770249"/>
      </g>
     </g>
     <g id="text_23">
      <!-- −90 -->
      <defs>
       <path d="M 10.984375 1.515625  L 10.984375 10.5  Q 14.703125 8.734375 18.5 7.8125  Q 22.3125 6.890625 25.984375 6.890625  Q 35.75 6.890625 40.890625 13.453125  Q 46.046875 20.015625 46.78125 33.40625  Q 43.953125 29.203125 39.59375 26.953125  Q 35.25 24.703125 29.984375 24.703125  Q 19.046875 24.703125 12.671875 31.3125  Q 6.296875 37.9375 6.296875 49.421875  Q 6.296875 60.640625 12.9375 67.421875  Q 19.578125 74.21875 30.609375 74.21875  Q 43.265625 74.21875 49.921875 64.515625  Q 56.59375 54.828125 56.59375 36.375  Q 56.59375 19.140625 48.40625 8.859375  Q 40.234375 -1.421875 26.421875 -1.421875  Q 22.703125 -1.421875 18.890625 -0.6875  Q 15.09375 0.046875 10.984375 1.515625  z M 30.609375 32.421875  Q 37.25 32.421875 41.125 36.953125  Q 45.015625 41.5 45.015625 49.421875  Q 45.015625 57.28125 41.125 61.84375  Q 37.25 66.40625 30.609375 66.40625  Q 23.96875 66.40625 20.09375 61.84375  Q 16.21875 57.28125 16.21875 49.421875  Q 16.21875 41.5 20.09375 36.953125  Q 23.96875 32.421875 30.609375 32.421875  z " id="DejaVuSans-57"/>
      </defs>
      <g transform="translate(32.665313 341.569468)scale(0.1 -0.1)">
       <use xlink:href="#DejaVuSans-8722"/>
       <use x="83.789062" xlink:href="#DejaVuSans-57"/>
       <use x="147.412109" xlink:href="#DejaVuSans-48"/>
      </g>
     </g>
    </g>
    <g id="ytick_18">
     <g id="line2d_103">
      <path clip-path="url(#pa22044111c)" d="M 60.77 324.668055  L 565.2 324.668055  " style="fill:none;stroke:#b0b0b0;stroke-linecap:square;stroke-width:0.8;"/>
     </g>
     <g id="line2d_104">
      <g>
       <use style="stroke:#000000;stroke-width:0.8;" x="60.77" xlink:href="#ma8e05ee773" y="324.668055"/>
      </g>
     </g>
     <g id="text_24">
      <!-- −60 -->
      <g transform="translate(32.665313 328.467273)scale(0.1 -0.1)">
       <use xlink:href="#DejaVuSans-8722"/>
       <use x="83.789062" xlink:href="#DejaVuSans-54"/>
       <use x="147.412109" xlink:href="#DejaVuSans-48"/>
      </g>
     </g>
    </g>
    <g id="ytick_19">
     <g id="line2d_105">
      <path clip-path="url(#pa22044111c)" d="M 60.77 311.56586  L 565.2 311.56586  " style="fill:none;stroke:#b0b0b0;stroke-linecap:square;stroke-width:0.8;"/>
     </g>
     <g id="line2d_106">
      <g>
       <use style="stroke:#000000;stroke-width:0.8;" x="60.77" xlink:href="#ma8e05ee773" y="311.56586"/>
      </g>
     </g>
     <g id="text_25">
      <!-- −30 -->
      <defs>
       <path d="M 40.578125 39.3125  Q 47.65625 37.796875 51.625 33  Q 55.609375 28.21875 55.609375 21.1875  Q 55.609375 10.40625 48.1875 4.484375  Q 40.765625 -1.421875 27.09375 -1.421875  Q 22.515625 -1.421875 17.65625 -0.515625  Q 12.796875 0.390625 7.625 2.203125  L 7.625 11.71875  Q 11.71875 9.328125 16.59375 8.109375  Q 21.484375 6.890625 26.8125 6.890625  Q 36.078125 6.890625 40.9375 10.546875  Q 45.796875 14.203125 45.796875 21.1875  Q 45.796875 27.640625 41.28125 31.265625  Q 36.765625 34.90625 28.71875 34.90625  L 20.21875 34.90625  L 20.21875 43.015625  L 29.109375 43.015625  Q 36.375 43.015625 40.234375 45.921875  Q 44.09375 48.828125 44.09375 54.296875  Q 44.09375 59.90625 40.109375 62.90625  Q 36.140625 65.921875 28.71875 65.921875  Q 24.65625 65.921875 20.015625 65.03125  Q 15.375 64.15625 9.8125 62.3125  L 9.8125 71.09375  Q 15.4375 72.65625 20.34375 73.4375  Q 25.25 74.21875 29.59375 74.21875  Q 40.828125 74.21875 47.359375 69.109375  Q 53.90625 64.015625 53.90625 55.328125  Q 53.90625 49.265625 50.4375 45.09375  Q 46.96875 40.921875 40.578125 39.3125  z " id="DejaVuSans-51"/>
      </defs>
      <g transform="translate(32.665313 315.365078)scale(0.1 -0.1)">
       <use xlink:href="#DejaVuSans-8722"/>
       <use x="83.789062" xlink:href="#DejaVuSans-51"/>
       <use x="147.412109" xlink:href="#DejaVuSans-48"/>
      </g>
     </g>
    </g>
    <g id="ytick_20">
     <g id="line2d_107">
      <path clip-path="url(#pa22044111c)" d="M 60.77 298.463665  L 565.2 298.463665  " style="fill:none;stroke:#b0b0b0;stroke-linecap:square;stroke-width:0.8;"/>
     </g>
     <g id="line2d_108">
      <g>
       <use style="stroke:#000000;stroke-width:0.8;" x="60.77" xlink:href="#ma8e05ee773" y="298.463665"/>
      </g>
     </g>
     <g id="text_26">
      <!-- 0 -->
      <g transform="translate(47.4075 302.262883)scale(0.1 -0.1)">
       <use xlink:href="#DejaVuSans-48"/>
      </g>
     </g>
    </g>
    <g id="ytick_21">
     <g id="line2d_109">
      <path clip-path="url(#pa22044111c)" d="M 60.77 285.36147  L 565.2 285.36147  " style="fill:none;stroke:#b0b0b0;stroke-linecap:square;stroke-width:0.8;"/>
     </g>
     <g id="line2d_110">
      <g>
       <use style="stroke:#000000;stroke-width:0.8;" x="60.77" xlink:href="#ma8e05ee773" y="285.36147"/>
      </g>
     </g>
     <g id="text_27">
      <!-- 30 -->
      <g transform="translate(41.045 289.160689)scale(0.1 -0.1)">
       <use xlink:href="#DejaVuSans-51"/>
       <use x="63.623047" xlink:href="#DejaVuSans-48"/>
      </g>
     </g>
    </g>
    <g id="ytick_22">
     <g id="line2d_111">
      <path clip-path="url(#pa22044111c)" d="M 60.77 272.259275  L 565.2 272.259275  " style="fill:none;stroke:#b0b0b0;stroke-linecap:square;stroke-width:0.8;"/>
     </g>
     <g id="line2d_112">
      <g>
       <use style="stroke:#000000;stroke-width:0.8;" x="60.77" xlink:href="#ma8e05ee773" y="272.259275"/>
      </g>
     </g>
     <g id="text_28">
      <!-- 60 -->
      <g transform="translate(41.045 276.058494)scale(0.1 -0.1)">
       <use xlink:href="#DejaVuSans-54"/>
       <use x="63.623047" xlink:href="#DejaVuSans-48"/>
      </g>
     </g>
    </g>
    <g id="ytick_23">
     <g id="line2d_113">
      <path clip-path="url(#pa22044111c)" d="M 60.77 259.15708  L 565.2 259.15708  " style="fill:none;stroke:#b0b0b0;stroke-linecap:square;stroke-width:0.8;"/>
     </g>
     <g id="line2d_114">
      <g>
       <use style="stroke:#000000;stroke-width:0.8;" x="60.77" xlink:href="#ma8e05ee773" y="259.15708"/>
      </g>
     </g>
     <g id="text_29">
      <!-- 90 -->
      <g transform="translate(41.045 262.956299)scale(0.1 -0.1)">
       <use xlink:href="#DejaVuSans-57"/>
       <use x="63.623047" xlink:href="#DejaVuSans-48"/>
      </g>
     </g>
    </g>
    <g id="ytick_24">
     <g id="line2d_115">
      <path clip-path="url(#pa22044111c)" d="M 60.77 246.054885  L 565.2 246.054885  " style="fill:none;stroke:#b0b0b0;stroke-linecap:square;stroke-width:0.8;"/>
     </g>
     <g id="line2d_116">
      <g>
       <use style="stroke:#000000;stroke-width:0.8;" x="60.77" xlink:href="#ma8e05ee773" y="246.054885"/>
      </g>
     </g>
     <g id="text_30">
      <!-- 120 -->
      <g transform="translate(34.6825 249.854104)scale(0.1 -0.1)">
       <use xlink:href="#DejaVuSans-49"/>
       <use x="63.623047" xlink:href="#DejaVuSans-50"/>
       <use x="127.246094" xlink:href="#DejaVuSans-48"/>
      </g>
     </g>
    </g>
    <g id="ytick_25">
     <g id="line2d_117">
      <path clip-path="url(#pa22044111c)" d="M 60.77 232.95269  L 565.2 232.95269  " style="fill:none;stroke:#b0b0b0;stroke-linecap:square;stroke-width:0.8;"/>
     </g>
     <g id="line2d_118">
      <g>
       <use style="stroke:#000000;stroke-width:0.8;" x="60.77" xlink:href="#ma8e05ee773" y="232.95269"/>
      </g>
     </g>
     <g id="text_31">
      <!-- 150 -->
      <g transform="translate(34.6825 236.751909)scale(0.1 -0.1)">
       <use xlink:href="#DejaVuSans-49"/>
       <use x="63.623047" xlink:href="#DejaVuSans-53"/>
       <use x="127.246094" xlink:href="#DejaVuSans-48"/>
      </g>
     </g>
    </g>
    <g id="ytick_26">
     <g id="line2d_119">
      <path clip-path="url(#pa22044111c)" d="M 60.77 219.850495  L 565.2 219.850495  " style="fill:none;stroke:#b0b0b0;stroke-linecap:square;stroke-width:0.8;"/>
     </g>
     <g id="line2d_120">
      <g>
       <use style="stroke:#000000;stroke-width:0.8;" x="60.77" xlink:href="#ma8e05ee773" y="219.850495"/>
      </g>
     </g>
     <g id="text_32">
      <!-- 180 -->
      <g transform="translate(34.6825 223.649714)scale(0.1 -0.1)">
       <use xlink:href="#DejaVuSans-49"/>
       <use x="63.623047" xlink:href="#DejaVuSans-56"/>
       <use x="127.246094" xlink:href="#DejaVuSans-48"/>
      </g>
     </g>
    </g>
    <g id="ytick_27">
     <g id="line2d_121">
      <g>
       <use style="stroke:#000000;stroke-width:0.6;" x="60.77" xlink:href="#m02f00c2870" y="383.627932"/>
      </g>
     </g>
    </g>
    <g id="ytick_28">
     <g id="line2d_122">
      <g>
       <use style="stroke:#000000;stroke-width:0.6;" x="60.77" xlink:href="#m02f00c2870" y="370.525737"/>
      </g>
     </g>
    </g>
    <g id="ytick_29">
     <g id="line2d_123">
      <g>
       <use style="stroke:#000000;stroke-width:0.6;" x="60.77" xlink:href="#m02f00c2870" y="357.423542"/>
      </g>
     </g>
    </g>
    <g id="ytick_30">
     <g id="line2d_124">
      <g>
       <use style="stroke:#000000;stroke-width:0.6;" x="60.77" xlink:href="#m02f00c2870" y="344.321347"/>
      </g>
     </g>
    </g>
    <g id="ytick_31">
     <g id="line2d_125">
      <g>
       <use style="stroke:#000000;stroke-width:0.6;" x="60.77" xlink:href="#m02f00c2870" y="331.219152"/>
      </g>
     </g>
    </g>
    <g id="ytick_32">
     <g id="line2d_126">
      <g>
       <use style="stroke:#000000;stroke-width:0.6;" x="60.77" xlink:href="#m02f00c2870" y="318.116957"/>
      </g>
     </g>
    </g>
    <g id="ytick_33">
     <g id="line2d_127">
      <g>
       <use style="stroke:#000000;stroke-width:0.6;" x="60.77" xlink:href="#m02f00c2870" y="305.014762"/>
      </g>
     </g>
    </g>
    <g id="ytick_34">
     <g id="line2d_128">
      <g>
       <use style="stroke:#000000;stroke-width:0.6;" x="60.77" xlink:href="#m02f00c2870" y="291.912567"/>
      </g>
     </g>
    </g>
    <g id="ytick_35">
     <g id="line2d_129">
      <g>
       <use style="stroke:#000000;stroke-width:0.6;" x="60.77" xlink:href="#m02f00c2870" y="278.810372"/>
      </g>
     </g>
    </g>
    <g id="ytick_36">
     <g id="line2d_130">
      <g>
       <use style="stroke:#000000;stroke-width:0.6;" x="60.77" xlink:href="#m02f00c2870" y="265.708177"/>
      </g>
     </g>
    </g>
    <g id="ytick_37">
     <g id="line2d_131">
      <g>
       <use style="stroke:#000000;stroke-width:0.6;" x="60.77" xlink:href="#m02f00c2870" y="252.605983"/>
      </g>
     </g>
    </g>
    <g id="ytick_38">
     <g id="line2d_132">
      <g>
       <use style="stroke:#000000;stroke-width:0.6;" x="60.77" xlink:href="#m02f00c2870" y="239.503788"/>
      </g>
     </g>
    </g>
    <g id="ytick_39">
     <g id="line2d_133">
      <g>
       <use style="stroke:#000000;stroke-width:0.6;" x="60.77" xlink:href="#m02f00c2870" y="226.401593"/>
      </g>
     </g>
    </g>
    <g id="text_33">
     <!-- $\bf{Phase}$ ($\degree$) -->
     <defs>
      <path d="M 9.1875 72.90625  L 40.375 72.90625  Q 54.296875 72.90625 61.734375 66.71875  Q 69.1875 60.546875 69.1875 49.125  Q 69.1875 37.640625 61.734375 31.46875  Q 54.296875 25.296875 40.375 25.296875  L 27.984375 25.296875  L 27.984375 0  L 9.1875 0  z M 27.984375 59.28125  L 27.984375 38.921875  L 38.375 38.921875  Q 43.84375 38.921875 46.828125 41.578125  Q 49.8125 44.234375 49.8125 49.125  Q 49.8125 54 46.828125 56.640625  Q 43.84375 59.28125 38.375 59.28125  z " id="DejaVuSans-Bold-80"/>
      <path d="M 63.375 33.296875  L 63.375 0  L 45.796875 0  L 45.796875 5.421875  L 45.796875 25.390625  Q 45.796875 32.5625 45.484375 35.25  Q 45.171875 37.9375 44.390625 39.203125  Q 43.359375 40.921875 41.59375 41.875  Q 39.84375 42.828125 37.59375 42.828125  Q 32.125 42.828125 29 38.59375  Q 25.875 34.375 25.875 26.90625  L 25.875 0  L 8.40625 0  L 8.40625 75.984375  L 25.875 75.984375  L 25.875 46.6875  Q 29.828125 51.46875 34.265625 53.734375  Q 38.71875 56 44.09375 56  Q 53.5625 56 58.46875 50.1875  Q 63.375 44.390625 63.375 33.296875  z " id="DejaVuSans-Bold-104"/>
      <path d="M 51.125 52.984375  L 51.125 39.703125  Q 45.515625 42.046875 40.28125 43.21875  Q 35.0625 44.390625 30.421875 44.390625  Q 25.4375 44.390625 23.015625 43.140625  Q 20.609375 41.890625 20.609375 39.3125  Q 20.609375 37.203125 22.4375 36.078125  Q 24.265625 34.96875 29 34.421875  L 32.078125 33.984375  Q 45.515625 32.28125 50.140625 28.375  Q 54.78125 24.46875 54.78125 16.109375  Q 54.78125 7.375 48.328125 2.96875  Q 41.890625 -1.421875 29.109375 -1.421875  Q 23.6875 -1.421875 17.890625 -0.5625  Q 12.109375 0.296875 6 2  L 6 15.28125  Q 11.234375 12.75 16.71875 11.46875  Q 22.21875 10.203125 27.875 10.203125  Q 33.015625 10.203125 35.59375 11.609375  Q 38.1875 13.03125 38.1875 15.828125  Q 38.1875 18.171875 36.40625 19.3125  Q 34.625 20.453125 29.296875 21.09375  L 26.21875 21.484375  Q 14.546875 22.953125 9.859375 26.90625  Q 5.171875 30.859375 5.171875 38.921875  Q 5.171875 47.609375 11.125 51.796875  Q 17.09375 56 29.390625 56  Q 34.234375 56 39.546875 55.265625  Q 44.875 54.546875 51.125 52.984375  z " id="DejaVuSans-Bold-115"/>
      <path d="M 25 67.921875  Q 21.09375 67.921875 18.40625 65.203125  Q 15.71875 62.5 15.71875 58.59375  Q 15.71875 54.734375 18.40625 52.078125  Q 21.09375 49.421875 25 49.421875  Q 28.90625 49.421875 31.59375 52.078125  Q 34.28125 54.734375 34.28125 58.59375  Q 34.28125 62.453125 31.5625 65.1875  Q 28.859375 67.921875 25 67.921875  z M 25 74.21875  Q 28.125 74.21875 31 73.015625  Q 33.890625 71.828125 35.984375 69.578125  Q 38.234375 67.390625 39.359375 64.59375  Q 40.484375 61.8125 40.484375 58.59375  Q 40.484375 52.15625 35.96875 47.6875  Q 31.453125 43.21875 24.90625 43.21875  Q 18.3125 43.21875 13.90625 47.609375  Q 9.515625 52 9.515625 58.59375  Q 9.515625 65.140625 14 69.671875  Q 18.5 74.21875 25 74.21875  z " id="DejaVuSans-176"/>
     </defs>
     <g transform="translate(20.223125 323.854878)rotate(-90)scale(0.1 -0.1)">
      <use transform="translate(0 0.015625)" xlink:href="#DejaVuSans-Bold-80"/>
      <use transform="translate(73.291016 0.015625)" xlink:href="#DejaVuSans-Bold-104"/>
      <use transform="translate(144.482422 0.015625)" xlink:href="#DejaVuSans-Bold-97"/>
      <use transform="translate(211.962891 0.015625)" xlink:href="#DejaVuSans-Bold-115"/>
      <use transform="translate(271.484375 0.015625)" xlink:href="#DejaVuSans-Bold-101"/>
      <use transform="translate(339.306641 0.015625)" xlink:href="#DejaVuSans-32"/>
      <use transform="translate(371.09375 0.015625)" xlink:href="#DejaVuSans-40"/>
      <use transform="translate(410.107422 0.015625)" xlink:href="#DejaVuSans-176"/>
      <use transform="translate(460.107422 0.015625)" xlink:href="#DejaVuSans-41"/>
     </g>
    </g>
   </g>
   <g id="line2d_134">
    <path clip-path="url(#pa22044111c)" d="M 83.698636 298.463665  L 421.666736 298.572639  L 432.672482 298.778384  L 436.799636 299.028868  L 439.0925 299.340736  L 440.468218 299.698516  L 441.385364 300.108206  L 442.302509 300.841265  L 442.761082 301.474649  L 443.219655 302.509143  L 443.678227 304.486252  L 444.1368 309.595569  L 444.595373 332.83599  L 445.053945 363.241822  L 445.512518 369.84791  L 445.971091 372.169983  L 446.429664 373.330879  L 446.888236 374.023227  L 447.805382 374.806232  L 448.722527 375.233851  L 450.098245 375.598315  L 452.391109 375.900289  L 456.059691 376.087332  L 461.103991 376.103568  L 466.148291 375.901674  L 469.3583 375.562447  L 471.192591 375.192929  L 472.568309 374.73077  L 473.485455 374.250793  L 473.944027 373.922705  L 474.4026 294.891347  L 474.861173 294.341576  L 475.319745 293.589081  L 475.778318 292.501443  L 476.236891 290.803764  L 476.695464 287.834018  L 477.154036 281.66867  L 477.612609 266.709961  L 478.071182 245.077799  L 478.529755 234.081332  L 478.988327 229.412645  L 479.4469 227.009799  L 479.905473 225.574291  L 480.364045 224.62827  L 481.281191 223.46915  L 482.198336 222.795917  L 483.574055 222.205816  L 484.949773 221.872256  L 486.784064 221.644507  L 489.076927 221.60309  L 490.911218 221.801708  L 491.828364 222.047066  L 492.745509 222.507922  L 493.204082 222.899529  L 493.662655 223.508582  L 494.121227 224.561489  L 494.5798 226.7609  L 495.038373 233.675598  L 495.496945 270.368054  L 495.955518 289.84914  L 496.414091 293.80904  L 496.872664 295.376955  L 497.331236 296.206403  L 497.789809 296.716072  L 498.706955 297.30459  L 500.082673 297.742392  L 501.916964 298.02366  L 505.126973 298.239554  L 511.546991 298.382852  L 528.055609 298.451653  L 542.271364 298.460508  L 542.271364 298.460508  " style="fill:none;stroke:#1f76b4;stroke-linecap:square;stroke-width:1.5;"/>
   </g>
   <g id="line2d_135">
    <path clip-path="url(#pa22044111c)" d="M 83.698636 257.841523  L 109.378709 257.222249  L 130.931627 256.484972  L 149.733109 255.620341  L 166.241727 254.641056  L 181.374627 253.519788  L 195.131809 252.280471  L 208.430418 250.855773  L 221.270455 249.250197  L 234.110491 247.412172  L 247.4091 245.275903  L 262.542 242.608351  L 290.056364 237.466197  L 307.9407 234.250879  L 321.697882 231.996479  L 334.537918 230.116638  L 346.919382 228.525388  L 359.759418 227.103272  L 373.058027 225.861816  L 386.815209 224.80666  L 400.572391 223.972744  L 413.412427 223.413842  L 423.042455 223.20854  L 429.0039 223.280876  L 432.672482 223.507092  L 435.423918 223.884673  L 437.258209 224.345129  L 438.633927 224.909059  L 439.551073 225.4739  L 440.468218 226.306352  L 441.385364 227.631046  L 441.843936 228.625999  L 442.302509 230.008481  L 442.761082 232.036631  L 443.219655 235.230002  L 443.678227 240.695224  L 444.1368 250.462072  L 445.053945 276.955382  L 445.512518 284.097046  L 445.971091 288.137109  L 446.429664 290.6087  L 446.888236 292.243848  L 447.346809 293.394329  L 448.263955 294.891573  L 449.1811 295.813025  L 450.098245 296.430766  L 451.473964 297.043473  L 453.308255 297.544739  L 455.601118 297.913416  L 458.811127 298.19487  L 463.855427 298.388995  L 472.568309 298.463106  L 486.325491 298.581324  L 489.5355 298.835776  L 490.911218 299.097184  L 491.828364 299.408908  L 492.745509 299.981696  L 493.204082 300.484919  L 493.662655 301.317267  L 494.121227 302.936897  L 494.5798 307.311643  L 495.038373 332.595337  L 495.496945 365.493924  L 495.955518 370.895944  L 496.414091 372.735367  L 496.872664 373.646796  L 497.331236 374.186643  L 498.248382 374.790311  L 499.6241 375.221988  L 501.458391 375.482947  L 504.6684 375.651046  L 510.171273 375.676147  L 520.718445 375.472237  L 538.144209 374.902396  L 542.271364 374.740217  L 542.271364 374.740217  " style="fill:none;stroke:#7fbde9;stroke-dasharray:5.55,2.4;stroke-dashoffset:0;stroke-width:1.5;"/>
   </g>
   <g id="patch_9">
    <path d="M 60.77 383.848  L 60.77 213.861757  " style="fill:none;stroke:#000000;stroke-linecap:square;stroke-linejoin:miter;stroke-width:0.8;"/>
   </g>
   <g id="patch_10">
    <path d="M 565.2 383.848  L 565.2 213.861757  " style="fill:none;stroke:#000000;stroke-linecap:square;stroke-linejoin:miter;stroke-width:0.8;"/>
   </g>
   <g id="patch_11">
    <path d="M 60.77 383.848  L 565.2 383.848  " style="fill:none;stroke:#000000;stroke-linecap:square;stroke-linejoin:miter;stroke-width:0.8;"/>
   </g>
   <g id="patch_12">
    <path d="M 60.77 213.861757  L 565.2 213.861757  " style="fill:none;stroke:#000000;stroke-linecap:square;stroke-linejoin:miter;stroke-width:0.8;"/>
   </g>
  </g>
 </g>
 <defs>
  <clipPath id="pf86e6e071b">
   <rect height="169.986243" width="504.43" x="60.77" y="12.683514"/>
  </clipPath>
  <clipPath id="pa22044111c">
   <rect height="169.986243" width="504.43" x="60.77" y="213.861757"/>
  </clipPath>
 </defs>
</svg>