H1_snr,L1_snr,V1_snr,approximant,coa_phase,delta_t,distance,image_type,inclination,latitude,lensed_network_snr,lensed_set_id,longitude,mass1,mass2,mu,number_of_images,polarization,sample_tag,spin1x,spin1y,spin1z,spin2x,spin2y,spin2z,time_geocent,unlensed_bbh_snr,z_lens,z_source
6.024388142571028,9.435388659064179,4.17206101938673,IMRPhenomXPHMpseudoFourPN,1.5825444194949299,0.0,7793.620078425968,1,0.06726227760740218,2.7995324340807928,11.946794749615211,8257762.0,1.555919300743959,93.20158623836501,73.62296731925849,3.364,2.0,1.9676556339565385,161,0.5777037584730271,0.2761036578328568,0.5956949094903724,0.054885042229974694,0.09286746369352765,-0.20652600125891107,1333872962.868414,5.98,0.49,1.83
7.100356095423393,8.358367082589528,2.7548127509537434,IMRPhenomXPHMpseudoFourPN,1.5825444194949299,4.089,10244.346251626675,2,0.06726227760740218,2.7995324340807928,11.307800416612846,8257762.0,1.555919300743959,93.20158623836501,73.62296731925849,-1.947,2.0,1.9676556339565385,161,0.5777037584730271,0.2761036578328568,0.5956949094903724,0.054885042229974694,0.09286746369352765,-0.20652600125891107,1334226252.4684138,5.98,0.49,1.83
