<?xml version="1.0" encoding="UTF-8" standalone="no"?>
<svg
   xmlns:i="http://ns.adobe.com/AdobeIllustrator/10.0/"
   xmlns:a="http://ns.adobe.com/AdobeSVGViewerExtensions/3.0/"
   xmlns:dc="http://purl.org/dc/elements/1.1/"
   xmlns:cc="http://creativecommons.org/ns#"
   xmlns:rdf="http://www.w3.org/1999/02/22-rdf-syntax-ns#"
   xmlns:svg="http://www.w3.org/2000/svg"
   xmlns="http://www.w3.org/2000/svg"
   xmlns:xlink="http://www.w3.org/1999/xlink"
   xmlns:sodipodi="http://sodipodi.sourceforge.net/DTD/sodipodi-0.dtd"
   xmlns:inkscape="http://www.inkscape.org/namespaces/inkscape"
   inkscape:export-ydpi="300"
   inkscape:export-xdpi="300"
   inkscape:export-filename="G:\My Drive\Research\40m\ALS\ALS_Concept_Simple.png"
   sodipodi:docname="ALS_Concept_Simple.svg"
   inkscape:version="1.0 (4035a4fb49, 2020-05-01)"
   id="svg8"
   version="1.1"
   viewBox="0 0 175.59487 45.032513"
   height="45.032513mm"
   width="175.59486mm">
  <defs
     id="defs2">
    <marker
       inkscape:stockid="Arrow1Mend"
       orient="auto"
       refY="0"
       refX="0"
       id="marker9759"
       style="overflow:visible"
       inkscape:isstock="true">
      <path
         id="path9757"
         d="M 0,0 5,-5 -12.5,0 5,5 Z"
         style="fill:#000000;fill-opacity:1;fill-rule:evenodd;stroke:#000000;stroke-width:1pt;stroke-opacity:1"
         transform="matrix(-0.4,0,0,-0.4,-4,0)" />
    </marker>
    <rect
       id="rect9669"
       height="29.992611"
       width="51.938423"
       y="127.68914"
       x="119.73647" />
    <marker
       inkscape:collect="always"
       inkscape:isstock="true"
       style="overflow:visible"
       id="marker9461"
       refX="0"
       refY="0"
       orient="auto"
       inkscape:stockid="Arrow1Mend">
      <path
         transform="matrix(-0.4,0,0,-0.4,-4,0)"
         style="fill:#000000;fill-opacity:1;fill-rule:evenodd;stroke:#000000;stroke-width:1pt;stroke-opacity:1"
         d="M 0,0 5,-5 -12.5,0 5,5 Z"
         id="path9459" />
    </marker>
    <marker
       inkscape:collect="always"
       inkscape:stockid="Arrow1Mend"
       orient="auto"
       refY="0"
       refX="0"
       id="marker8350"
       style="overflow:visible"
       inkscape:isstock="true">
      <path
         id="path8348"
         d="M 0,0 5,-5 -12.5,0 5,5 Z"
         style="fill:#000000;fill-opacity:1;fill-rule:evenodd;stroke:#000000;stroke-width:1pt;stroke-opacity:1"
         transform="matrix(-0.4,0,0,-0.4,-4,0)" />
    </marker>
    <marker
       inkscape:collect="always"
       inkscape:isstock="true"
       style="overflow:visible"
       id="Arrow1Mend"
       refX="0"
       refY="0"
       orient="auto"
       inkscape:stockid="Arrow1Mend">
      <path
         transform="matrix(-0.4,0,0,-0.4,-4,0)"
         style="fill:#000000;fill-opacity:1;fill-rule:evenodd;stroke:#000000;stroke-width:1pt;stroke-opacity:1"
         d="M 0,0 5,-5 -12.5,0 5,5 Z"
         id="path8055" />
    </marker>
    <inkscape:path-effect
       only_selected="false"
       apply_with_weight="true"
       apply_no_weight="true"
       helper_size="0"
       steps="2"
       weight="33.333333"
       lpeversion="1"
       is_visible="true"
       id="path-effect7872"
       effect="bspline" />
    <linearGradient
       id="linearGradient884-6"
       inkscape:collect="always">
      <stop
         id="stop880"
         offset="0"
         style="stop-color:#00ff00;stop-opacity:1;" />
      <stop
         id="stop882"
         offset="1"
         style="stop-color:#00ff00;stop-opacity:0;" />
    </linearGradient>
    <rect
       id="rect872"
       height="22.489582"
       width="51.59375"
       y="99.21875"
       x="67.46875" />
    <radialGradient
       gradientUnits="userSpaceOnUse"
       gradientTransform="matrix(1,0,0,0.38229572,0,67.825214)"
       r="21.416666"
       fy="109.80208"
       fx="92.604164"
       cy="109.80208"
       cx="92.604164"
       id="radialGradient890"
       xlink:href="#linearGradient884-6"
       inkscape:collect="always" />
    <radialGradient
       gradientUnits="userSpaceOnUse"
       gradientTransform="matrix(1,0,0,1.1510983,0,-2.8801605)"
       r="16.320499"
       fy="19.061501"
       fx="16.320499"
       cy="19.061501"
       cx="16.320499"
       id="radialGradient4704"
       xlink:href="#radialGradient4697"
       inkscape:collect="always" />
    <radialGradient
       gradientUnits="userSpaceOnUse"
       fy="19.061501"
       fx="16.320299"
       r="17.222401"
       cy="19.061501"
       cx="16.320299"
       id="radialGradient4697">
      <stop
         id="stop4683"
         style="stop-color:#FFFFFF"
         offset="0" />
      <stop
         id="stop4685"
         style="stop-color:#A0A0A0"
         offset="1" />
      <a:midPointStop
         style="stop-color:#FFFFFF"
         offset="0" />
      <a:midPointStop
         style="stop-color:#FFFFFF"
         offset="0.5" />
      <a:midPointStop
         style="stop-color:#A0A0A0"
         offset="1" />
    </radialGradient>
    <radialGradient
       r="21.416666"
       fy="109.80208"
       fx="92.604164"
       cy="109.80208"
       cx="92.604164"
       gradientTransform="matrix(1,0,0,0.38229572,0,67.825214)"
       gradientUnits="userSpaceOnUse"
       id="radialGradient7857"
       xlink:href="#radialGradient4697"
       inkscape:collect="always" />
    <linearGradient
       spreadMethod="reflect"
       y2="92.333496"
       x2="43.5355"
       y1="105.24363"
       x1="43.5355"
       gradientTransform="matrix(0.8,0,0,0.8,-34.8284,-61.1108)"
       gradientUnits="userSpaceOnUse"
       id="linearGradient5741"
       xlink:href="#linearGradient884-6"
       inkscape:collect="always" />
    <linearGradient
       id="linearGradient5726"
       gradientUnits="userSpaceOnUse"
       x1="28.721701"
       y1="32.972698"
       x2="28.721701"
       y2="13.1309">
      <stop
         offset="0"
         style="stop-color:#FFFFFF"
         id="stop5690" />
      <stop
         offset="0.0051"
         style="stop-color:#FEFCFC"
         id="stop5692" />
      <stop
         offset="0.1497"
         style="stop-color:#E6A4A4"
         id="stop5694" />
      <stop
         offset="0.277"
         style="stop-color:#D35E5E"
         id="stop5696" />
      <stop
         offset="0.3823"
         style="stop-color:#C62B2B"
         id="stop5698" />
      <stop
         offset="0.4615"
         style="stop-color:#BD0C0C"
         id="stop5700" />
      <stop
         offset="0.5056"
         style="stop-color:#BA0000"
         id="stop5702" />
      <stop
         offset="0.7077"
         style="stop-color:#D86E6E"
         id="stop5704" />
      <stop
         offset="0.9099"
         style="stop-color:#F4D6D6"
         id="stop5706" />
      <stop
         offset="1"
         style="stop-color:#FFFFFF"
         id="stop5708" />
      <a:midPointStop
         offset="0"
         style="stop-color:#FFFFFF" />
      <a:midPointStop
         offset="0.4222"
         style="stop-color:#FFFFFF" />
      <a:midPointStop
         offset="0.5056"
         style="stop-color:#BA0000" />
      <a:midPointStop
         offset="0.4773"
         style="stop-color:#BA0000" />
      <a:midPointStop
         offset="1"
         style="stop-color:#FFFFFF" />
    </linearGradient>
    <radialGradient
       gradientUnits="userSpaceOnUse"
       gradientTransform="matrix(2.6891459,-4.9190521e-8,1.6353267e-8,2.658466,-16.193841,-15.515061)"
       r="6.7529998"
       fy="8.1260357"
       fx="9.5869999"
       cy="8.1260357"
       cx="9.5869999"
       id="radialGradient5352"
       xlink:href="#radialGradient5344"
       inkscape:collect="always" />
    <radialGradient
       id="radialGradient5344"
       cx="8.8788996"
       cy="7.4604001"
       r="17.066601"
       fx="8.8788996"
       fy="7.4604001"
       gradientUnits="userSpaceOnUse">
      <stop
         offset="0"
         style="stop-color:#FEDE58"
         id="stop5327" />
      <stop
         offset="0.6854"
         style="stop-color:#01AD4E"
         id="stop5329" />
      <a:midPointStop
         offset="0"
         style="stop-color:#FEDE58" />
      <a:midPointStop
         offset="0.5"
         style="stop-color:#FEDE58" />
      <a:midPointStop
         offset="0.6854"
         style="stop-color:#01AD4E" />
    </radialGradient>
    <marker
       inkscape:isstock="true"
       style="overflow:visible"
       id="marker8350-4"
       refX="0"
       refY="0"
       orient="auto"
       inkscape:stockid="Arrow1Mend">
      <path
         transform="matrix(-0.4,0,0,-0.4,-4,0)"
         style="fill:#000000;fill-opacity:1;fill-rule:evenodd;stroke:#000000;stroke-width:1pt;stroke-opacity:1"
         d="M 0,0 5,-5 -12.5,0 5,5 Z"
         id="path8348-0" />
    </marker>
    <radialGradient
       id="radialGradient4697-6"
       cx="16.320299"
       cy="19.061501"
       r="17.222401"
       fx="16.320299"
       fy="19.061501"
       gradientUnits="userSpaceOnUse">
      <stop
         offset="0"
         style="stop-color:#FFFFFF"
         id="stop4683-5" />
      <stop
         offset="1"
         style="stop-color:#A0A0A0"
         id="stop4685-9" />
      <a:midPointStop
         offset="0"
         style="stop-color:#FFFFFF" />
      <a:midPointStop
         offset="0.5"
         style="stop-color:#FFFFFF" />
      <a:midPointStop
         offset="1"
         style="stop-color:#A0A0A0" />
    </radialGradient>
    <radialGradient
       id="radialGradient8461"
       cx="16.320299"
       cy="19.061501"
       r="17.222401"
       fx="16.320299"
       fy="19.061501"
       gradientUnits="userSpaceOnUse">
      <stop
         offset="0"
         style="stop-color:#FFFFFF"
         id="stop8457" />
      <stop
         offset="1"
         style="stop-color:#A0A0A0"
         id="stop8459" />
      <a:midPointStop
         offset="0"
         style="stop-color:#FFFFFF" />
      <a:midPointStop
         offset="0.5"
         style="stop-color:#FFFFFF" />
      <a:midPointStop
         offset="1"
         style="stop-color:#A0A0A0" />
    </radialGradient>
    <radialGradient
       gradientUnits="userSpaceOnUse"
       fy="7.4604001"
       fx="8.8788996"
       r="17.066601"
       cy="7.4604001"
       cx="8.8788996"
       id="radialGradient5344-6">
      <stop
         id="stop5327-4"
         style="stop-color:#FEDE58"
         offset="0" />
      <stop
         id="stop5329-9"
         style="stop-color:#01AD4E"
         offset="0.6854" />
      <a:midPointStop
         style="stop-color:#FEDE58"
         offset="0" />
      <a:midPointStop
         style="stop-color:#FEDE58"
         offset="0.5" />
      <a:midPointStop
         style="stop-color:#01AD4E"
         offset="0.6854" />
    </radialGradient>
    <radialGradient
       gradientUnits="userSpaceOnUse"
       gradientTransform="matrix(2.7122849,-4.9331676e-8,1.3188837e-7,2.65854,-16.415678,-15.831995)"
       r="6.7529998"
       fy="8.2452106"
       fx="9.5870008"
       cy="8.2452106"
       cx="9.5870008"
       id="radialGradient5272"
       xlink:href="#radialGradient5264"
       inkscape:collect="always" />
    <radialGradient
       id="radialGradient5264"
       cx="8.8794003"
       cy="7.4608998"
       r="17.067101"
       fx="8.8794003"
       fy="7.4608998"
       gradientUnits="userSpaceOnUse">
      <stop
         offset="0"
         style="stop-color:#FEDE58"
         id="stop5248" />
      <stop
         offset="0.6854"
         style="stop-color:#BA0000"
         id="stop5250" />
      <a:midPointStop
         offset="0"
         style="stop-color:#FEDE58" />
      <a:midPointStop
         offset="0.5"
         style="stop-color:#FEDE58" />
      <a:midPointStop
         offset="0.6854"
         style="stop-color:#BA0000" />
    </radialGradient>
    <radialGradient
       id="radialGradient4697-0"
       cx="16.320299"
       cy="19.061501"
       r="17.222401"
       fx="16.320299"
       fy="19.061501"
       gradientUnits="userSpaceOnUse">
      <stop
         offset="0"
         style="stop-color:#FFFFFF"
         id="stop4683-7" />
      <stop
         offset="1"
         style="stop-color:#A0A0A0"
         id="stop4685-97" />
      <a:midPointStop
         offset="0"
         style="stop-color:#FFFFFF" />
      <a:midPointStop
         offset="0.5"
         style="stop-color:#FFFFFF" />
      <a:midPointStop
         offset="1"
         style="stop-color:#A0A0A0" />
    </radialGradient>
    <marker
       inkscape:isstock="true"
       style="overflow:visible"
       id="marker8350-8"
       refX="0"
       refY="0"
       orient="auto"
       inkscape:stockid="Arrow1Mend">
      <path
         transform="matrix(-0.4,0,0,-0.4,-4,0)"
         style="fill:#000000;fill-opacity:1;fill-rule:evenodd;stroke:#000000;stroke-width:1pt;stroke-opacity:1"
         d="M 0,0 5,-5 -12.5,0 5,5 Z"
         id="path8348-1" />
    </marker>
    <linearGradient
       y2="92.333496"
       x2="43.5355"
       y1="118.0735"
       x1="43.5355"
       gradientTransform="matrix(0.8,0,0,0.8,-34.8284,-61.1108)"
       gradientUnits="userSpaceOnUse"
       id="linearGradient9162"
       xlink:href="#linearGradient5726"
       inkscape:collect="always" />
    <linearGradient
       id="linearGradient2241-3"
       gradientUnits="userSpaceOnUse"
       x1="330.4668"
       y1="34.8228"
       x2="364.5545"
       y2="22.892099"
       gradientTransform="matrix(0.35,0,0,1,-116.2935,-14.3086)">
      <stop
         offset="0"
         style="stop-color:#FFFFFF"
         id="stop2228" />
      <stop
         offset="1"
         style="stop-color:#89A4B6"
         id="stop2230" />
      <a:midPointStop
         offset="0"
         style="stop-color:#FFFFFF" />
      <a:midPointStop
         offset="0.5"
         style="stop-color:#FFFFFF" />
      <a:midPointStop
         offset="1"
         style="stop-color:#89A4B6" />
    </linearGradient>
    <linearGradient
       inkscape:collect="always"
       xlink:href="#XMLID_2_"
       id="linearGradient31930"
       gradientUnits="userSpaceOnUse"
       gradientTransform="matrix(0.8,0,0,0.8,-34.8284,-61.1108)"
       x1="44.003899"
       y1="105.2021"
       x2="72.350098"
       y2="76.856003" />
    <linearGradient
       id="XMLID_2_"
       gradientUnits="userSpaceOnUse"
       x1="44.003899"
       y1="105.2021"
       x2="72.350098"
       y2="76.856003"
       gradientTransform="matrix(0.8,0,0,0.8,-34.8284,-61.1108)">
      <stop
         offset="0"
         style="stop-color:#FFFFFF"
         id="stop3163" />
      <stop
         offset="1"
         style="stop-color:#89A4B6"
         id="stop3165" />
      <a:midPointStop
         offset="0"
         style="stop-color:#FFFFFF" />
      <a:midPointStop
         offset="0.5"
         style="stop-color:#FFFFFF" />
      <a:midPointStop
         offset="1"
         style="stop-color:#89A4B6" />
    </linearGradient>
    <radialGradient
       gradientUnits="userSpaceOnUse"
       gradientTransform="matrix(2.6891459,-4.9190521e-8,1.6353267e-8,2.658466,-16.193841,-15.515061)"
       r="6.7529998"
       fy="8.1260357"
       fx="9.5869999"
       cy="8.1260357"
       cx="9.5869999"
       id="radialGradient5352-97"
       xlink:href="#radialGradient5344-3"
       inkscape:collect="always" />
    <radialGradient
       id="radialGradient5344-3"
       cx="8.8788996"
       cy="7.4604001"
       r="17.066601"
       fx="8.8788996"
       fy="7.4604001"
       gradientUnits="userSpaceOnUse">
      <stop
         offset="0"
         style="stop-color:#FEDE58"
         id="stop5327-9" />
      <stop
         offset="0.6854"
         style="stop-color:#01AD4E"
         id="stop5329-3" />
      <a:midPointStop
         offset="0"
         style="stop-color:#FEDE58" />
      <a:midPointStop
         offset="0.5"
         style="stop-color:#FEDE58" />
      <a:midPointStop
         offset="0.6854"
         style="stop-color:#01AD4E" />
    </radialGradient>
  </defs>
  <sodipodi:namedview
     inkscape:window-maximized="1"
     inkscape:window-y="-8"
     inkscape:window-x="-8"
     inkscape:window-height="1002"
     inkscape:window-width="1920"
     inkscape:snap-global="false"
     showgrid="true"
     inkscape:document-rotation="0"
     inkscape:current-layer="layer1"
     inkscape:document-units="mm"
     inkscape:cy="239.1306"
     inkscape:cx="317.12761"
     inkscape:zoom="1.0230033"
     inkscape:pageshadow="2"
     inkscape:pageopacity="0.0"
     borderopacity="1.0"
     bordercolor="#666666"
     pagecolor="#ffffff"
     id="base">
    <inkscape:grid
       originy="-86.980791"
       originx="-5.1659043"
       id="grid833"
       type="xygrid" />
  </sodipodi:namedview>
  <metadata
     id="metadata5">
    <rdf:RDF>
      <cc:Work
         rdf:about="">
        <dc:format>image/svg+xml</dc:format>
        <dc:type
           rdf:resource="http://purl.org/dc/dcmitype/StillImage" />
        <dc:title></dc:title>
      </cc:Work>
    </rdf:RDF>
  </metadata>
  <g
     transform="translate(-5.1659043,-86.98079)"
     inkscape:label="Layer 3"
     id="layer3"
     inkscape:groupmode="layer">
    <path
       id="path8044"
       d="m 122.76777,111.05809 12.72467,6.73799 h 13.99714"
       style="fill:none;stroke:#000000;stroke-width:0.485862;stroke-linecap:butt;stroke-linejoin:miter;stroke-miterlimit:4;stroke-dasharray:none;stroke-opacity:1;marker-end:url(#Arrow1Mend)" />
    <path
       id="path8346"
       d="M 158.89001,118.12209 H 180.4855 V 103.82442 H 166.23694"
       style="fill:none;stroke:#000000;stroke-width:0.550546;stroke-linecap:butt;stroke-linejoin:miter;stroke-miterlimit:4;stroke-dasharray:none;stroke-opacity:1;marker-end:url(#marker8350)" />
    <text
       id="text8414"
       y="123.39435"
       x="155.49927"
       style="font-size:3.52778px;line-height:1.25;font-family:sans-serif;letter-spacing:0px;word-spacing:0px;stroke-width:0.264583"
       xml:space="preserve"><tspan
         style="font-size:3.52778px;stroke-width:0.264583"
         y="123.39435"
         x="155.49927"
         id="tspan8412"
         sodipodi:role="line">PDH Lock</tspan><tspan
         style="font-size:3.52778px;stroke-width:0.264583"
         y="127.80407"
         x="155.49927"
         sodipodi:role="line"
         id="tspan1029">to Arm Cavity</tspan></text>
    <text
       xml:space="preserve"
       style="font-size:3.52777px;line-height:1.25;font-family:sans-serif;letter-spacing:0px;word-spacing:0px;stroke-width:0.264583"
       x="38.787571"
       y="131.28467"
       id="text8414-2"><tspan
         sodipodi:role="line"
         id="tspan8412-7"
         x="38.787571"
         y="131.28467"
         style="font-size:3.52777px;stroke-width:0.264583">Main Laser PDH Error Signal</tspan></text>
    <path
       id="path9457"
       d="M 50.978294,95.372845 V 87.966131"
       style="fill:none;stroke:#000000;stroke-width:0.5;stroke-linecap:butt;stroke-linejoin:miter;stroke-miterlimit:4;stroke-dasharray:none;stroke-opacity:1;marker-end:url(#marker9461)" />
    <text
       id="text9519"
       y="90.263222"
       x="53.019947"
       style="font-size:3.52778px;line-height:1.25;font-family:sans-serif;letter-spacing:0px;word-spacing:0px;stroke-width:0.264583"
       xml:space="preserve"><tspan
         style="font-size:3.52778px;stroke-width:0.264583"
         y="90.263222"
         x="53.019947"
         id="tspan9517"
         sodipodi:role="line">Main Laser - Green Laser</tspan><tspan
         style="font-size:3.52778px;stroke-width:0.264583"
         y="94.672943"
         x="53.019947"
         sodipodi:role="line"
         id="tspan1031">Beat Note</tspan></text>
    <text
       id="text9661"
       y="122.19546"
       x="4.8919926"
       style="font-size:3.52778px;line-height:1.25;font-family:sans-serif;letter-spacing:0px;word-spacing:0px;stroke-width:0.264583"
       xml:space="preserve"><tspan
         id="tspan9825"
         style="font-size:3.52778px;stroke-width:0.264583"
         y="122.19546"
         x="4.8919926"
         sodipodi:role="line">Main Laser</tspan></text>
    <text
       id="text9665"
       y="96.863914"
       x="146.39465"
       style="font-size:3.52778px;line-height:1.25;font-family:sans-serif;letter-spacing:0px;word-spacing:0px;stroke-width:0.264583"
       xml:space="preserve"><tspan
         style="font-size:3.52778px;stroke-width:0.264583"
         y="96.863914"
         x="146.39465"
         id="tspan9663"
         sodipodi:role="line">Green Laser</tspan></text>
    <text
       style="font-size:4.58611px;line-height:1.25;font-family:sans-serif;letter-spacing:0px;word-spacing:0px;white-space:pre;shape-inside:url(#rect9669);fill:#501616;"
       id="text9667"
       xml:space="preserve" />
    <path
       id="path9755"
       d="m 62.585917,120.44816 -9.967058,6.9495"
       style="fill:none;stroke:#000000;stroke-width:0.5;stroke-linecap:butt;stroke-linejoin:miter;stroke-miterlimit:4;stroke-dasharray:none;stroke-opacity:1;marker-end:url(#marker9759)" />
    <text
       id="text9823"
       y="102.69498"
       x="28.619797"
       style="font-size:3.52777px;line-height:1.25;font-family:sans-serif;letter-spacing:0px;word-spacing:0px;stroke-width:0.264583"
       xml:space="preserve"><tspan
         style="stroke-width:0.264583"
         y="102.69498"
         x="28.619797"
         id="tspan9821"
         sodipodi:role="line">Second</tspan><tspan
         style="stroke-width:0.264583"
         y="107.10469"
         x="28.619797"
         sodipodi:role="line"
         id="tspan1033">Harmonic</tspan><tspan
         style="stroke-width:0.264583"
         y="111.5144"
         x="28.619797"
         sodipodi:role="line"
         id="tspan1037">Generation</tspan></text>
  </g>
  <g
     transform="translate(-5.1659043,-86.98079)"
     inkscape:label="Layer 2"
     id="layer2"
     inkscape:groupmode="layer">
    <path
       id="path7868"
       d="M 149.48957,104.51038 H 51.160102"
       style="fill:none;stroke:#00ff00;stroke-width:0.928476;stroke-linecap:butt;stroke-linejoin:miter;stroke-miterlimit:4;stroke-dasharray:none;stroke-opacity:1" />
    <path
       id="path7976"
       d="m 113.77083,104.51038 6.61459,5.29167"
       style="fill:none;stroke:#00ff00;stroke-width:1;stroke-linecap:butt;stroke-linejoin:miter;stroke-miterlimit:4;stroke-dasharray:none;stroke-opacity:1" />
    <path
       style="fill:none;stroke:#ff0000;stroke-width:1;stroke-linecap:butt;stroke-linejoin:miter;stroke-miterlimit:4;stroke-dasharray:none;stroke-opacity:1"
       d="M 73.687453,113.30544 H 8.4818243"
       id="path7868-9" />
    <path
       style="fill:none;stroke:#ff0000;stroke-width:1;stroke-linecap:butt;stroke-linejoin:miter;stroke-miterlimit:4;stroke-dasharray:none;stroke-opacity:1"
       d="m 72.070841,113.26226 -6.61459,5.29167"
       id="path7976-3" />
    <g
       transform="matrix(-0.21673397,0.15175877,-0.15175877,-0.21673397,67.385342,120.82673)"
       id="g5261"
       i:layer="yes"
       i:dimmedPercent="50"
       i:rgbTrio="#4F008000FFFF"
       style="display:inline;opacity:1;enable-background:new">
      <g
         id="g5245">
        <radialGradient
           id="radialGradient21113"
           cx="8.8794003"
           cy="7.4608998"
           r="17.067101"
           fx="8.8794003"
           fy="7.4608998"
           gradientUnits="userSpaceOnUse">
          <stop
             offset="0"
             style="stop-color:#FEDE58"
             id="stop21109" />
          <stop
             offset="0.6854"
             style="stop-color:#BA0000"
             id="stop21111" />
          <a:midPointStop
             offset="0"
             style="stop-color:#FEDE58" />
          <a:midPointStop
             offset="0.5"
             style="stop-color:#FEDE58" />
          <a:midPointStop
             offset="0.6854"
             style="stop-color:#BA0000" />
        </radialGradient>
        <path
           inkscape:connector-curvature="0"
           style="fill:url(#radialGradient5272);fill-opacity:1;stroke:#000000;stroke-width:0.75"
           i:knockout="Off"
           d="m 6.044,1.792 c -0.986,0 -1.936,0.148 -2.835,0.417 v 19.01 c 0.899,0.268 1.849,0.416 2.835,0.416 5.479,0 9.921,-4.441 9.921,-9.921 0,-5.48 -4.442,-9.922 -9.921,-9.922 z"
           id="path5252" />
        <rect
           style="stroke:#000000;stroke-width:0.75"
           x="0.375"
           y="0.375"
           i:knockout="Off"
           width="2.835"
           height="22.677999"
           id="rect5254" />
      </g>
    </g>
    <path
       id="path7868-9-0"
       d="m 50.30429,108.37879 v 5.34428"
       style="fill:none;stroke:#ff0000;stroke-width:1;stroke-linecap:butt;stroke-linejoin:miter;stroke-miterlimit:4;stroke-dasharray:none;stroke-opacity:1" />
    <path
       style="fill:none;stroke:#00ff00;stroke-width:0.999999;stroke-linecap:butt;stroke-linejoin:miter;stroke-miterlimit:4;stroke-dasharray:none;stroke-opacity:1"
       d="m 50.171818,99.002043 v 8.768847"
       id="path7868-0" />
    <path
       id="path7868-0-4"
       d="m 51.664101,98.989499 v 5.476981"
       style="fill:none;stroke:#00ff00;stroke-width:0.999999;stroke-linecap:butt;stroke-linejoin:miter;stroke-miterlimit:4;stroke-dasharray:none;stroke-opacity:1" />
  </g>
  <g
     transform="translate(-5.1659043,-86.98079)"
     id="layer1"
     inkscape:groupmode="layer"
     inkscape:label="Layer 1">
    <rect
       y="101.86458"
       x="71.4375"
       height="15.875"
       width="42.333332"
       id="rect835"
       style="fill:url(#radialGradient7857);fill-opacity:1;stroke:#000000;stroke-width:0.499999;stroke-linejoin:bevel;stroke-opacity:1" />
    <text
       id="text839"
       y="110.75292"
       x="92.545601"
       style="font-size:3.52778px;line-height:1.25;font-family:sans-serif;text-align:center;letter-spacing:0px;word-spacing:0px;text-anchor:middle;stroke-width:0.264583"
       xml:space="preserve"><tspan
         id="tspan868"
         style="font-size:3.52778px;text-align:center;text-anchor:middle;stroke-width:0.264583"
         y="110.75292"
         x="93.165718"
         sodipodi:role="line">X-Arm Cavity </tspan></text>
    <text
       style="font-size:4.58611px;line-height:1.25;font-family:sans-serif;letter-spacing:0px;word-spacing:0px;white-space:pre;shape-inside:url(#rect872);"
       id="text870"
       xml:space="preserve" />
    <polygon
       transform="matrix(0.26458333,0,0,0.26458333,150.71328,113.11649)"
       id="polygon4687"
       points="32.266,19.062 0.375,37.473 0.375,0.65 "
       i:knockout="Off"
       style="display:inline;fill:url(#radialGradient4704);fill-opacity:1;stroke:#000000;stroke-width:0.75;enable-background:new" />
    <g
       transform="matrix(0.26458333,0,0,-0.26458333,149.14033,110.63046)"
       id="g5683">
      <rect
         id="rect5685"
         height="12.756"
         width="56.693001"
         i:knockout="Off"
         y="0.375"
         x="0.375"
         style="fill:#302b33" />
      <rect
         id="rect5687"
         height="12.756"
         width="56.693001"
         i:knockout="Off"
         y="32.973"
         x="0.375"
         style="fill:#302b33" />
      <linearGradient
         y2="13.1309"
         x2="28.721701"
         y1="32.972698"
         x1="28.721701"
         gradientUnits="userSpaceOnUse"
         id="linearGradient21031">
        <stop
           id="stop21011"
           style="stop-color:#FFFFFF"
           offset="0" />
        <stop
           id="stop21013"
           style="stop-color:#FEFCFC"
           offset="0.0051" />
        <stop
           id="stop21015"
           style="stop-color:#E6A4A4"
           offset="0.1497" />
        <stop
           id="stop21017"
           style="stop-color:#D35E5E"
           offset="0.277" />
        <stop
           id="stop21019"
           style="stop-color:#C62B2B"
           offset="0.3823" />
        <stop
           id="stop21021"
           style="stop-color:#BD0C0C"
           offset="0.4615" />
        <stop
           id="stop21023"
           style="stop-color:#BA0000"
           offset="0.5056" />
        <stop
           id="stop21025"
           style="stop-color:#D86E6E"
           offset="0.7077" />
        <stop
           id="stop21027"
           style="stop-color:#F4D6D6"
           offset="0.9099" />
        <stop
           id="stop21029"
           style="stop-color:#FFFFFF"
           offset="1" />
        <a:midPointStop
           style="stop-color:#FFFFFF"
           offset="0" />
        <a:midPointStop
           style="stop-color:#FFFFFF"
           offset="0.4222" />
        <a:midPointStop
           style="stop-color:#BA0000"
           offset="0.5056" />
        <a:midPointStop
           style="stop-color:#BA0000"
           offset="0.4773" />
        <a:midPointStop
           style="stop-color:#FFFFFF"
           offset="1" />
      </linearGradient>
      <rect
         id="rect5710"
         height="19.841999"
         width="56.693001"
         i:knockout="Off"
         y="13.131"
         x="0.375"
         style="fill:url(#linearGradient5741);fill-opacity:1;stroke:#000000;stroke-width:0.75" />
      <rect
         id="rect5712"
         height="39.686001"
         width="4.2519999"
         i:knockout="Off"
         y="3.2090001"
         x="57.068001"
         style="stroke:#000000;stroke-width:0.75" />
      <rect
         id="rect5714"
         height="45.354"
         width="56.693001"
         i:knockout="Off"
         y="0.375"
         x="0.375"
         style="fill:none;stroke:#000000;stroke-width:0.75" />
    </g>
    <g
       transform="matrix(0.20268258,0.17007089,-0.17007089,0.20268258,121.72635,106.413)"
       id="g5340"
       i:layer="yes"
       i:dimmedPercent="50"
       i:rgbTrio="#4F008000FFFF"
       style="display:inline;opacity:1;enable-background:new">
      <g
         id="g5342">
        <radialGradient
           id="radialGradient21136"
           cx="8.8788996"
           cy="7.4604001"
           r="17.066601"
           fx="8.8788996"
           fy="7.4604001"
           gradientUnits="userSpaceOnUse">
          <stop
             offset="0"
             style="stop-color:#FEDE58"
             id="stop21132" />
          <stop
             offset="0.6854"
             style="stop-color:#01AD4E"
             id="stop21134" />
          <a:midPointStop
             offset="0"
             style="stop-color:#FEDE58" />
          <a:midPointStop
             offset="0.5"
             style="stop-color:#FEDE58" />
          <a:midPointStop
             offset="0.6854"
             style="stop-color:#01AD4E" />
        </radialGradient>
        <path
           inkscape:connector-curvature="0"
           style="fill:url(#radialGradient5352);fill-opacity:1;stroke:#000000;stroke-width:0.75"
           i:knockout="Off"
           d="m 6.044,1.792 c -0.985,0 -1.936,0.148 -2.835,0.417 v 19.009 c 0.899,0.268 1.85,0.416 2.835,0.416 5.479,0 9.921,-4.441 9.921,-9.922 0,-5.478 -4.442,-9.92 -9.921,-9.92 z"
           id="path5331" />
        <rect
           style="stroke:#000000;stroke-width:0.75"
           x="0.375"
           y="0.375"
           i:knockout="Off"
           width="2.835"
           height="22.677"
           id="rect5333" />
      </g>
    </g>
    <g
       style="display:inline;opacity:1;enable-background:new"
       i:rgbTrio="#4F008000FFFF"
       i:dimmedPercent="50"
       i:layer="yes"
       id="g5721-1"
       transform="matrix(-0.26458333,0,0,-0.26458333,21.489373,118.80684)">
      <g
         id="g5683-9">
        <rect
           id="rect5685-8"
           height="12.756"
           width="56.693001"
           i:knockout="Off"
           y="0.375"
           x="0.375"
           style="fill:#302b33" />
        <rect
           id="rect5687-2"
           height="12.756"
           width="56.693001"
           i:knockout="Off"
           y="32.973"
           x="0.375"
           style="fill:#302b33" />
        <linearGradient
           y2="13.1309"
           x2="28.721701"
           y1="32.972698"
           x1="28.721701"
           gradientUnits="userSpaceOnUse"
           id="linearGradient9155">
          <stop
             id="stop21011-7"
             style="stop-color:#FFFFFF"
             offset="0" />
          <stop
             id="stop21013-40"
             style="stop-color:#FEFCFC"
             offset="0.0051" />
          <stop
             id="stop21015-6"
             style="stop-color:#E6A4A4"
             offset="0.1497" />
          <stop
             id="stop21017-38"
             style="stop-color:#D35E5E"
             offset="0.277" />
          <stop
             id="stop21019-2"
             style="stop-color:#C62B2B"
             offset="0.3823" />
          <stop
             id="stop21021-6"
             style="stop-color:#BD0C0C"
             offset="0.4615" />
          <stop
             id="stop21023-1"
             style="stop-color:#BA0000"
             offset="0.5056" />
          <stop
             id="stop21025-9"
             style="stop-color:#D86E6E"
             offset="0.7077" />
          <stop
             id="stop21027-5"
             style="stop-color:#F4D6D6"
             offset="0.9099" />
          <stop
             id="stop21029-2"
             style="stop-color:#FFFFFF"
             offset="1" />
          <a:midPointStop
             style="stop-color:#FFFFFF"
             offset="0" />
          <a:midPointStop
             style="stop-color:#FFFFFF"
             offset="0.4222" />
          <a:midPointStop
             style="stop-color:#BA0000"
             offset="0.5056" />
          <a:midPointStop
             style="stop-color:#BA0000"
             offset="0.4773" />
          <a:midPointStop
             style="stop-color:#FFFFFF"
             offset="1" />
        </linearGradient>
        <rect
           id="rect5710-1"
           height="19.841999"
           width="56.693001"
           i:knockout="Off"
           y="13.131"
           x="0.375"
           style="fill:url(#linearGradient9162);fill-opacity:1;stroke:#000000;stroke-width:0.75" />
        <rect
           id="rect5712-5"
           height="39.686001"
           width="4.2519999"
           i:knockout="Off"
           y="3.2090001"
           x="57.068001"
           style="stroke:#000000;stroke-width:0.75" />
        <rect
           id="rect5714-9"
           height="45.354"
           width="56.693001"
           i:knockout="Off"
           y="0.375"
           x="0.375"
           style="fill:none;stroke:#000000;stroke-width:0.75" />
      </g>
    </g>
    <g
       transform="matrix(0,-0.18474398,0.15813712,0,48.770875,111.37206)"
       id="g3405"
       i:layer="yes"
       i:dimmedPercent="50"
       i:rgbTrio="#4F008000FFFF"
       style="display:inline;opacity:1;stroke-width:1.54796;enable-background:new">
      <linearGradient
         id="linearGradient20994"
         gradientUnits="userSpaceOnUse"
         x1="1.7925"
         y1="18.8008"
         x2="26.5749"
         y2="-5.9816999">
        <stop
           offset="0"
           style="stop-color:#FFFFFF"
           id="stop20990" />
        <stop
           offset="1"
           style="stop-color:#89A4B6"
           id="stop20992" />
        <a:midPointStop
           offset="0"
           style="stop-color:#FFFFFF" />
        <a:midPointStop
           offset="0.5"
           style="stop-color:#FFFFFF" />
        <a:midPointStop
           offset="1"
           style="stop-color:#89A4B6" />
      </linearGradient>
      <polygon
         style="fill:url(#linearGradient31930);fill-opacity:1;stroke:#000000;stroke-width:1.16097"
         i:knockout="Off"
         points="21.334,17.383 23.051,17.383 23.051,0.375 21.334,0.375 0.375,0.375 0.375,17.383 "
         id="polygon3398" />
    </g>
    <g
       transform="matrix(0,-0.26458333,0.26458333,0,47.722362,99.27867)"
       id="g5340-3"
       i:layer="yes"
       i:dimmedPercent="50"
       i:rgbTrio="#4F008000FFFF"
       style="display:inline;opacity:1;enable-background:new">
      <g
         id="g5342-2">
        <radialGradient
           id="radialGradient21136-1"
           cx="8.8788996"
           cy="7.4604001"
           r="17.066601"
           fx="8.8788996"
           fy="7.4604001"
           gradientUnits="userSpaceOnUse">
          <stop
             offset="0"
             style="stop-color:#FEDE58"
             id="stop21132-6" />
          <stop
             offset="0.6854"
             style="stop-color:#01AD4E"
             id="stop21134-1" />
          <a:midPointStop
             offset="0"
             style="stop-color:#FEDE58" />
          <a:midPointStop
             offset="0.5"
             style="stop-color:#FEDE58" />
          <a:midPointStop
             offset="0.6854"
             style="stop-color:#01AD4E" />
        </radialGradient>
        <path
           inkscape:connector-curvature="0"
           style="fill:url(#radialGradient5352-97);fill-opacity:1;stroke:#000000;stroke-width:0.75"
           i:knockout="Off"
           d="m 6.044,1.792 c -0.985,0 -1.936,0.148 -2.835,0.417 v 19.009 c 0.899,0.268 1.85,0.416 2.835,0.416 5.479,0 9.921,-4.441 9.921,-9.922 0,-5.478 -4.442,-9.92 -9.921,-9.92 z"
           id="path5331-99" />
        <rect
           style="stroke:#000000;stroke-width:0.75"
           x="0.375"
           y="0.375"
           i:knockout="Off"
           width="2.835"
           height="22.677"
           id="rect5333-7" />
      </g>
    </g>
  </g>
</svg>
