0584
0883
0713
0340
0074
1527
0803
1291
1207
1622
0337
0227
0012
1139
1050
0489
1304
0404
0376
0758
0105
1028
1519
1432
0467
0365
1527
0337
1050
0404
0105
1519
1432
0467
0365
1527
0337
1050
0404
0105
1519
1432
0467
0365
1527
0337
1050
0404
0105
1519
1432
0467
0365
1527
0337
1050
0404
1527
0337
1050
0404
0105
1519
1432
0467
0365
1177
0584
1050
0489
1304
0404
1177
0376
0883
0758
0105
0713
0340
1291
0074
1432
0365
1207
1519
1028
1139
0803
1527
0803
1622
0337
0467
0227
0012
0565
0330
1066
0117
1253
0094
1601
1562
0256
1697
0894
0325
0334
0623
0947
1716
1116
0705
0884
1322
1168
0380
0789
0622
1181
0076
1460
0003
0867
0777
0143
0608
1703
0890
0158
1329
0800
1507
1543
0558
1182
0059
0402
0290
0751
0964
0983
0476
1403
1733
0196
0397
0657
0893
0843
1645
1443
0403
0706
0826
1054
1497
0677
1492
0593
0058
1099
1678
1559
0637
0002
0746
1406
0920
1290
0241
0304
1218
0335
0388
0589
0635
0450
0569
1192
0790
0821
0191
0930
0936
0629
0646
1701
1511
0939
1566
1488
0212
0345
1403
1482
0698
1176
1417
1629
0707
0877
0798
0222
1284
0428
1387
1467
0850
1375
0124
0227
1575
1420
0446
0801
0192
0754
0634
0607
0326
0026
0027
0028
0029
