﻿#,F0,PB,A1
,(Hz),(days),(ltsec)
1,8.668248,-999,-999
2,1.441446,-999,-999
3,3.165827,-999,-999
4,0.391716,-999,-999
5,0.805997,-999,-999
6,0.432128,-999,-999
7,327.847021,0.1388,0.0348
8,543.478261,-999,-999
9,269.931798,-999,-999
10,364.963504,0.18,0.019
11,267.379679,0.32,0.68
12,173.708219,-999,-999
13,186.65167,-999,-999
14,282.779107,2.2568,1.9818
15,381.158664,-999,-999
16,247.501525,-999,-999
17,311.493418,2.3577,2.1528
18,286.9447,0.2298,0.0384
19,476.046858,0.1207,0.0404
20,230.087746,-999,-999
21,271.987229,-999,-999
22,327.444319,-999,-999
23,378.308788,0.136,0.0452
24,274.49748,0.1472,0.038
25,247.943237,1.1891,1.4622
26,287.318119,0.0662,0.0334
27,353.306209,1.2017,0.7663
28,131.778699,1.1262,1.3385
29,230.264772,0.4291,0.5269
30,207.892963,0.2121,0.7419
31,425.107796,0.1329,0.2434
32,209.576695,10.9212,11.9171
33,455.237178,0.5219,0.6686
34,219.565606,-999,-999
35,0.765697,-999,-999
36,3.14112,-999,-999
37,205.530699,-999,-999
38,3.174603,-999,-999
39,1.096491,-999,-999
40,532.71343,1.5893,1.4378
41,1.0605,-999,-999
42,27.170871,-999,-999
43,3.892164,-999,-999
44,1.863238,-999,-999
45,0.894274,-999,-999
46,1.066747,-999,-999
47,1.581438,-999,-999
48,1.079592,51.1695,174.2576
49,0.821629,-999,-999
50,0.731764,-999,-999
51,2.819031,-999,-999
52,5.223451,-999,-999
53,0.719424,-999,-999
54,-999,-999,-999
55,1.200608,-999,-999
56,0.472775,-999,-999
57,2.11848,-999,-999
58,1.354899,-999,-999
59,1.003992,-999,-999
60,1.569859,-999,-999
61,45.942987,-999,-999
62,0.872676,-999,-999
63,0.124682,-999,-999
64,0.669523,-999,-999
65,388.628426,1.7876,1.701
66,337.837838,1.67,-999
67,0.595534,-999,-999
68,2.822435,-999,-999
69,0.721501,-999,-999
70,12.025402,-999,-999
71,0.835154,-999,-999
72,1.238291,-999,-999
73,0.779023,-999,-999
74,0.933604,-999,-999
75,0.792393,-999,-999
76,0.232457,-999,-999
77,1.452345,-999,-999
78,3.068586,-999,-999
79,1.917709,-999,-999
80,9.858135,-999,-999
81,0.367001,-999,-999
82,0.719946,-999,-999
83,272.045181,-999,-999
84,0.5854,-999,-999
85,2.872539,-999,-999
86,2.15762,-999,-999
87,7.301316,-999,-999
88,2.411015,-999,-999
89,1.39283,-999,-999
90,0.801307,-999,-999
91,0.563271,-999,-999
92,3.67039,-999,-999
93,0.817696,-999,-999
94,21.419753,-999,-999
95,1.065984,-999,-999
96,0.115088,-999,-999
97,5.093689,-999,-999
98,0.68275,-999,-999
99,0.36408,-999,-999
100,1.200853,-999,-999
101,422.909914,-999,-999
102,-999,-999,-999
103,0.55201,-999,-999
104,0.425216,-999,-999
105,1.979022,-999,-999
106,0.741188,-999,-999
107,15.217011,-999,-999
108,1.585914,-999,-999
109,0.939932,-999,-999
110,0.566185,-999,-999
111,0.928218,-999,-999
112,2.656844,-999,-999
113,40.691272,512.0397,174.5658
114,1.821892,-999,-999
115,430.461055,2.0288,1.9844
116,0.971157,-999,-999
117,1.239311,-999,-999
118,0.681747,-999,-999
119,0.647082,-999,-999
120,1.689189,-999,-999
121,0.678887,-999,-999
122,0.469903,-999,-999
123,384.491935,-999,-999
124,4.6063,-999,-999
125,0.042489,-999,-999
126,393.46001,0.2024,0.0657
127,2.233596,-999,-999
128,6.811989,-999,-999
129,0.828387,-999,-999
130,0.720677,-999,-999
131,1.159958,-999,-999
132,316.455696,-999,-999
133,269.978402,0.0975,-999
134,0.506509,-999,-999
135,192.683716,-999,-999
136,0.329807,-999,-999
137,2.970707,-999,-999
138,0.732773,-999,-999
139,1.11942,-999,-999
140,1.399542,-999,-999
141,3.714703,-999,-999
142,0.567558,-999,-999
143,365.953363,1.6294,1.2175
144,0.486332,-999,-999
145,303.090979,-999,-999
146,0.529661,-999,-999
147,0.992418,-999,-999
148,0.385056,-999,-999
149,0.516935,-999,-999
150,0.815657,-999,-999
151,25.560636,0.1024,0.141
152,0.413092,-999,-999
153,10.604454,-999,-999
154,-999,-999,-999
155,2.251722,-999,-999
156,5.075367,-999,-999
157,4.415316,-999,-999
158,6.394511,-999,-999
159,10.928271,-999,-999
160,12.59014,-999,-999
161,1.834007,-999,-999
162,1.952384,-999,6.8246
163,60.606061,-999,-999
164,384.615385,-999,-999
165,1.68187,-999,-999
166,38.907873,669.0704,106.4503
167,0.544366,-999,-999
168,1.32626,-999,-999
169,0.53234,-999,-999
170,1.455604,-999,-999
171,0.925069,-999,-999
172,2.55941,-999,-999
173,1.528117,-999,-999
174,2.271266,-999,-999
175,1.320796,-999,-999
176,0.110152,-999,-999
177,343.642612,-999,-999
178,0.805802,-999,-999
179,0.289603,-999,-999
180,0.462683,-999,-999
181,1.110981,-999,-999
182,1.084041,-999,-999
183,3.064857,-999,-999
184,173.687946,5.741,3.3667
185,0.456999,-999,-999
186,2.22001,-999,-999
187,2.086968,-999,-999
188,2.283031,-999,-999
189,4.074078,-999,-999
190,1.821695,-999,-999
191,21.842733,4.0725,14.4668
192,0.719871,-999,-999
193,2.93488,-999,-999
194,3.120877,-999,-999
195,8.541675,-999,-999
196,1.249794,-999,-999
197,1.98059,-999,-999
198,0.400479,-999,-999
199,4.321701,-999,-999
200,0.530932,-999,-999
201,0.881912,-999,-999
202,0.882553,-999,-999
203,0.173548,-999,-999
204,1.56601,-999,-999
205,1.446652,-999,-999
206,294.985251,-999,-999
207,246.558157,4.908,2.458
208,13.064834,0.3796,2.0506
209,3.104994,-999,-999
210,200.377707,18.7852,36.2903
211,355.075809,-999,-999
212,179.700978,-999,-999
213,219.56789,5.686,9.8
214,178.702264,7.448,27.826
215,230.978889,4.313,4.073
216,262.964132,2.636,1.997
217,181.616752,16.944,12.805
218,30.623932,0.985,1.09
219,150.763618,-999,-999
220,213.12873,-999,-999
221,337.974855,1.141,1.326
222,208.428863,-999,-999
223,179.600927,-999,-999
224,3.122357,-999,-999
225,4.49708,-999,-999
226,1.095876,-999,-999
227,2.939424,-999,-999
228,1.941748,-999,-999
229,3.799224,-999,-999
230,4.13835,-999,-999
231,2.307227,-999,-999
232,1.48251,-999,-999
233,3.100775,-999,-999
234,2.821371,-999,-999
235,0.12427,-999,-999
236,0.266984,-999,-999
237,1.450908,-999,-999
238,1.024867,-999,-999
239,1.102536,-999,-999
240,1.555832,-999,-999
241,0.870174,-999,-999
242,1.038402,-999,-999
243,6.357905,-999,-999
244,227.885949,-999,-999
245,1.02145,-999,-999
246,29.946923,-999,-999
247,-999,-999,-999
248,0.550187,-999,-999
249,4.750044,-999,-999
250,4.987249,-999,-999
251,0.802661,-999,-999
252,8.879953,-999,-999
253,62.02619,-999,-999
254,6.985276,-999,-999
255,1.907411,-999,-999
256,19.774686,-999,-999
257,0.777596,-999,-999
258,2.351895,-999,-999
259,4.065458,-999,-999
260,1.410528,-999,-999
261,-999,-999,-999
262,0.931159,-999,-999
263,0.351636,-999,-999
264,0.573066,-999,-999
265,2.150718,-999,-999
266,0.871911,-999,-999
267,1.207966,-999,-999
268,1.264943,-999,-999
269,391.180128,4.8466,4.0545
270,22.913372,-999,-999
271,0.442211,-999,-999
272,2.525449,-999,-999
273,366.575075,55.6723,18.9487
274,0.929195,-999,-999
275,1.057256,-999,-999
276,17.953962,-999,-999
277,258.978475,0.286,0.0735
278,0.597218,-999,-999
279,3.69919,-999,-999
280,0.70817,-999,-999
281,3.355904,-999,-999
282,2.252905,-999,-999
283,326.600562,1.1985,1.0914
284,1.614992,-999,-999
285,2.985431,-999,-999
286,317.594455,53.5846,27.6388
287,0.962276,-999,-999
288,3.704334,-999,-999
289,34.657407,8.3187,12.0321
290,367.405552,1.2564,1.2769
291,-999,-999,-999
292,3.001126,-999,-999
293,1.629302,-999,-999
294,0.962393,-999,-999
295,2.006433,-999,-999
296,2.885815,-999,-999
297,2.101348,-999,-999
298,0.458716,-999,-999
299,0.805528,-999,-999
300,2.098095,-999,-999
301,1.469346,-999,-999
302,0.800929,-999,-999
303,0.803588,-999,-999
304,9.010718,-999,-999
305,3.474635,-999,-999
306,3.362529,-999,-999
307,4.21764,-999,-999
308,0.307389,-999,-999
309,29.53643,-999,-999
310,2.10084,-999,-999
311,253.4366,-999,-999
312,0.503881,-999,-999
313,348.559232,0.0666,0.009
314,-999,-999,-999
315,112.949723,-999,-999
316,1.52005,-999,-999
317,1.106301,-999,-999
318,398.406375,-999,-999
319,0.809813,-999,-999
320,0.239866,-999,-999
321,1.082188,-999,-999
322,210.526316,5.84,-999
323,0.823424,-999,-999
324,0.81649,-999,-999
325,5.4598,-999,-999
326,1.775269,-999,-999
327,2.597884,-999,-999
328,1.569859,-999,-999
329,5.110621,1.0287,4.1256
330,1.501516,-999,-999
331,29.0453,4.3667,15.7166
332,2.060715,-999,-999
333,0.823662,-999,-999
334,182.117235,-999,-999
335,1.025931,-999,-999
336,0.119174,-999,-999
337,64.340148,5.4608,9.379
338,2.35676,-999,-999
339,0.290503,-999,-999
340,3.973635,-999,-999
341,1.960168,-999,-999
342,244.490583,30.2301,10.6258
343,0.556715,-999,-999
344,6.4,-999,-999
345,0.20564,-999,-999
346,3.121426,-999,-999
347,44.054069,0.1023,1.415
348,0.36056,0.1023,1.5161
349,2.66723,-999,-999
350,0.146462,-999,-999
351,346.531996,4.7669,3.9776
352,5.996559,-999,-999
353,318.550975,-999,-999
354,1.649646,-999,-999
355,10.87,-999,-999
356,4.654659,-999,-999
357,0.358291,-999,-999
358,2.452781,-999,-999
359,0.912865,-999,-999
360,0.851154,-999,-999
361,1.092638,-999,-999
362,287.457854,0.2631,0.3966
363,0.477642,-999,-999
364,0.693313,-999,-999
365,1.465706,-999,-999
366,0.915751,-999,-999
367,3.65,-999,-999
368,1.750527,-999,-999
369,-999,-999,-999
370,0.456207,-999,-999
371,0.484707,-999,-999
372,0.087948,-999,-999
373,1.898818,-999,-999
374,1.154269,-999,-999
375,1.827478,-999,-999
376,0.801089,-999,-999
377,2.072127,-999,-999
378,1.881822,-999,-999
379,0.773849,-999,-999
380,1.55,-999,-999
381,2.302862,-999,-999
382,1.309343,-999,-999
383,0.462693,-999,-999
384,0.80767,-999,-999
385,8.010467,-999,-999
386,0.931475,-999,-999
387,1.833364,-999,-999
388,2.520617,-999,-999
389,8.865291,-999,-999
390,1.156239,1232.404,162.1456
391,101.406008,23.207,18.9889
392,1.884444,-999,-999
393,74.074074,-999,-999
394,0.540857,-999,-999
395,3.208486,-999,-999
396,8.256428,-999,-999
397,2.5998,-999,-999
398,1.847048,-999,-999
399,11.19465,-999,-999
400,1.354214,-999,-999
401,0.785072,-999,-999
402,-999,-999,-999
403,1.33045,-999,-999
404,3.240644,-999,-999
405,0.586873,-999,-999
406,2.225491,-999,-999
407,1.387706,-999,-999
408,1.551943,-999,-999
409,0.732139,-999,-999
410,4.785704,-999,-999
411,351.370344,7.35,-999
412,0.895978,-999,-999
413,0.167294,-999,-999
414,2.210433,-999,-999
415,2.717737,-999,-999
416,0.624131,-999,-999
417,0.811009,-999,-999
418,0.788932,-999,-999
419,15.459264,-999,-999
420,1.738912,-999,-999
421,1.03895,-999,-999
422,4.115886,-999,-999
423,3.060105,-999,-999
424,90.011842,18.7376,17.2488
425,2.262468,-999,-999
426,1.514432,-999,-999
427,1.036083,-999,-999
428,1.819658,-999,-999
429,1.011858,-999,-999
430,2.88766,-999,-999
431,2.933806,-999,-999
432,3.943875,-999,-999
433,2.489881,-999,-999
434,9.366011,-999,-999
435,0.733735,-999,-999
436,0.633292,-999,-999
437,0.655271,-999,-999
438,1.230618,-999,-999
439,0.821709,-999,-999
440,103.305785,-999,-999
441,0.637758,-999,-999
442,2.322195,-999,-999
443,1.052312,-999,-999
444,-999,-999,-999
445,1.339875,-999,-999
446,1.352255,-999,-999
447,1.312527,-999,-999
448,0.485343,-999,-999
449,0.478126,-999,-999
450,0.553382,-999,-999
451,215.60881,-999,-999
452,0.517698,-999,-999
453,0.227678,-999,-999
454,1.753127,-999,-999
455,0.692148,-999,-999
456,1.040042,-999,-999
457,11.42267,-999,-999
458,1.704221,-999,-999
459,1.51847,-999,-999
460,1.505143,-999,-999
461,1.237372,-999,-999
462,0.91961,-999,-999
463,1.876262,-999,-999
464,1.753573,-999,-999
465,0.448545,-999,-999
466,3.015813,-999,-999
467,0.910991,-999,-999
468,1.175069,-999,-999
469,1.562462,-999,-999
470,4.708586,-999,-999
471,707.314446,0.2675,0.0627
472,0.7279,-999,-999
473,3.951551,-999,-999
474,2.114833,-999,-999
475,1.159929,-999,-999
476,500.250125,24.578,13.283
477,0.580147,-999,-999
478,4.912636,-999,-999
479,1.492346,-999,-999
480,2.270807,-999,-999
481,3.911183,-999,-999
482,0.696073,-999,-999
483,0.601983,-999,-999
484,0.129305,-999,-999
485,1.286172,-999,-999
486,1.401563,-999,-999
487,3.256542,-999,-999
488,-999,-999,-999
489,1.196462,-999,-999
490,-999,-999,-999
491,0.397149,-999,-999
492,322.47662,37.972,21.263
493,190.267837,0.6047,0.5818
494,0.468693,-999,-999
495,1.219622,-999,-999
496,2.257841,-999,-999
497,0.662778,-999,-999
498,7.148899,-999,-999
499,1.2994,-999,-999
500,11.385079,-999,-999
501,9.312161,-999,-999
502,2.208553,-999,-999
503,1.986245,-999,-999
504,427.621905,6.5119,4.83
505,12.033694,-999,-999
506,0.55411,-999,-999
507,6.153895,-999,-999
508,0.807555,-999,-999
509,7.118386,-999,-999
510,1.492479,-999,-999
511,60.779448,7.8051,16.7654
512,0.608374,-999,-999
513,592.421459,0.1981,0.3433
514,8.970828,-999,-999
515,193.715683,-999,-999
516,10.940532,-999,-999
517,3.263592,-999,-999
518,0.415348,-999,-999
519,2.154185,-999,-999
520,0.869119,-999,-999
521,1.725397,-999,-999
522,348.18864,-999,-999
523,1.959365,-999,-999
524,1.874408,-999,-999
525,293.42723,0.335,0.506
526,34.660173,-999,-999
527,1.510592,-999,-999
528,0.721309,-999,-999
529,0.854068,-999,-999
530,3.46494,-999,-999
531,7.19275,-999,-999
532,41.666667,-999,-999
533,133.79315,4.0835,3.0151
534,3.064933,-999,-999
535,2.706887,-999,-999
536,3.027294,-999,-999
537,5.039016,-999,-999
538,214.354785,0.2505,0.8361
539,8.082418,-999,-999
540,0.812147,-999,-999
541,1.374348,-999,-999
542,0.454066,-999,-999
543,0.154989,-999,-999
544,5.537359,-999,-999
545,2.605317,-999,-999
546,2.882601,-999,-999
547,4.379736,-999,-999
548,0.543477,-999,-999
549,1.055344,-999,-999
550,10.034032,-999,-999
551,2.228981,-999,-999
552,0.342536,-999,-999
553,1.479111,-999,-999
554,2.367141,-999,-999
555,38.008828,9.1388,4.1486
556,1.591581,-999,-999
557,5.073189,-999,-999
558,1.611954,-999,-999
559,0.742168,-999,-999
560,1.622665,-999,-999
561,0.84388,-999,-999
562,0.275393,-999,-999
563,15.923547,-999,-999
564,195.722565,9.6117,14.0247
565,246.91358,-999,-999
566,294.749655,-999,-999
567,2.521516,-999,-999
568,3.559919,-999,-999
569,2.848095,-999,-999
570,5.129829,-999,-999
571,15.822251,-999,-999
572,0.367927,-999,-999
573,3.956114,-999,-999
574,0.6594,-999,-999
575,0.555742,-999,-999
576,1.791298,-999,-999
577,1.260481,-999,-999
578,9.374707,-999,-999
579,15.39365,-999,-999
580,2.992096,-999,-999
581,1.218787,-999,-999
582,1.135256,-999,-999
583,0.762838,-999,-999
584,0.603704,-999,-999
585,3.84942,-999,-999
586,1.152142,-999,-999
587,1.060268,-999,-999
588,1.979817,-999,-999
589,0.865597,-999,-999
590,2.451203,-999,-999
591,0.438482,-999,-999
592,2.012072,-999,-999
593,180.18018,-999,-999
594,1.866415,-999,-999
595,128.205128,-999,-999
596,4.084325,-999,-999
597,1.56193,-999,-999
598,3.684092,-999,-999
599,4.29228,-999,-999
600,414.937759,-999,-999
601,5.389093,-999,-999
602,7.381335,-999,-999
603,2.087253,-999,-999
604,322.350433,76.4032,33.6384
605,380.173094,8.7526,8.3392
606,238.004053,15.3554,12.1924
607,2.79204,-999,-999
608,1.126697,-999,-999
609,4.932501,-999,-999
610,1.725868,-999,-999
611,1.938046,-999,-999
612,0.94084,-999,-999
613,6.160538,-999,-999
614,1.468464,-999,-999
615,3.900874,-999,-999
616,0.998004,-999,-999
617,3.070939,-999,-999
618,5.708862,-999,-999
619,0.977636,-999,-999
620,-999,-999,-999
621,8.7,-999,-999
622,0.841812,-999,-999
623,2.74188,-999,-999
624,0.840824,-999,-999
625,1.797863,-999,-999
626,397.987396,7.1299,4.1036
627,8.50602,-999,-999
628,8.3,-999,-999
629,1.857245,-999,-999
630,3.430911,-999,-999
631,2.538723,0.1977,1.8589
632,197.032753,1.5835,1.5314
633,1.790884,-999,-999
634,1.480065,-999,-999
635,1.45909,-999,-999
636,1.012368,-999,-999
637,1.175551,-999,-999
638,3.657986,-999,-999
639,268.817204,-999,-999
640,0.280904,-999,-999
641,0.308544,-999,-999
642,9.839305,-999,-999
643,0.558712,-999,-999
644,2.655552,-999,-999
645,0.426716,-999,-999
646,90.09009,-999,-999
647,3.545952,-999,-999
648,-999,-999,-999
649,3.467205,-999,-999
650,0.963455,-999,-999
651,22.941448,3.5074,14.2863
652,2.496719,-999,-999
653,1.49816,-999,-999
654,1.904493,-999,-999
655,1.688801,-999,-999
656,2.208465,-999,-999
657,9.94,-999,-999
658,3.237704,-999,-999
659,0.565027,-999,-999
660,206.493932,-999,-999
661,2.26968,-999,-999
662,2.357764,-999,-999
663,3.574392,-999,-999
664,0.859708,-999,-999
665,0.236015,-999,-999
666,2.309021,-999,-999
667,1.099115,-999,-999
668,1.571304,-999,-999
669,0.157356,-999,-999
670,2.673418,-999,-999
671,282.535706,4.0367,2.9371
672,1.267087,-999,-999
673,518.134715,-999,-999
674,0.924929,-999,-999
675,3.465707,-999,-999
676,1.70718,-999,-999
677,4.619369,-999,-999
678,0.981881,-999,-999
679,1.596618,-999,-999
680,2.383121,-999,-999
681,0.437622,-999,-999
682,0.161473,-999,-999
683,592.987774,0.2879,0.6685
684,28.962141,6.721,23.2007
685,2.249324,-999,-999
686,271.45302,1.8601,2.0426
687,1.13994,-999,-999
688,4.84,-999,-999
689,0.740063,-999,-999
690,4.04,-999,-999
691,0.533904,-999,-999
692,11.327349,1.8633,1.614
693,1.770666,-999,-999
694,1.321193,-999,-999
695,1.756721,-999,-999
696,1.566824,-999,-999
697,3.89442,-999,-999
698,0.277965,-999,-999
699,3.392593,-999,-999
700,0.473715,-999,-999
701,0.893982,-999,-999
702,0.723354,-999,-999
703,212.765957,-999,-999
704,1.529286,-999,-999
705,0.768095,-999,-999
706,1.952202,-999,-999
707,0.763359,-999,-999
708,0.82203,-999,-999
709,2.122129,-999,-999
710,2.574101,-999,-999
711,0.291943,-999,-999
712,3.633627,-999,-999
713,6.79005,17.1707,24.0329
714,0.646488,-999,-999
715,0.438002,-999,-999
716,2.110281,-999,-999
717,5.041971,-999,-999
718,0.809786,-999,-999
719,2.301788,-999,-999
720,3.057564,-999,-999
721,4.543315,-999,-999
722,1.214566,-999,-999
723,3.913951,-999,-999
724,5.419989,-999,-999
725,19.230769,-999,-999
726,1.519818,-999,-999
727,5.467125,-999,-999
728,1.619938,-999,-999
729,1.507545,-999,-999
730,160.809659,25.262,0
731,0.874649,-999,-999
732,543.478261,0.27,-999
733,5.419229,-999,-999
734,1.506411,-999,-999
735,265.251989,-999,-999
736,3.070081,-999,-999
737,1.033222,-999,-999
738,20.936924,1236.7245,1296.2745
739,2.523341,-999,-999
740,0.433531,-999,-999
741,239.23445,-999,-999
742,2.337685,-999,-999
743,2.09104,-999,-999
744,1.749317,-999,-999
745,5.069033,-999,-999
746,453.611427,1.0972,3.09
747,1.018431,-999,-999
748,2.114041,-999,-999
749,0.201514,-999,-999
750,0.273883,-999,-999
751,0.096969,-999,-999
752,353.35689,-999,-999
753,0.944436,-999,-999
754,2.151927,-999,-999
755,1.614326,-999,-999
756,2.51072,-999,-999
757,2.234548,-999,-999
758,390.568393,0.0651,0.0106
759,236.517386,38.5038,14.7499
760,30.153936,255.8,84.2
761,160.25641,-999,-999
762,79.80846,-999,-999
763,164.744646,-999,-999
764,1.373335,-999,-999
765,1.17752,-999,-999
766,0.410268,-999,-999
767,1.17795,-999,-999
768,0.339168,-999,-999
769,2.916937,-999,-999
770,343.642612,-999,-999
771,0.378473,-999,-999
772,3.82745,-999,-999
773,3.51676,-999,-999
774,2.374631,-999,-999
775,2.18108,-999,-999
776,3.574778,-999,-999
777,0.972176,-999,-999
778,0.781826,-999,-999
779,1.492454,-999,-999
780,0.957074,-999,-999
781,1.976056,-999,-999
782,0.361767,-999,-999
783,1.184682,-999,-999
784,0.402608,-999,-999
785,24.096386,-999,-999
786,243.38088,-999,-999
787,208.686833,0.0896,0.0215
788,145.605762,-999,-999
789,218.396237,-999,-999
790,237.658566,-999,-999
791,2.092078,-999,-999
792,1.261553,-999,-999
793,1.84157,-999,-999
794,373.423704,8.4391,6.6458
795,1.887045,-999,-999
796,5.089578,-999,-999
797,3.562802,-999,-999
798,1.877233,-999,-999
799,0.67626,-999,-999
800,-999,-999,-999
801,0.638889,-999,-999
802,1.542932,-999,-999
803,0.903832,-999,-999
804,1.537434,-999,-999
805,2.893494,-999,-999
806,1.097574,-999,-999
807,9.283481,-999,-999
808,2.50506,-999,-999
809,308.86,-999,-999
810,2.091414,-999,-999
811,0.331895,-999,-999
812,0.795221,-999,-999
813,4.808779,-999,-999
814,106.118735,4.7853,13.0865
815,0.807102,-999,-999
816,7.296359,-999,-999
817,1.791539,-999,-999
818,2.641156,-999,-999
819,1.594171,-999,-999
820,5.172242,-999,-999
821,392.967704,0.1359,0.0256
822,418.511473,1.4174,1.8757
823,461.680517,-999,-999
824,183.72305,128.752,38.524
825,182.815356,-999,-999
826,227.272727,-999,-999
827,0.717307,-999,-999
828,3.961998,-999,-999
829,1.851501,-999,-999
830,0.798031,-999,-999
831,3.337504,-999,-999
832,1.639447,-999,-999
833,1.077851,-999,-999
834,3.855574,-999,-999
835,2.680721,-999,-999
836,3.381809,-999,-999
837,7.238101,-999,-999
838,1.590071,-999,-999
839,0.15949,-999,-999
840,0.33876,-999,-999
841,1.552061,-999,-999
842,0.490515,-999,-999
843,0.824143,-999,-999
844,3.615289,-999,-999
845,1.970911,-999,-999
846,2.194132,-999,-999
847,6.020168,-999,-999
848,1.095325,-999,-999
849,16.52,-999,-999
850,7.842616,-999,-999
851,324.229692,9.5475,8.4213
852,-999,-999,-999
853,32.070194,-999,-999
854,1.186514,-999,-999
855,169.779287,-999,-999
856,0.724542,-999,-999
857,2.757601,-999,-999
858,2.505197,-999,-999
859,0.765581,-999,-999
860,0.377296,-999,-999
861,131.54081,8.9564,6.5677
862,1.619237,-999,-999
863,0.410375,-999,-999
864,3.468017,-999,-999
865,4.693191,-999,-999
866,2.031099,-999,-999
867,1.425283,-999,-999
868,1.891823,-999,-999
869,19.979243,-999,-999
870,3.587709,-999,-999
871,16.012068,2.6159,9.2051
872,1.8898,-999,-999
873,3.172001,-999,-999
874,17.182405,-999,-999
875,3.501099,-999,-999
876,9.11239,-999,-999
877,3.419883,-999,-999
878,2.531993,-999,-999
879,0.215974,-999,-999
880,2.547907,-999,-999
881,1.258048,-999,-999
882,3.383173,-999,-999
883,375.344942,5.3737,4.876
884,0.911738,-999,-999
885,0.597873,-999,-999
886,9.043798,-999,-999
887,1.068636,-999,-999
888,29.310788,40.2945,29.5398
889,14.667084,-999,-999
890,156.599196,30.7465,12.7067
891,2.932828,-999,-999
892,2.999304,-999,-999
893,1.298069,-999,-999
894,0.700771,-999,-999
895,2.726756,-999,-999
896,0.977036,-999,-999
897,2.830753,-999,-999
898,1.412694,-999,-999
899,1.993103,-999,-999
900,1.004218,-999,-999
901,1.705072,-999,-999
902,1.753486,-999,-999
903,8.632402,-999,-999
904,1.309046,-999,-999
905,-999,-999,-999
906,2.03451,-999,-999
907,1.273166,-999,-999
908,497.029394,0.4497,0.5501
909,243.276805,2.7269,2.2699
910,360.711889,-999,-999
911,0.491403,-999,-999
912,-999,-999,-999
913,0.511658,-999,-999
914,0.93273,-999,-999
915,3.26405,-999,-999
916,1.038046,-999,-999
917,23.957175,-999,-999
918,2.114181,-999,-999
919,106.975072,1.3549,6.184
920,16.208474,-999,-999
921,2.138505,-999,-999
922,34.922434,2.1179,9.8334
923,1.05496,-999,-999
924,2.175773,-999,-999
925,0.850456,-999,-999
926,1.366006,-999,-999
927,0.362289,-999,-999
928,0.210147,-999,-999
929,455.644016,0.2777,0.064
930,6.3,-999,-999
931,2.158291,-999,-999
932,2.586366,-999,-999
933,6.451938,-999,-999
934,172.64291,-999,-999
935,5.57144,-999,-999
936,22.100047,12.4231,26.5289
937,125.200245,76.1746,32.3622
938,5.675652,-999,-999
939,1.862857,-999,-999
940,3.79684,-999,-999
941,0.571982,-999,-999
942,0.667273,-999,-999
943,2.559251,-999,-999
944,9.694559,-999,-999
945,2.155001,-999,-999
946,1.277223,-999,-999
947,0.264271,-999,-999
948,0.570611,-999,-999
949,1.867398,-999,-999
950,1.49677,-999,-999
951,1.187502,-999,-999
952,37.390972,2.4845,0.3175
953,0.30175,-999,-999
954,2.421394,-999,-999
955,0.597953,-999,-999
956,1.001001,-999,-999
957,1.18943,-999,-999
958,3.487255,-999,-999
959,1.114511,-999,-999
960,2.811703,-999,-999
961,1.351932,-999,-999
962,11.245449,-999,-999
963,2.949518,-999,-999
964,1.059466,-999,-999
965,4.99042,-999,-999
966,3.316634,-999,-999
967,0.490068,-999,-999
968,7.770094,-999,-999
969,471.90567,0.1786,0.0408
970,1.027266,-999,-999
971,6.597092,-999,-999
972,0.955916,-999,-999
973,0.510533,-999,-999
974,2.198574,-999,-999
975,278.603009,1.9227,1.9333
976,3.375195,-999,-999
977,6.720544,-999,-999
978,3.488596,-999,-999
979,27.760652,228.4,100
980,15.527492,-999,-999
981,1.536483,-999,-999
982,1.127888,-999,-999
983,180.063625,-999,-999
984,125.834588,6.8585,3.0486
985,402.588228,0.0868,0.0573
986,334.672021,1.221,1.6
987,314.267756,1.096,1.15
988,377.358491,-999,-999
989,1.257867,-999,-999
990,2.003222,-999,-999
991,24.428979,8.634,20.044
992,4.65279,-999,-999
993,1.927682,-999,-999
994,0.464186,-999,-999
995,0.797415,-999,-999
996,0.719629,-999,-999
997,9.790869,-999,-999
998,2.529376,-999,-999
999,0.664525,-999,-999
1000,-999,-999,-999
1001,12.784691,-999,-999
1002,0.895917,-999,-999
1003,1.040537,-999,-999
1004,0.988441,-999,-999
1005,2.815664,-999,-999
1006,88.029085,0.9903,4.7105
1007,3.566987,-999,-999
1008,401.606426,-999,-999
1009,3.312488,-999,-999
1010,0.413632,-999,-999
1011,0.953545,-999,-999
1012,16.441357,3.1803,11.4523
1013,1.899133,-999,-999
1014,0.288409,-999,-999
1015,2.811464,-999,-999
1016,1.251564,-999,-999
1017,117.837233,119.6748,29.3405
1018,2.099076,-999,-999
1019,1.122001,-999,-999
1020,1.216177,-999,-999
1021,1.980198,-999,-999
1022,3.584764,-999,-999
1023,1.098515,-999,-999
1024,2.802303,-999,-999
1025,11.875629,-999,-999
1026,0.889019,-999,-999
1027,2.253142,-999,-999
1028,1.91213,-999,-999
1029,0.818715,-999,-999
1030,2.740965,-999,-999
1031,0.730523,-999,-999
1032,3.451979,-999,-999
1033,2.310183,-999,-999
1034,2.13492,-999,-999
1035,1.764496,-999,-999
1036,3.255445,-999,-999
1037,1.071467,-999,-999
1038,0.526039,-999,-999
1039,0.757714,-999,-999
1040,324.684384,62.0515,30.3145
1041,1.134509,-999,-999
1042,1.792627,-999,-999
1043,26.382133,0.4207,3.7295
1044,3.318833,-999,-999
1045,0.654397,-999,-999
1046,144.360649,3.5501,1.9824
1047,2.323074,-999,-999
1048,0.289907,-999,-999
1049,3.613681,-999,-999
1050,2.526971,-999,-999
1051,9.553297,-999,-999
1052,0.523973,-999,-999
1053,1.184862,-999,-999
1054,2.930722,-999,-999
1055,1.974067,-999,-999
1056,0.785644,-999,-999
1057,0.995066,-999,-999
1058,4.108545,-999,-999
1059,0.613179,-999,-999
1060,1.631544,-999,-999
1061,-999,-999,-999
1062,3.380233,-999,-999
1063,1.668758,-999,-999
1064,0.560581,-999,-999
1065,0.828111,-999,-999
1066,1.41031,-999,-999
1067,1.336097,-999,-999
1068,1.55218,-999,-999
1069,486.154232,8.0608,6.4803
1070,2.651551,-999,-999
1071,2.065562,-999,-999
1072,463.115536,0.1208,0.0329
1073,5.600551,-999,-999
1074,279.697699,6.2031,3.8469
1075,383.778121,1.3467,1.3833
1076,1.721645,-999,-999
1077,128.205128,-999,-999
1078,0.634146,-999,-999
1079,233.037978,3.0775,2.6682
1080,1.545123,-999,-999
1081,4.128984,-999,-999
1082,6.865552,-999,-999
1083,1.659095,-999,-999
1084,5.850076,-999,-999
1085,0.792097,-999,-999
1086,3.467949,-999,-999
1087,1.355932,-999,-999
1088,2.00895,-999,-999
1089,1.33394,-999,-999
1090,0.703668,-999,-999
1091,0.483131,-999,-999
1092,141.043724,-999,-999
1093,1.483547,-999,-999
1094,2.205326,-999,-999
1095,5.029204,-999,-999
1096,159.126424,-999,-999
1097,411.880531,-999,-999
1098,0.924772,-999,-999
1099,-999,-999,-999
1100,7.985335,-999,-999
1101,0.292565,-999,-999
1102,-999,-999,-999
1103,1.02521,-999,-999
1104,1.87766,-999,-999
1105,559.440006,0.2335,0.1514
1106,1.930093,-999,-999
1107,1.005348,-999,-999
1108,3.037788,-999,-999
1109,2.450051,-999,-999
1110,1.681873,-999,-999
1111,0.890994,-999,-999
1112,3.741563,-999,-999
1113,0.854781,-999,-999
1114,3.890201,-999,-999
1115,1.044641,-999,-999
1116,277.937707,14.3485,8.8017
1117,5.191976,-999,-999
1118,5.142554,-999,-999
1119,0.801496,-999,-999
1120,1.161741,-999,-999
1121,0.390723,-999,-999
1122,3.466453,-999,-999
1123,269.687163,-999,-999
1124,1.219527,-999,-999
1125,1.157024,-999,-999
1126,1.399188,-999,-999
1127,1.988072,-999,-999
1128,3.532679,-999,-999
1129,1.28483,-999,-999
1130,7.04679,-999,-999
1131,1.191582,-999,-999
1132,2.015816,-999,-999
1133,67.376581,6.3086,6.8807
1134,1.131362,-999,-999
1135,0.719839,-999,-999
1136,1.895857,-999,-999
1137,3.054195,-999,-999
1138,2.92909,-999,-999
1139,0.145349,-999,-999
1140,0.986574,-999,-999
1141,1.519726,-999,-999
1142,2.370701,-999,-999
1143,2.91781,-999,-999
1144,3.354395,-999,-999
1145,0.641883,-999,-999
1146,4.006267,-999,-999
1147,0.781615,-999,-999
1148,0.981939,-999,-999
1149,-999,-999,-999
1150,2.078488,-999,-999
1151,1.271508,-999,-999
1152,0.771087,-999,-999
1153,104.166667,-999,-999
1154,0.771099,-999,-999
1155,1.500515,-999,-999
1156,5.479608,-999,-999
1157,2.820474,-999,-999
1158,2.343864,-999,-999
1159,1.082446,-999,-999
1160,5.189759,-999,-999
1161,0.730843,-999,-999
1162,2.069063,-999,-999
1163,1.180767,-999,-999
1164,1.624641,-999,-999
1165,2.615222,-999,-999
1166,2.185784,-999,-999
1167,1.526204,-999,-999
1168,0.828637,-999,-999
1169,317.378942,8.6866,11.2912
1170,29.850746,-999,-999
1171,2.154679,-999,-999
1172,2.455239,-999,-999
1173,4.316041,-999,-999
1174,0.651887,-999,-999
1175,1.746443,-999,-999
1176,0.403622,-999,-999
1177,1.791288,-999,-999
1178,5.577867,-999,-999
1179,2.770408,-999,-999
1180,1.263383,-999,-999
1181,2.035068,-999,-999
1182,0.819945,-999,-999
1183,0.97482,-999,-999
1184,0.291676,-999,-999
1185,1.763419,-999,-999
1186,14.418187,-999,-999
1187,173.047894,-999,-999
1188,83.421561,22.7456,10.2783
1189,168.595185,1.7804,5.3294
1190,4.912728,-999,-999
1191,0.863111,-999,-999
1192,0.977372,-999,-999
1193,5.816163,-999,-999
1194,0.864782,-999,-999
1195,0.922492,-999,-999
1196,2.68872,-999,-999
1197,260.049004,0.1617,0.2193
1198,1.367124,-999,-999
1199,1.090587,-999,-999
1200,2.184926,-999,-999
1201,3.772557,-999,-999
1202,1.360375,-999,-999
1203,0.931994,-999,-999
1204,0.231106,-999,-999
1205,42.330829,1.6406,0.9794
1206,1.988012,-999,-999
1207,0.783425,-999,-999
1208,90.287332,191.4428,64.8095
1209,2.742796,-999,-999
1210,1.377919,-999,-999
1211,11.754729,-999,-999
1212,337.837838,-999,-999
1213,5.957305,-999,-999
1214,4.288825,-999,-999
1215,1.147786,-999,-999
1216,2.228545,-999,-999
1217,1.534211,-999,-999
1218,2.526765,-999,-999
1219,352.906233,7.383,4.5847
1220,0.424578,-999,-999
1221,2.17231,-999,-999
1222,2.810123,-999,-999
1223,3.24303,-999,-999
1224,2.701672,-999,-999
1225,3.402192,-999,-999
1226,2.217945,-999,-999
1227,2.037254,-999,-999
1228,458.715596,-999,-999
1229,7.105007,-999,-999
1230,1.633105,-999,-999
1231,1.603391,-999,-999
1232,2.274361,-999,-999
1233,2.837167,-999,-999
1234,2.822993,-999,-999
1235,311.52648,0.21,-999
1236,5.519419,-999,-999
1237,1.154773,-999,-999
1238,0.24169,-999,-999
1239,0.655738,-999,-999
1240,0.33465,-999,-999
1241,1.899824,-999,-999
1242,5.524862,-999,-999
1243,166.649906,-999,-999
1244,0.522898,-999,-999
1245,309.67841,0.3159,0.0361
1246,301.376193,12.525,9.0393
1247,1.788681,-999,-999
1248,1.736197,-999,-999
1249,1.475614,-999,-999
1250,1.814088,-999,-999
1251,1.393462,-999,-999
1252,0.955283,-999,-999
1253,0.585085,-999,-999
1254,4.375053,-999,-999
1255,1.228996,-999,-999
1256,1.068882,-999,-999
1257,2.290916,-999,-999
1258,1.406806,-999,-999
1259,2.839736,-999,-999
1260,471.698113,-999,-999
1261,0.496213,-999,-999
1262,1.459989,-999,-999
1263,1.971003,-999,-999
1264,4.46028,-999,-999
1265,0.847898,-999,-999
1266,0.827339,-999,-999
1267,2.038709,-999,-999
1268,0.627059,-999,-999
1269,0.385419,-999,-999
1270,1.488175,-999,-999
1271,1.889926,-999,-999
1272,1.959041,-999,-999
1273,4.839135,-999,-999
1274,0.830121,-999,-999
1275,2.323601,-999,-999
1276,505.056564,0.2278,0.0471
1277,117.370892,-999,-999
1278,118.20331,-999,-999
1279,346.020761,-999,-999
1280,438.596491,-999,-999
1281,1.296401,-999,-999
1282,3.954604,-999,-999
1283,8.419397,-999,-999
1284,2.028023,-999,-999
1285,6.491542,-999,-999
1286,0.857823,-999,-999
1287,1.194222,-999,-999
1288,1.41844,-999,-999
1289,1.43213,-999,-999
1290,1.296798,-999,-999
1291,1.302558,-999,-999
1292,1.957218,-999,-999
1293,0.89131,-999,-999
1294,1.760388,-999,-999
1295,8.48882,-999,-999
1296,3.595121,-999,-999
1297,1.309014,1940.9,2382
1298,2.936834,-999,-999
1299,1.701957,-999,-999
1300,3.779891,-999,-999
1301,316.123984,175.4607,55.3297
1302,4.843951,-999,-999
1303,5.606888,-999,-999
1304,1.932628,-999,-999
1305,1.352999,-999,-999
1306,0.916583,-999,-999
1307,96.362235,-999,-999
1308,283.440943,1.2591,1.389
1309,268.666866,-999,-999
1310,320.688696,0.5914,0.924
1311,402.093702,0.1126,0.037
1312,332.944805,1.378,1.2517
1313,5.710818,-999,-999
1314,494.760637,0.0909,0.0641
1315,-999,-999,-999
1316,216.373337,147.0174,25.0726
1317,0.909879,-999,-999
1318,4.21247,-999,-999
1319,0.741895,-999,-999
1320,1.393713,-999,-999
1321,2.518892,-999,-999
1322,5.750081,-999,-999
1323,2.197425,-999,-999
1324,3.985007,-999,-999
1325,7.938888,-999,-999
1326,2.579382,-999,-999
1327,2.433915,-999,-999
1328,0.207566,-999,-999
1329,170.940171,23,-999
1330,1.189513,-999,-999
1331,4.317727,-999,-999
1332,1.886525,-999,-999
1333,0.560032,-999,-999
1334,4.709952,-999,-999
1335,0.094245,-999,-999
1336,0.625079,-999,-999
1337,1.389941,-999,-999
1338,1.58823,-999,-999
1339,6.062161,-999,-999
1340,1.713018,-999,-999
1341,0.984972,-999,-999
1342,292.02,-999,-999
1343,3.81642,-999,-999
1344,1.297169,-999,-999
1345,1.148486,-999,-999
1346,1.795215,-999,-999
1347,3.359174,-999,-999
1348,1.629804,-999,-999
1349,0.571575,-999,-999
1350,3.237108,-999,-999
1351,3.232079,-999,-999
1352,2.625569,-999,-999
1353,7.866404,-999,-999
1354,6.393873,-999,-999
1355,1.207729,-999,-999
1356,1.027334,-999,-999
1357,1.184721,-999,-999
1358,1.932579,-999,-999
1359,1.574659,-999,-999
1360,1.122919,-999,-999
1361,0.5697,-999,-999
1362,3.27389,-999,-999
1363,0.586944,-999,-999
1364,1.091937,-999,-999
1365,0.129749,-999,-999
1366,264.192151,-999,-999
1367,508.212195,0.0519,0.0107
1368,242.180871,1.2268,0.6889
1369,3.278287,-999,-999
1370,0.980997,-999,-999
1371,2.004096,-999,-999
1372,1.632498,-999,-999
1373,2.385042,-999,-999
1374,1.05155,-999,-999
1375,0.32685,-999,-999
1376,1.833652,-999,-999
1377,0.615866,-999,-999
1378,1.262909,-999,-999
1379,1.064775,-999,-999
1380,0.784963,-999,-999
1381,0.907808,-999,-999
1382,1.841838,-999,-999
1383,0.837914,-999,-999
1384,0.667624,-999,-999
1385,1.369612,-999,-999
1386,1.288402,-999,-999
1387,211.41649,-999,-999
1388,136.054422,-999,-999
1389,0.636831,-999,-999
1390,1.640401,-999,-999
1391,0.297646,-999,-999
1392,30.277357,3.0163,10.4497
1393,0.857303,-999,-999
1394,2.70735,-999,-999
1395,2.398808,-999,-999
1396,409.954363,-999,-999
1397,1.560164,-999,-999
1398,2.108008,-999,-999
1399,2.830512,-999,-999
1400,1.8363,-999,-999
1401,1.223524,-999,-999
1402,0.736211,-999,-999
1403,0.669303,-999,-999
1404,1.78411,-999,-999
1405,3.523709,-999,-999
1406,1.323565,-999,-999
1407,1.729017,-999,-999
1408,190.782671,3.8059,3.4837
1409,278.252962,0.1445,0.2528
1410,131.356873,0.215,0.1929
1411,292.588404,1.1179,0.988
1412,309.239712,0.1585,0.0702
1413,435.78167,0.2055,0.0573
1414,217.009055,0.7744,0.6203
1415,3.432398,-999,-999
1416,0.407395,-999,-999
1417,3.096852,-999,-999
1418,1.243311,-999,-999
1419,2.561948,-999,-999
1420,5.490409,-999,-999
1421,4.39435,-999,-999
1422,4.640189,-999,-999
1423,4.157592,-999,-999
1424,0.470919,-999,-999
1425,0.787253,-999,-999
1426,1.243254,-999,-999
1427,0.825229,-999,-999
1428,0.155207,-999,-999
1429,0.572314,-999,-999
1430,0.716125,-999,-999
1431,3.27617,-999,-999
1432,4.334474,-999,-999
1433,3.264528,-999,-999
1434,4.210881,-999,-999
1435,403.19004,-999,-999
1436,3.344622,-999,-999
1437,3.915016,-999,-999
1438,1.1703,-999,-999
1439,3.135371,-999,-999
1440,1.161349,-999,-999
1441,4.493148,-999,-999
1442,1.236788,-999,-999
1443,1.705648,-999,-999
1444,1.620801,-999,-999
1445,2.326001,-999,-999
1446,0.677192,-999,-999
1447,2.763031,-999,-999
1448,6.257822,-999,-999
1449,1.721118,-999,-999
1450,1.122845,-999,-999
1451,0.173497,-999,-999
1452,3.752716,-999,-999
1453,2.434441,-999,-999
1454,1.444845,-999,-999
1455,221.967751,149.1332,33.5842
1456,1.701934,-999,-999
1457,0.815806,-999,-999
1458,0.090857,-999,-999
1459,0.770513,-999,-999
1460,2.2241,-999,-999
1461,0.839614,-999,-999
1462,1.531267,-999,-999
1463,215.926931,22.7119,15.2885
1464,2.232855,-999,-999
1465,1.703618,-999,-999
1466,-999,-999,-999
1467,0.576071,-999,-999
1468,1.155755,-999,-999
1469,9.759978,-999,-999
1470,1.048044,-999,-999
1471,1.261576,-999,-999
1472,3.489656,-999,-999
1473,310.536979,-999,-999
1474,1.151007,-999,-999
1475,2.148853,-999,-999
1476,9.744852,922.4708,139.6241
1477,1.112059,-999,-999
1478,3.916045,-999,-999
1479,1.285101,-999,-999
1480,10.807574,-999,-999
1481,218.81184,67.8251,32.3424
1482,0.624955,-999,-999
1483,2.548086,-999,-999
1484,2.312,-999,-999
1485,1.436206,-999,-999
1486,0.261442,-999,-999
1487,11.884954,-999,-999
1488,0.793516,-999,-999
1489,1.282663,-999,-999
1490,1.077461,-999,-999
1491,3.590742,-999,-999
1492,0.482589,-999,-999
1493,1.742933,-999,-999
1494,1.824485,-999,-999
1495,473.933649,-999,-999
1496,1.586512,-999,-999
1497,3.207053,-999,-999
1498,0.965188,-999,-999
1499,1.79913,-999,-999
1500,0.256345,-999,-999
1501,1.523695,-999,-999
1502,1.465376,-999,-999
1503,0.869944,-999,-999
1504,0.921217,-999,-999
1505,2.513463,-999,-999
1506,2.857727,-999,-999
1507,1.126482,-999,-999
1508,316.483687,0.2009,0.3987
1509,3.107584,-999,-999
1510,0.775567,-999,-999
1511,0.295983,-999,-999
1512,13.392274,-999,-999
1513,1.823423,-999,-999
1514,1.693558,-999,-999
1515,172.707045,0.0907,0.0018
1516,2.202679,-999,-999
1517,2.025215,-999,-999
1518,5.288361,-999,-999
1519,4.246732,-999,-999
1520,0.297885,-999,-999
1521,2.093297,-999,-999
1522,0.638732,-999,-999
1523,0.618941,-999,-999
1524,1.143819,-999,-999
1525,1.611738,-999,-999
1526,10.853978,-999,-999
1527,2.847992,-999,-999
1528,0.995979,0.2583,0.3533
1529,2.475004,-999,-999
1530,285.989344,-999,-999
1531,3.56603,-999,-999
1532,2.095742,-999,-999
1533,1.217137,-999,-999
1534,2.505114,-999,-999
1535,4.234063,-999,-999
1536,4.575526,-999,-999
1537,538.870683,0.6154,1.2258
1538,1.599913,-999,-999
1539,4.932793,-999,-999
1540,1.305831,-999,-999
1541,1.054589,-999,-999
1542,0.70324,-999,-999
1543,0.818526,-999,-999
1544,0.763878,-999,-999
1545,4.168065,-999,-999
1546,0.795047,-999,-999
1547,0.96855,-999,-999
1548,0.484875,-999,-999
1549,208.688856,-999,-999
1550,0.682561,-999,-999
1551,0.764175,-999,-999
1552,8.099122,-999,-999
1553,0.900793,-999,-999
1554,3.479089,-999,-999
1555,1.132787,-999,-999
1556,1.582779,-999,-999
1557,408.163265,-999,-999
1558,0.773335,-999,-999
1559,-999,-999,-999
1560,36.923282,40.3077,56.5325
1561,35.205127,0.3952,0.0578
1562,2.590649,-999,-999
1563,1.624594,-999,-999
1564,1.154278,-999,-999
1565,15.084572,-999,-999
1566,123.110287,-999,-999
1567,0.650015,-999,-999
1568,7.170504,-999,-999
1569,0.305788,-999,-999
1570,10.017073,-999,-999
1571,426.519344,0.3111,0.1202
1572,1.327937,-999,-999
1573,1.647717,-999,-999
1574,1.835972,-999,-999
1575,1.205068,-999,-999
1576,2.067098,-999,-999
1577,5.087941,-999,-999
1578,3.004025,-999,-999
1579,7.893283,-999,-999
1580,0.457875,-999,-999
1581,1.592406,-999,-999
1582,3.09182,-999,-999
1583,188.233512,5.263,3.9829
1584,3.311258,-999,-999
1585,1.147206,-999,-999
1586,1.515624,-999,-999
1587,1.301771,-999,-999
1588,2.762034,-999,-999
1589,0.802623,-999,-999
1590,2.962129,-999,-999
1591,1.780062,-999,-999
1592,0.988891,-999,-999
1593,1.191335,-999,-999
1594,1.63259,-999,-999
1595,3.317235,-999,-999
1596,1.847453,-999,-999
1597,0.855183,-999,-999
1598,1.277324,-999,-999
1599,2.384728,-999,-999
1600,2.849232,-999,-999
1601,1.958027,-999,-999
1602,1.000756,-999,-999
1603,0.378469,-999,-999
1604,0.627975,-999,-999
1605,0.155158,-999,-999
1606,2.88,-999,-999
1607,1.988851,-999,-999
1608,239.519965,79.5174,9.3328
1609,1.300945,-999,-999
1610,2.220089,-999,-999
1611,1.22508,-999,-999
1612,2.515187,-999,-999
1613,170.93737,0.3548,0.3434
1614,0.718499,-999,-999
1615,0.505345,-999,-999
1616,2.860486,-999,-999
1617,1.593078,-999,-999
1618,2.255171,-999,-999
1619,1.819844,-999,-999
1620,1.301238,-999,-999
1621,1.369164,-999,-999
1622,4.270419,-999,-999
1623,0.822573,-999,-999
1624,0.549916,-999,-999
1625,3.097064,-999,-999
1626,8.743419,-999,-999
1627,4.178555,-999,-999
1628,1.888785,-999,-999
1629,1.139522,-999,-999
1630,2.925923,-999,-999
1631,6.489833,-999,-999
1632,1.245252,-999,-999
1633,0.590787,-999,-999
1634,0.945001,-999,-999
1635,1.647754,-999,-999
1636,1.753422,231.0296,756.9079
1637,1.941745,-999,-999
1638,273.947918,1.3541,1.6528
1639,0.489457,-999,-999
1640,266.869167,16.3353,11.0033
1641,0.256114,-999,-999
1642,2.41721,-999,-999
1643,0.389864,-999,-999
1644,2.883532,-999,-999
1645,1.119873,-999,-999
1646,0.734895,-999,-999
1647,4.473116,-999,-999
1648,0.528053,-999,-999
1649,1.142678,-999,-999
1650,1.206475,-999,-999
1651,1.952315,-999,-999
1652,7.575758,-999,-999
1653,6.98,-999,-999
1654,0.983914,-999,-999
1655,2.424824,-999,-999
1656,2.248985,-999,-999
1657,0.678596,-999,-999
1658,2.467083,-999,-999
1659,0.804824,-999,-999
1660,0.414138,-999,-999
1661,5.178519,-999,-999
1662,1.754448,-999,-999
1663,3.266191,-999,-999
1664,245.42612,-999,-999
1665,0.569085,-999,-999
1666,0.593998,-999,-999
1667,0.938033,-999,-999
1668,5.798972,0.1914,0.2123
1669,2.811628,-999,-999
1670,213.332237,-999,-999
1671,0.956565,-999,-999
1672,51.609431,4.9435,2.3786
1673,377.05547,0.7302,0.0882
1674,0.943531,-999,-999
1675,0.861629,-999,-999
1676,184.614253,0.1656,0.0625
1677,2.051164,-999,-999
1678,0.265694,-999,-999
1679,1.01833,-999,-999
1680,5.336766,-999,-999
1681,2.721579,-999,-999
1682,1.431941,-999,-999
1683,3.277614,-999,-999
1684,0.288597,-999,-999
1685,0.945047,-999,-999
1686,0.67637,-999,-999
1687,0.928418,-999,-999
1688,1.05795,-999,-999
1689,5.011492,-999,-999
1690,0.633395,-999,-999
1691,1.998983,-999,-999
1692,0.359702,-999,-999
1693,19.174406,-999,-999
1694,10.120026,-999,-999
1695,607.677538,-999,-999
1696,2.537212,-999,-999
1697,3.46497,-999,-999
1698,59.665418,20.55,4.467
1699,160.59271,-999,-999
1700,74.097014,0.2861,0.3972
1701,61.485477,-999,-999
1702,263.599833,9.834,9.4976
1703,2.25816,-999,-999
1704,86.481637,0.0756,0.1197
1705,172.770057,-999,-999
1706,195.323563,-999,-999
1707,196.582994,-999,-999
1708,716.355562,1.0944,1.1028
1709,273.329343,0.1707,0.0406
1710,302.632296,-999,-999
1711,224.818628,-999,-999
1712,201.403784,-999,-999
1713,47.10675,0.8509,2.8088
1714,337.962341,-999,-999
1715,529.070665,-999,-999
1716,168.067227,-999,-999
1717,208.231917,9.6198,12.782
1718,118.538253,-999,-999
1719,212.134969,-999,-999
1720,455.000455,60.06,23.6
1721,180.500854,-999,-999
1722,46.142765,-999,-999
1723,203.008999,-999,-999
1724,104.491133,1.328,1.818
1725,12.447421,1.102,2.454
1726,336.74002,-999,-999
1727,445.49383,-999,-999
1728,280.145788,0.4431,0.596
1729,115.381509,0.3855,1.619
1730,596.434514,0.2595,0.112
1731,578.496141,0.3626,1.272
1732,355.618777,30.295,28.602
1733,198.864879,-999,-999
1734,163.488451,-999,-999
1735,141.145053,-999,-999
1736,304.030841,3.5703,5.9725
1737,482.506719,0.5036,0.567
1738,237.801949,4.877,5.869
1739,333.415576,4.9985,5.1071
1740,488.243106,1.17,1.1785
1741,406.076529,3.4881,3.5304
1742,340.852555,0.8001,0.9378
1743,2.612776,-999,-999
1744,103.263527,2.9338,1.3201
1745,0.432591,-999,-999
1746,0.368384,-999,-999
1747,1.143529,-999,-999
1748,0.748846,-999,-999
1749,1.639684,-999,-999
1750,2.243046,-999,-999
1751,3.251221,-999,-999
1752,0.750576,-999,-999
1753,2.293363,-999,-999
1754,0.523887,-999,-999
1755,0.177335,-999,-999
1756,1.40293,-999,-999
1757,1.111881,-999,-999
1758,28.777763,17.1416,20.061
1759,0.768927,-999,-999
1760,1.098463,-999,-999
1761,1.461959,-999,-999
1762,8.960506,17.3343,24.3931
1763,164.621462,3.6051,2.8659
1764,37.638304,-999,-999
1765,194.554922,-999,-999
1766,2.532699,-999,-999
1767,448.430493,-999,-999
1768,255.436111,110.7465,32.5282
1769,1.824062,-999,-999
1770,1.347067,-999,-999
1771,2.444684,-999,-999
1772,5.234596,-999,-999
1773,1.777596,-999,-999
1774,1.56194,-999,-999
1775,2.466371,-999,-999
1776,15.88439,-999,-999
1777,10.511068,13.6376,18.1154
1778,1.892733,-999,-999
1779,11.647056,-999,-999
1780,53.69522,0.3877,0.2097
1781,1.499691,-999,-999
1782,226.716242,-999,-999
1783,0.478412,-999,-999
1784,0.757294,-999,-999
1785,2.764794,-999,-999
1786,2.546448,-999,-999
1787,0.418166,-999,-999
1788,5.243573,-999,-999
1789,1.362872,-999,-999
1790,3.103362,-999,-999
1791,0.850363,-999,-999
1792,0.995508,-999,-999
1793,4.28191,-999,-999
1794,3.172628,9.6963,12.2844
1795,2.320874,-999,-999
1796,3.817454,-999,-999
1797,1.042246,-999,-999
1798,78.210119,11.5156,10.6451
1799,1.344084,-999,-999
1800,2.469256,-999,-999
1801,35.135073,0.3196,2.7565
1802,1.491469,-999,-999
1803,1.168243,-999,-999
1804,1.380236,-999,-999
1805,5.575565,-999,-999
1806,2.215954,-999,-999
1807,46.517617,0.1835,2.2378
1808,5.39636,-999,-999
1809,4.271573,-999,-999
1810,56.538013,-999,-999
1811,112.740064,0.4533,2.0865
1812,1.443936,-999,-999
1813,2.324077,-999,-999
1814,0.474549,-999,-999
1815,0.831329,-999,-999
1816,1.30428,-999,-999
1817,1.055681,-999,-999
1818,0.398048,-999,-999
1819,1.252424,-999,-999
1820,1.367044,-999,-999
1821,3.925874,-999,-999
1822,0.351693,-999,-999
1823,2.169284,-999,-999
1824,1.233475,-999,-999
1825,1.789265,-999,-999
1826,0.685994,-999,-999
1827,1.045425,-999,-999
1828,1.740946,-999,-999
1829,0.926823,-999,-999
1830,5.68129,2.043,6.8246
1831,2.67815,-999,-999
1832,1.276837,-999,-999
1833,0.55578,-999,-999
1834,0.970101,-999,-999
1835,1.728982,-999,-999
1836,1.085196,-999,-999
1837,139.360885,-999,-999
1838,34.528493,59.8365,33.8754
1839,267.472675,-999,-999
1840,236.600598,-999,-999
1841,131.550032,-999,-999
1842,40.173574,-999,-999
1843,19.383088,-999,-999
1844,177.219389,-999,-999
1845,307.692308,-999,-999
1846,275.854709,-999,-999
1847,0.39208,-999,-999
1848,0.901937,-999,-999
1849,2.282515,-999,-999
1850,2.664523,-999,-999
1851,2.404846,-999,-999
1852,8.004854,-999,-999
1853,0.924291,-999,-999
1854,134.163639,20.7717,7.8093
1855,0.721707,-999,-999
1856,1.804202,-999,-999
1857,1.505344,-999,-999
1858,0.595035,-999,-999
1859,1.942987,-999,-999
1860,79.066424,0.6989,3.7189
1861,1.757447,-999,-999
1862,0.40633,-999,-999
1863,657.894737,-999,-999
1864,1.8636,-999,-999
1865,0.349121,-999,-999
1866,2.254035,-999,-999
1867,7.481283,-999,-999
1868,9.404498,-999,-999
1869,2.990293,406.781,58.94
1870,140.817452,-999,-999
1871,227.427792,-999,-999
1872,171.232877,-999,-999
1873,180.831826,-999,-999
1874,1.578751,-999,-999
1875,43.288441,2.6168,3.9205
1876,1.752816,-999,-999
1877,107.031649,11.1287,7.2815
1878,0.785539,-999,-999
1879,669.933583,-999,-999
1880,4.572232,-999,-999
1881,469.724725,0.3369,0.0877
1882,2.199491,-999,-999
1883,0.846547,-999,-999
1884,2.464453,-999,-999
1885,2.794805,-999,-999
1886,1.51194,-999,-999
1887,2.334589,-999,-999
1888,2.064894,-999,-999
1889,1.913442,-999,-999
1890,1.496313,-999,-999
1891,1.136634,-999,-999
1892,2.075444,-999,-999
1893,66.296875,43.867,21.6088
1894,1.251721,-999,-999
1895,2.153778,-999,-999
1896,6.107714,-999,-999
1897,326.856263,0.0711,0.0122
1898,238.881431,9.9567,28.9204
1899,0.361769,-999,-999
1900,1.208056,-999,-999
1901,2.352305,-999,-999
1902,1.141495,-999,-999
1903,1.675061,-999,-999
1904,1.836381,-999,-999
1905,4.148783,-999,-999
1906,0.132347,-999,-999
1907,1.088838,-999,-999
1908,0.406854,-999,-999
1909,2.740385,-999,-999
1910,1.342324,-999,-999
1911,3.185873,-999,-999
1912,1.116962,-999,-999
1913,0.483863,-999,-999
1914,0.889299,-999,-999
1915,12.083823,-999,-999
1916,0.180481,-999,-999
1917,2.299848,-999,-999
1918,1.423663,-999,-999
1919,6.812521,-999,-999
1920,1.162267,-999,-999
1921,3.2501,-999,-999
1922,4.603765,-999,-999
1923,0.861228,-999,-999
1924,602.409639,0.15,0.095
1925,6.505492,-999,-999
1926,30.467142,15.012,11.9779
1927,3.830687,-999,-999
1928,1.081146,-999,-999
1929,2.165849,-999,-999
1930,0.381118,-999,-999
1931,2.555028,-999,-999
1932,9.598591,18.7792,34.7827
1933,1.793839,-999,-999
1934,15.463838,-999,-999
1935,375.85602,6.2723,5.7057
1936,2.404928,-999,-999
1937,0.697981,-999,-999
1938,1.2596,-999,-999
1939,0.985679,-999,-999
1940,0.829618,-999,-999
1941,1.85756,-999,-999
1942,2.320234,-999,-999
1943,0.525455,-999,-999
1944,0.817426,-999,-999
1945,3.16621,-999,-999
1946,4.219706,-999,-999
1947,1.702195,-999,-999
1948,20.802023,-999,-999
1949,22.351084,-999,-999
1950,2.972434,-999,-999
1951,2.344851,-999,-999
1952,3.044008,-999,-999
1953,225.733042,8.1598,5.5926
1954,1.074011,-999,-999
1955,0.98598,-999,-999
1956,0.725759,-999,-999
1957,1.331095,-999,-999
1958,1.044426,-999,-999
1959,0.251515,-999,-999
1960,3.941663,-999,-999
1961,478.4689,-999,-999
1962,5.038875,-999,-999
1963,0.800049,-999,-999
1964,2.342777,-999,-999
1965,4.594687,-999,-999
1966,1.682086,-999,-999
1967,1.27826,-999,-999
1968,1.686667,-999,-999
1969,313.174936,0.3609,0.5954
1970,4.588779,-999,-999
1971,2.282608,-999,-999
1972,4.452284,-999,-999
1973,6.678062,-999,-999
1974,0.488559,-999,-999
1975,1.598798,-999,-999
1976,2.58385,-999,-999
1977,2.60087,-999,-999
1978,1.19398,-999,-999
1979,1.835538,-999,-999
1980,3.430656,-999,-999
1981,3.554023,-999,-999
1982,1.064181,-999,-999
1983,1.814442,-999,-999
1984,1.049639,-999,-999
1985,0.733411,-999,-999
1986,1.173644,-999,-999
1987,3.316861,-999,-999
1988,3.399481,-999,-999
1989,0.72039,-999,-999
1990,0.943073,-999,-999
1991,0.659763,-999,-999
1992,0.559131,-999,-999
1993,0.234565,-999,-999
1994,4.414251,-999,-999
1995,0.425146,-999,-999
1996,2.541156,-999,-999
1997,1.582278,-999,-999
1998,1.672012,-999,-999
1999,2.964537,-999,-999
2000,1.085235,-999,-999
2001,3.000717,-999,-999
2002,3.2268,-999,-999
2003,29.602148,-999,-999
2004,2.414811,-999,-999
2005,1.10826,-999,-999
2006,0.603861,-999,-999
2007,0.522158,-999,-999
2008,0.731699,-999,-999
2009,0.792483,-999,-999
2010,0.66313,-999,-999
2011,0.733774,-999,-999
2012,2.003705,-999,-999
2013,1.197835,286.8303,97.7279
2014,6.716164,-999,-999
2015,1.025956,-999,-999
2016,0.559586,-999,-999
2017,0.482849,-999,-999
2018,4.65612,-999,-999
2019,0.118515,-999,-999
2020,1.203144,-999,-999
2021,0.533541,-999,-999
2022,1.690853,-999,-999
2023,2.190523,-999,-999
2024,1.316175,-999,-999
2025,1.328186,-999,-999
2026,3.573615,357.762,200.672
2027,0.541555,-999,-999
2028,1.620464,-999,-999
2029,0.615231,-999,-999
2030,0.610951,-999,-999
2031,183.823389,-999,-999
2032,2.641335,-999,-999
2033,2.463443,-999,-999
2034,331.119221,-999,-999
2035,227.583068,-999,-999
2036,206.185567,-999,-999
2037,164.168746,1.5401,3.0033
2038,194.931774,-999,-999
2039,3.520453,-999,-999
2040,421.940928,-999,-999
2041,0.400085,-999,-999
2042,4.469703,-999,-999
2043,245.94703,82.549,35.4459
2044,2.294846,-999,-999
2045,2.758681,-999,-999
2046,0.716025,-999,-999
2047,2.78246,-999,-999
2048,2.42583,-999,-999
2049,5.281576,-999,-999
2050,0.860775,-999,-999
2051,0.664066,-999,-999
2052,327.405573,-999,-999
2053,152.741714,-999,-999
2054,240.442414,8.078,7.356
2055,12.526305,30.404,24.877
2056,184.501845,-999,-999
2057,407.996736,-999,-999
2058,169.233373,0.1046,0.0165
2059,216.02938,0.435,0.7195
2060,254.333031,0.4594,0.7659
2061,247.586036,0.0974,0.025
2062,224.164985,3.9103,2.605
2063,243.902439,0.2257,0.057
2064,209.017679,0.2425,0.0325
2065,298.251729,0.1985,0.0497
2066,4.477874,-999,-999
2067,1.28378,-999,-999
2068,219.609941,52.6305,18.2664
2069,1.300355,-999,-999
2070,0.519245,-999,-999
2071,3.581684,-999,-999
2072,0.419815,-999,-999
2073,0.786658,-999,-999
2074,0.477752,-999,-999
2075,9.072459,-999,-999
2076,9.853499,-999,-999
2077,1.297656,-999,-999
2078,2.617302,-999,-999
2079,212.958203,-999,-999
2080,3.69683,-999,-999
2081,446.428571,-999,-999
2082,1.951037,-999,-999
2083,4.069058,-999,-999
2084,2.003259,-999,-999
2085,3.71175,-999,-999
2086,275.482094,6,-999
2087,6.527544,-999,-999
2088,4.059541,-999,-999
2089,13.877994,-999,-999
2090,0.654324,-999,-999
2091,1.162342,-999,-999
2092,1.348364,-999,-999
2093,1.943547,-999,-999
2094,5.021406,-999,-999
2095,3.140695,-999,-999
2096,1.206031,-999,-999
2097,3.255919,-999,-999
2098,24.384401,1.176,7.238
2099,0.350018,-999,-999
2100,2.892698,-999,-999
2101,6.556863,-999,-999
2102,4.077306,-999,-999
2103,2.46869,-999,-999
2104,0.160732,-999,-999
2105,1.338352,-999,-999
2106,1.296189,-999,-999
2107,0.938458,-999,-999
2108,1.633632,-999,-999
2109,14.866165,-999,-999
2110,0.349902,-999,-999
2111,0.461749,-999,-999
2112,1.968716,-999,-999
2113,1.872948,-999,-999
2114,1.343553,-999,-999
2115,1.544818,-999,-999
2116,367.767121,-999,-999
2117,3.027055,-999,-999
2118,1.582779,-999,-999
2119,5.017561,-999,-999
2120,3.425471,-999,-999
2121,1.45617,-999,-999
2122,0.657227,-999,-999
2123,2.068428,-999,-999
2124,11.724958,-999,-999
2125,0.132181,-999,-999
2126,16.159357,-999,-999
2127,1.578182,-999,-999
2128,534.759358,-999,-999
2129,0.529259,-999,-999
2130,1.919554,1.8111,0.7227
2131,3.034607,-999,-999
2132,3.44699,-999,-999
2133,2.049543,-999,-999
2134,3.151444,-999,-999
2135,1.949336,-999,-999
2136,1.268466,-999,-999
2137,2.036073,-999,-999
2138,0.402852,-999,-999
2139,1.951877,-999,-999
2140,0.852719,-999,-999
2141,1.638649,-999,-999
2142,2.79091,-999,-999
2143,0.682288,-999,-999
2144,195.450398,6.6925,4.6544
2145,1.18784,-999,-999
2146,0.91933,-999,-999
2147,0.450088,-999,-999
2148,3.269789,-999,-999
2149,1.181343,-999,-999
2150,1.163884,-999,-999
2151,4.250816,-999,-999
2152,1.608405,-999,-999
2153,6.880069,-999,-999
2154,2.634795,-999,-999
2155,3.306336,-999,-999
2156,6.027087,-999,-999
2157,-999,-999,-999
2158,1.491456,-999,-999
2159,257.13551,-999,-999
2160,546.360586,1.1979,1.4308
2161,2.822973,-999,-999
2162,2.187011,-999,-999
2163,1.777112,-999,-999
2164,2.015344,-999,-999
2165,5.594207,-999,-999
2166,298.121588,0.2028,0.0464
2167,309.379715,-999,-999
2168,1.445087,-999,-999
2169,5.771545,-999,-999
2170,2.391544,-999,-999
2171,1.620649,-999,-999
2172,2.111877,-999,-999
2173,4.973548,-999,-999
2174,10.384841,-999,-999
2175,0.524712,-999,-999
2176,0.909756,98.3637,40.878
2177,0.509286,-999,-999
2178,0.533044,-999,-999
2179,1.617187,-999,-999
2180,196.463654,-999,-999
2181,18.474044,-999,-999
2182,0.453891,-999,-999
2183,5.455692,-999,-999
2184,2.250095,-999,-999
2185,2.625598,-999,-999
2186,6.863053,-999,-999
2187,4.249688,-999,-999
2188,1.078542,-999,-999
2189,14.18475,-999,-999
2190,0.82078,-999,-999
2191,1.820961,-999,-999
2192,0.525771,-999,-999
2193,2.048165,-999,-999
2194,0.388014,-999,-999
2195,1.071506,-999,-999
2196,0.789397,-999,-999
2197,4.187917,-999,-999
2198,0.373736,-999,-999
2199,1.919608,-999,-999
2200,6.690724,-999,-999
2201,1.70847,-999,-999
2202,2.062223,-999,-999
2203,2.224456,-999,-999
2204,2.386778,-999,-999
2205,0.523169,-999,-999
2206,187.265918,-999,-999
2207,1.253953,-999,-999
2208,2.367893,-999,-999
2209,1.163645,-999,-999
2210,0.528164,-999,-999
2211,28.107357,944.6402,115.7229
2212,2.283788,-999,-999
2213,1.046383,-999,-999
2214,0.912042,-999,-999
2215,0.188346,-999,-999
2216,1.062743,-999,-999
2217,1.325433,-999,-999
2218,0.151571,-999,-999
2219,0.605011,-999,-999
2220,33.587732,10.4716,3.5041
2221,1.507565,-999,-999
2222,0.603261,-999,-999
2223,4.900325,-999,-999
2224,-999,-999,-999
2225,5.372045,-999,-999
2226,0.084825,-999,-999
2227,1.095391,-999,-999
2228,2.243415,-999,-999
2229,2.622474,-999,-999
2230,0.749312,-999,-999
2231,2.828034,-999,-999
2232,0.948561,-999,-999
2233,0.323807,-999,-999
2234,2.469626,-999,-999
2235,4.285845,-999,-999
2236,0.543495,-999,-999
2237,1.898678,-999,-999
2238,1.771556,-999,-999
2239,3.194721,-999,-999
2240,0.796515,-999,-999
2241,2.901528,-999,-999
2242,2.120425,-999,-999
2243,1.226589,-999,-999
2244,2.673797,-999,-999
2245,1.135932,-999,-999
2246,1.277794,-999,-999
2247,0.789267,-999,-999
2248,1.492822,-999,-999
2249,0.493212,-999,-999
2250,7.557781,-999,-999
2251,1.278881,-999,-999
2252,1.324568,-999,-999
2253,1.488951,-999,-999
2254,5.21881,-999,-999
2255,2.103525,-999,-999
2256,1.864233,-999,-999
2257,541.809745,-999,-999
2258,182.770888,-999,-999
2259,1.713648,-999,-999
2260,0.293553,-999,-999
2261,3.084639,-999,-999
2262,2.171539,-999,-999
2263,280.112045,-999,-999
2264,1.559824,-999,-999
2265,238.917573,50.6459,14.1735
2266,1.969581,-999,-999
2267,3.6635,-999,-999
2268,0.143446,-999,-999
2269,0.834286,-999,-999
2270,1.904584,-999,-999
2271,8.860955,-999,-999
2272,1.009055,-999,-999
2273,3.711356,-999,-999
2274,2.983627,-999,-999
2275,3.910769,-999,-999
2276,2.663376,-999,-999
2277,1.092061,-999,-999
2278,11.83432,-999,-999
2279,4.816127,-999,-999
2280,2.054439,-999,-999
2281,0.915459,-999,-999
2282,0.703406,-999,-999
2283,2.936619,-999,-999
2284,9.551586,-999,-999
2285,1.576406,-999,-999
2286,4.849191,-999,-999
2287,0.381837,-999,-999
2288,2.30217,-999,-999
2289,0.223378,-999,-999
2290,3.062119,-999,-999
2291,2.856249,-999,-999
2292,1.160928,-999,-999
2293,4.433578,-999,-999
2294,0.439947,-999,-999
2295,0.204967,-999,-999
2296,288.761036,-999,-999
2297,153.139357,-999,-999
2298,0.149097,-999,-999
2299,0.351258,-999,-999
2300,1.672776,-999,-999
2301,3.857331,-999,-999
2302,1.043851,-999,-999
2303,2.933996,-999,-999
2304,1.285076,-999,-999
2305,0.601316,-999,-999
2306,1.860037,-999,-999
2307,3.642235,-999,-999
2308,1.516456,-999,-999
2309,1.872589,-999,-999
2310,0.303938,-999,-999
2311,5.223496,-999,-999
2312,0.610825,-999,-999
2313,4.444356,-999,-999
2314,0.450734,-999,-999
2315,1.976454,-999,-999
2316,3.042614,-999,-999
2317,0.762068,-999,-999
2318,1.324977,-999,-999
2319,2.413224,-999,-999
2320,3.358302,-999,-999
2321,0.447674,-999,-999
2322,0.232116,-999,-999
2323,25.958797,-999,-999
2324,1.902588,-999,-999
2325,0.758409,-999,-999
2326,2.033719,-999,-999
2327,552.486188,-999,-999
2328,1.097249,-999,-999
2329,2.522132,-999,-999
2330,1.487032,-999,-999
2331,0.545774,-999,-999
2332,1.844489,-999,-999
2333,0.678187,-999,-999
2334,1.496093,-999,-999
2335,0.599981,-999,-999
2336,1.313725,-999,-999
2337,2.374587,-999,-999
2338,1.048895,-999,-999
2339,0.689028,-999,-999
2340,3.627901,-999,-999
2341,1.925805,-999,-999
2342,1.11937,-999,-999
2343,0.456309,-999,-999
2344,5.968724,-999,-999
2345,0.635086,-999,-999
2346,0.924348,-999,-999
2347,6.001179,-999,-999
2348,1.362055,-999,-999
2349,280.917517,84.9499,34.001
2350,223.22106,0.7354,0.4524
2351,3.439781,-999,-999
2352,2.89367,-999,-999
2353,0.722562,-999,-999
2354,43.770068,-999,-999
2355,1.927817,-999,-999
2356,0.70969,-999,-999
2357,3.435246,-999,-999
2358,1.049118,-999,-999
2359,1.102564,-999,-999
2360,2.906822,-999,-999
2361,0.222652,-999,-999
2362,2.297827,-999,-999
2363,3.5125,-999,-999
2364,0.520751,-999,-999
2365,0.829667,-999,-999
2366,0.520653,-999,-999
2367,4.079967,-999,-999
2368,2.137236,-999,-999
2369,1.044113,-999,-999
2370,3.137156,-999,-999
2371,2.813335,-999,-999
2372,0.458675,-999,-999
2373,0.086515,-999,-999
2374,0.730444,-999,-999
2375,1.24547,-999,-999
2376,9.531743,-999,-999
2377,414.937759,-999,-999
2378,6.096446,-999,-999
2379,0.849048,-999,-999
2380,2.214973,-999,-999
2381,2.331117,-999,-999
2382,5.38416,-999,-999
2383,0.754063,-999,-999
2384,179.21147,-999,-999
2385,1.907826,-999,-999
2386,0.265102,-999,-999
2387,232.018561,-999,-999
2388,2.973207,-999,-999
2389,5.830224,-999,-999
2390,9.858326,-999,-999
2391,354.609929,-999,-999
2392,29.944547,-999,-999
2393,2.513261,-999,-999
2394,1.076971,-999,-999
2395,1.733523,-999,-999
2396,0.532834,-999,-999
2397,3.628742,-999,-999
2398,2.339783,-999,-999
2399,1.707788,-999,-999
2400,2.282636,-999,-999
2401,0.757198,-999,-999
2402,1.104805,-999,-999
2403,7.911372,-999,-999
2404,0.954078,-999,-999
2405,465.238972,0.1483,-999
2406,0.25545,-999,-999
2407,244.391378,115.6538,40.7695
2408,369.00369,-999,-999
2409,2.766481,-999,-999
2410,1.303306,-999,-999
2411,0.489273,-999,-999
2412,0.219403,-999,-999
2413,0.731824,-999,-999
2414,1.590987,-999,-999
2415,1.838165,-999,-999
2416,2.217787,-999,-999
2417,1.744601,-999,-999
2418,0.872148,-999,-999
2419,0.289593,-999,-999
2420,0.769101,-999,-999
2421,2.251542,-999,-999
2422,4.051589,-999,-999
2423,3.949915,-999,-999
2424,1.017263,-999,-999
2425,0.612158,-999,-999
2426,1.182945,-999,-999
2427,1.277433,-999,-999
2428,0.56775,-999,-999
2429,0.59591,-999,-999
2430,0.4504,-999,-999
2431,9.90001,-999,-999
2432,0.703497,-999,-999
2433,0.717626,-999,-999
2434,1.890959,-999,-999
2435,3.865711,-999,-999
2436,2.895184,-999,-999
2437,278.234418,61.54,29.2194
2438,1.077041,-999,-999
2439,1.612339,-999,-999
2440,3.739162,-999,-999
2441,0.101111,-999,-999
2442,1.829491,-999,-999
2443,12.359917,-999,-999
2444,2.379524,-999,-999
2445,2.699176,-999,-999
2446,3.058385,-999,-999
2447,0.460681,-999,-999
2448,0.141739,-999,-999
2449,2.801678,-999,-999
2450,7.15512,-999,-999
2451,1.584829,-999,-999
2452,2.404869,-999,-999
2453,2.994998,-999,-999
2454,1.141618,-999,-999
2455,1.2942,-999,-999
2456,2.857541,-999,-999
2457,1.988373,-999,-999
2458,186.494078,12.3272,9.2308
2459,0.271207,-999,-999
2460,2.496256,-999,-999
2461,0.212104,-999,-999
2462,1.340792,-999,-999
2463,5.059597,-999,-999
2464,0.213073,-999,-999
2465,383.141762,-999,-999
2466,2.682763,-999,-999
2467,1.152812,-999,-999
2468,3.893417,-999,-999
2469,2.064623,-999,-999
2470,1.814689,-999,-999
2471,419.460817,46.0826,19.6034
2472,423.728814,-999,-999
2473,1.786875,-999,-999
2474,116.686114,-999,-999
2475,1.044168,-999,-999
2476,17.822135,-999,-999
2477,621.118012,-999,-999
2478,0.661591,-999,-999
2479,2.973624,-999,-999
2480,2.181786,-999,-999
2481,0.957568,-999,-999
2482,1.966332,-999,-999
2483,195.694716,-999,-999
2484,-999,-999,-999
2485,1.070696,-999,-999
2486,0.7175,-999,-999
2487,2.596094,-999,-999
2488,0.545753,-999,-999
2489,31.162356,-999,-999
2490,2.671928,-999,-999
2491,203.697558,12.476,6.7164
2492,13.815971,-999,-999
2493,3.201902,-999,-999
2494,2.564963,-999,-999
2495,1.03046,-999,-999
2496,0.702302,-999,-999
2497,1.633429,-999,-999
2498,1.660503,-999,-999
2499,0.781743,-999,-999
2500,1.285906,-999,-999
2501,4.655277,-999,-999
2502,3.136593,-999,-999
2503,358.422939,-999,-999
2504,3.469582,-999,-999
2505,1.129637,-999,-999
2506,0.769412,-999,-999
2507,128.258137,2.3992,1.8426
2508,2.811159,-999,-999
2509,1.24736,-999,-999
2510,1.21978,-999,-999
2511,1.570883,-999,-999
2512,1.525669,-999,-999
2513,1.802593,-999,-999
2514,0.375505,-999,-999
2515,1.448066,-999,-999
2516,1.140194,-999,-999
2517,1.62666,-999,-999
2518,0.217374,-999,-999
2519,1.20192,-999,-999
2520,13.204807,-999,-999
2521,0.96366,-999,-999
2522,1.552798,-999,-999
2523,0.56119,-999,-999
2524,0.546192,-999,-999
2525,0.511023,-999,-999
2526,2.407352,-999,-999
2527,0.817142,-999,-999
2528,0.655879,-999,-999
2529,1.339446,-999,-999
2530,1.484769,-999,-999
2531,2.049967,-999,-999
2532,5.256794,-999,-999
2533,1.270949,-999,-999
2534,2.44415,-999,-999
2535,573.921045,2.0118,1.902
2536,1.371165,-999,-999
2537,3.317203,-999,-999
2538,465.135238,95.1741,105.5935
2539,0.868509,-999,-999
2540,0.071175,-999,-999
2541,2.79603,-999,-999
2542,2.67296,-999,-999
2543,2.315408,-999,-999
2544,1.263851,-999,-999
2545,216.450216,-999,-999
2546,6.529973,-999,-999
2547,1.126983,-999,-999
2548,0.811708,-999,-999
2549,6.012706,-999,-999
2550,2.799906,-999,-999
2551,1.535661,-999,-999
2552,277.940062,11.0508,9.9389
2553,7.167191,-999,-999
2554,2.282639,-999,-999
2555,2.63583,-999,-999
2556,198.412698,-999,-999
2557,1.330601,-999,-999
2558,14.065707,14.9343,9.6348
2559,4.320588,-999,-999
2560,164.139791,-999,-999
2561,0.59505,-999,-999
2562,1.656287,-999,-999
2563,203.665988,-999,-999
2564,0.506347,-999,-999
2565,4.785643,-999,-999
2566,3.797304,-999,-999
2567,0.663249,-999,-999
2568,225.225225,-999,-999
2569,161.550889,-999,-999
2570,0.538628,-999,-999
2571,381.679389,-999,-999
2572,1.331898,-999,-999
2573,0.648756,-999,-999
2574,2.398082,-999,-999
2575,1.554767,-999,-999
2576,313.190897,0.8126,0.5886
2577,264.242346,-999,-999
2578,-999,-999,-999
2579,1.27665,-999,-999
2580,2.266496,-999,-999
2581,1.010401,-999,-999
2582,0.398145,-999,-999
2583,1.543114,-999,-999
2584,0.838392,-999,-999
2585,4.58184,-999,-999
2586,5.866135,-999,-999
2587,0.611804,-999,-999
2588,0.579102,-999,-999
2589,358.480447,0.6096,0.625
2590,0.95844,-999,-999
2591,480.012672,7.0419,4.3502
2592,2.515156,-999,-999
2593,3.741465,-999,-999
2594,2.812781,-999,-999
2595,0.777264,-999,-999
2596,8.966669,-999,-999
2597,0.650834,-999,-999
2598,6.940918,0.166,1.42
2599,17.485574,-999,-999
2600,2.307124,-999,-999
2601,1.289749,-999,-999
2602,0.981265,-999,-999
2603,2.841882,-999,-999
2604,1.616134,-999,-999
2605,4.164008,-999,-999
2606,0.878424,-999,-999
2607,9.377982,-999,-999
2608,3.089776,-999,-999
2609,4.580013,-999,-999
2610,2.906132,-999,-999
2611,2.749698,-999,-999
2612,1.740044,-999,-999
2613,5.965605,-999,-999
2614,0.654861,-999,-999
2615,4.422683,-999,-999
2616,0.192369,-999,-999
2617,0.704146,-999,-999
2618,1.209047,-999,-999
2619,1.58169,-999,-999
2620,0.80922,-999,-999
2621,2.358491,-999,-999
2622,1.180926,-999,-999
2623,3.436181,-999,-999
2624,5.928471,-999,-999
2625,4.709147,-999,-999
2626,5.505395,-999,-999
2627,1.952703,-999,-999
2628,5.393823,-999,-999
2629,2.971286,-999,-999
2630,1.204428,-999,-999
2631,110.497238,-999,-999
2632,93.54537,-999,-999
2633,0.314977,-999,-999
2634,389.95588,0.1463,0.1169
2635,2.648459,-999,-999
2636,0.983334,-999,-999
2637,1.010273,-999,-999
2638,1.322764,-999,-999
2639,1.348141,-999,-999
2640,0.802639,-999,-999
2641,4.21654,-999,-999
2642,0.66895,-999,-999
2643,4.485325,-999,-999
2644,0.494858,-999,-999
2645,3.52557,-999,-999
2646,147.058824,-999,-999
2647,2.227442,-999,-999
2648,0.813463,-999,-999
2649,1.003907,-999,-999
2650,1.843484,-999,-999
2651,339.315687,1.5334,1.898
2652,0.734968,-999,-999
2653,2.959851,-999,-999
2654,1.981744,-999,-999
2655,0.429136,-999,-999
2656,1.504485,-999,-999
2657,3.246248,-999,-999
2658,2.208152,-999,-999
2659,1.793371,-999,-999
2660,1.856504,-999,-999
2661,0.368674,-999,-999
2662,3.072996,-999,-999
2663,2.43215,-999,-999
2664,1.881492,-999,-999
2665,258.397933,-999,-999
2666,0.756704,-999,-999
2667,0.693606,-999,-999
2668,200.658805,58.4667,21.1291
2669,2.924832,-999,-999
2670,306.167446,0.8371,1.206
2671,119.648733,-999,-999
2672,189.489871,-999,-999
2673,110.677192,-999,-999
2674,218.733858,-999,-999
2675,117.848178,-999,-999
2676,0.144092,-999,-999
2677,276.355755,0.141,0.0377
2678,185.724277,-999,-999
2679,1.254847,-999,-999
2680,3.653545,-999,-999
2681,3.087777,-999,-999
2682,2.736203,-999,-999
2683,5.23909,-999,-999
2684,275.805338,2.7166,1.7629
2685,36.71072,-999,-999
2686,0.989647,-999,-999
2687,3.333422,-999,-999
2688,216.171231,-999,-999
2689,2.171997,-999,-999
2690,1.114243,-999,-999
2691,2.4429,-999,-999
2692,1.490957,-999,-999
2693,315.457413,-999,-999
2694,0.447834,-999,-999
2695,1.607778,-999,-999
2696,1.210748,-999,-999
2697,0.618762,-999,-999
2698,1.51058,-999,-999
2699,198.931292,67.7439,32.7429
2700,0.79543,-999,-999
2701,7.439978,-999,-999
2702,6.125732,-999,-999
2703,0.805176,-999,-999
2704,1.194532,-999,-999
2705,27.848472,-999,-999
2706,2.303033,-999,-999
2707,5.2613,-999,-999
2708,2.219165,-999,-999
2709,36.650165,0.2063,1.7546
2710,1.082401,-999,-999
2711,3.267241,-999,-999
2712,1.082964,-999,-999
2713,1.917646,-999,-999
2714,1.174979,-999,-999
2715,2.185665,-999,-999
2716,1.1378,-999,-999
2717,1.441314,-999,-999
2718,54.019533,-999,-999
2719,2.195393,-999,-999
2720,2.272521,-999,-999
2721,0.402416,-999,-999
2722,7.200979,-999,-999
2723,1.6639,-999,-999
2724,0.439068,-999,-999
2725,0.862426,-999,-999
2726,3.15153,-999,-999
2727,1.552457,-999,-999
2728,0.648212,-999,-999
2729,0.485835,-999,-999
2730,0.368991,-999,-999
2731,2.91735,-999,-999
2732,2.471872,-999,-999
2733,0.459348,-999,-999
2734,5.758803,-999,-999
2735,9.995906,-999,-999
2736,3.361411,-999,-999
2737,16.940538,0.323,2.3418
2738,0.618723,-999,-999
2739,89.12656,-999,-999
2740,1.845863,-999,-999
2741,1.152193,-999,-999
2742,2.272752,-999,-999
2743,0.458139,-999,-999
2744,3.700217,-999,-999
2745,0.617918,-999,-999
2746,1.589902,-999,-999
2747,2.862213,-999,-999
2748,4.397779,-999,-999
2749,3.54805,-999,-999
2750,0.800886,-999,-999
2751,0.87916,-999,-999
2752,1.229302,-999,-999
2753,0.469557,-999,-999
2754,11.398609,-999,-999
2755,1.959593,-999,-999
2756,177.619893,-999,-999
2757,5.137928,-999,-999
2758,2.239842,-999,-999
2759,2.987525,-999,-999
2760,2.347984,-999,-999
2761,130.789516,10.9132,8.3505
2762,1.252046,-999,-999
2763,1.167203,-999,-999
2764,4.29203,-999,-999
2765,0.846723,-999,-999
2766,9.095043,-999,-999
2767,233.64486,-999,-999
2768,2.696268,-999,-999
2769,265.957447,-999,-999
2770,0.786003,-999,-999
2771,0.623448,-999,-999
2772,1.750088,-999,-999
2773,0.72915,-999,-999
2774,1.776862,-999,-999
2775,0.480459,-999,-999
2776,215.982721,-999,-999
2777,1.534891,-999,-999
2778,0.963555,-999,-999
2779,0.451304,-999,-999
2780,1.961223,-999,-999
2781,0.623924,-999,-999
2782,1.273039,-999,-999
2783,400.581353,9.9293,7.7266
2784,0.448916,-999,-999
2785,1.259043,-999,-999
2786,4.747247,-999,-999
2787,1.778403,-999,-999
2788,1.744714,-999,-999
2789,0.217252,-999,-999
2790,1.617645,-999,-999
2791,1.634254,-999,-999
2792,6.964968,-999,-999
2793,1.067865,-999,-999
2794,377.880186,39.6493,20.8474
2795,1.217975,-999,-999
2796,1.314611,-999,-999
2797,0.747774,-999,-999
2798,1.779124,-999,-999
2799,4.234222,-999,-999
2800,0.852687,-999,-999
2801,0.927709,-999,-999
2802,1.888136,-999,-999
2803,0.870118,-999,-999
2804,2.693893,-999,-999
2805,0.953507,-999,-999
2806,1.827455,-999,-999
2807,26.322717,-999,-999
2808,263.980714,-999,-999
2809,1.680128,-999,-999
2810,174.825175,-999,-999
2811,4.167535,-999,-999
2812,2.005495,-999,-999
2813,2.666082,-999,-999
2814,0.340694,-999,-999
2815,6.327395,-999,-999
2816,1.318508,-999,-999
2817,0.782508,-999,-999
2818,1.450873,-999,-999
2819,2.57162,-999,-999
2820,512.820513,-999,-999
2821,1.46028,-999,-999
2822,4.205389,-999,-999
2823,0.604193,-999,-999
2824,0.257347,-999,-999
2825,243.309002,-999,-999
2826,20.116677,-999,-999
2827,13.2172,-999,-999
2828,0.521825,-999,-999
2829,0.931029,-999,-999
2830,0.621575,-999,-999
2831,3.144041,-999,-999
2832,0.20558,-999,-999
2833,0.754761,-999,-999
2834,3.283964,-999,-999
2835,3.243532,-999,-999
2836,1.474078,-999,-999
2837,1.724665,-999,-999
2838,3.587701,-999,-999
2839,0.742935,-999,-999
2840,3.343679,-999,-999
2841,3.44465,-999,-999
2842,4.929022,-999,-999
2843,2.071396,-999,-999
2844,3.352178,-999,-999
2845,0.69878,-999,-999
2846,0.422705,-999,-999
2847,330.949795,0.1366,0.019
2848,0.989375,-999,-999
2849,2.48139,-999,-999
2850,3.450199,-999,-999
2851,14.549601,-999,-999
2852,3.396047,-999,-999
2853,94.87666,-999,-999
2854,0.4423,-999,-999
2855,1.261336,-999,-999
2856,172.413793,-999,-999
2857,1.026325,-999,-999
2858,1.223496,-999,-999
2859,0.940734,-999,-999
2860,0.856971,-999,-999
2861,1.1535,-999,-999
2862,1.887929,-999,-999
2863,22.421525,-999,-999
2864,0.250288,-999,-999
2865,0.819356,-999,-999
2866,2.947976,-999,-999
2867,1.773899,-999,-999
2868,3.878495,-999,-999
2869,1.381982,-999,-999
2870,1.228176,-999,-999
2871,0.686811,-999,-999
2872,1.240695,-999,-999
2873,1.315734,-999,-999
2874,3.090808,-999,-999
2875,311.52648,-999,-999
2876,2.34896,-999,-999
2877,0.621231,-999,-999
2878,7.307001,-999,-999
2879,5.39025,45.06,86.8903
2880,173.388147,76.406,29.7488
2881,1.684462,-999,-999
2882,0.562042,-999,-999
2883,3.181113,-999,-999
2884,4.271105,-999,-999
2885,1.995518,-999,-999
2886,1.717841,-999,-999
2887,-999,-999,-999
2888,4.414646,-999,-999
2889,0.536385,198.9251,76.9255
2890,23.905551,41.508,68.8589
2891,4.80273,-999,-999
2892,3.728319,-999,-999
2893,6.921864,-999,-999
2894,1.750025,-999,-999
2895,2.285953,-999,-999
2896,1.07721,-999,-999
2897,46.495984,5.1539,13.6735
2898,2.690125,-999,-999
2899,24.539877,-999,-999
2900,1.228969,-999,-999
2901,0.487193,-999,-999
2902,282.212314,12.8194,12.2816
2903,4.329296,-999,-999
2904,5.604391,-999,-999
2905,1.759194,-999,-999
2906,0.515528,-999,-999
2907,2.787546,-999,-999
2908,238.089468,90.7639,31.9742
2909,1.528098,-999,-999
2910,1.185469,-999,-999
2911,12.481569,-999,-999
2912,0.308168,-999,-999
2913,1.033764,-999,-999
2914,17.139391,-999,-999
2915,102.880658,-999,-999
2916,30.376671,-999,-999
2917,0.71905,-999,-999
2918,1.555307,-999,-999
2919,31.663736,-999,-999
2920,4.164931,-999,-999
2921,0.348096,-999,-999
2922,252.674072,17.3061,9.2583
2923,4.975614,-999,-999
2924,0.603344,-999,-999
2925,0.891614,-999,-999
2926,0.34453,-999,-999
2927,1.455431,-999,-999
2928,379.631246,16.2558,8.3178
2929,6.019905,-999,-999
2930,1.132077,-999,-999
2931,44.926049,2.4672,8.9507
2932,0.4329,-999,-999
2933,641.928222,-999,-999
2934,0.466127,-999,-999
2935,1.549661,-999,-999
2936,2.141499,-999,-999
2937,0.81153,-999,-999
2938,1.022006,-999,-999
2939,3.862316,-999,-999
2940,1.828741,-999,-999
2941,10.183299,-999,-999
2942,0.539003,-999,-999
2943,207.747779,-999,-999
2944,4.601563,-999,-999
2945,-999,-999,-999
2946,1.104492,-999,-999
2947,1.78864,-999,-999
2948,0.433623,-999,-999
2949,2.482265,-999,-999
2950,1.189193,-999,-999
2951,0.711724,-999,-999
2952,1.436241,-999,-999
2953,3.634609,-999,-999
2954,0.738939,-999,-999
2955,4.912594,-999,-999
2956,2.241015,-999,-999
2957,1.028353,-999,-999
2958,196.688796,8.3115,8.0641
2959,192.856521,-999,-999
2960,2.444181,-999,-999
2961,1.188838,-999,-999
2962,0.500776,-999,-999
2963,276.396328,-999,-999
2964,0.956359,-999,-999
2965,0.931185,-999,-999
2966,0.210226,-999,-999
2967,0.93571,-999,-999
2968,10.964912,-999,-999
2969,2.033076,-999,-999
2970,0.438128,-999,-999
2971,2.269537,-999,-999
2972,58.961655,0.0785,1.1543
2973,0.749372,-999,-999
2974,0.211461,-999,-999
2975,1.941118,-999,-999
2976,2.298532,-999,-999
2977,1.042266,-999,-999
2978,315.443564,27.0199,13.8686
2979,369.00369,0.13,0.0435
2980,0.675336,-999,-999
2981,0.900135,-999,-999
2982,384.138167,-999,-999
2983,6.348862,-999,-999
2984,122.399021,-999,-999
2985,0.556152,-999,-999
2986,5.526694,-999,-999
2987,2.53579,-999,-999
2988,1.892677,-999,-999
2989,5.085776,-999,-999
2990,3.012048,-999,-999
2991,1.072164,-999,-999
2992,1.394095,-999,-999
2993,0.757936,-999,-999
2994,2.437003,-999,-999
2995,1.044259,-999,-999
2996,76.114025,1.9495,7.2887
2997,2.573743,-999,-999
2998,2.1933,-999,-999
2999,3.127346,-999,-999
3000,232.300152,22.1914,14.2199
3001,0.490523,-999,-999
3002,0.358562,-999,-999
3003,0.196306,-999,-999
3004,5.496692,-999,-999
3005,3.636024,-999,-999
3006,0.927947,-999,-999
3007,48.233774,0.3919,2.7982
3008,241.545894,-999,-999
3009,55.493896,-999,-999
3010,0.600361,-999,-999
3011,25.296479,-999,-999
3012,1.17386,-999,-999
3013,225.225225,-999,-999
3014,204.582651,0.1767,0.0782
3015,12.515645,-999,-999
3016,34.566194,-999,-999
3017,9.933446,-999,-999
3018,0.749645,-999,-999
3019,0.989117,-999,-999
3020,0.786658,-999,-999
3021,0.476317,-999,-999
3022,5.170509,-999,-999
3023,1.073872,82.7173,71.6248
3024,10.786433,-999,-999
3025,2.343694,-999,-999
3026,2.833395,-999,-999
3027,0.720959,-999,-999
3028,2.066116,-999,-999
3029,205.222255,-999,-999
3030,163.047913,117.3491,31.4127
3031,3.57769,-999,-999
3032,0.931205,-999,-999
3033,1.927013,-999,-999
3034,116.748695,-999,-999
3035,0.199502,-999,-999
3036,3.290438,-999,-999
3037,3.845941,-999,-999
3038,13.929517,-999,-999
3039,1.036166,-999,-999
3040,252.419737,0.2381,0.2833
3041,3.2501,-999,-999
3042,2.668045,-999,-999
3043,3.443654,-999,-999
3044,0.910265,-999,-999
3045,3.207184,-999,-999
3046,622.122031,0.382,0.0892
3047,2.462562,-999,-999
3048,0.325332,-999,-999
3049,0.743647,-999,-999
3050,1.390499,-999,-999
3051,3.616669,-999,-999
3052,2.370826,-999,-999
3053,1.435213,-999,-999
3054,1.104891,-999,-999
3055,0.99022,-999,-999
3056,1.501775,-999,-999
3057,0.47365,-999,-999
3058,4.150193,-999,-999
3059,0.438662,-999,-999
3060,1.53598,-999,-999
3061,1.625927,-999,-999
3062,3.247355,-999,-999
3063,462.201872,0.6514,0.8427
3064,1.721552,-999,-999
3065,0.574086,-999,-999
3066,6.108913,-999,-999
3067,2.001221,-999,-999
3068,3.07008,-999,-999
3069,2.179909,-999,-999
3070,0.215796,-999,-999
3071,40.820678,-999,-999
3072,1.644182,-999,-999
3073,1.69723,-999,-999
3074,0.658215,-999,-999
3075,4.422457,-999,-999
3076,13.065064,-999,-999
3077,0.695232,-999,-999
3078,191.450912,-999,-999
3079,1.768755,-999,-999
3080,207.629361,23.3589,12.0518
3081,0.644523,-999,-999
3082,0.693266,-999,-999
3083,0.399096,-999,-999
3084,1.073269,-999,-999
3085,1.838229,-999,-999
3086,1.723581,-999,-999
3087,3.622825,-999,-999
3088,2.713336,-999,-999
3089,4.344169,-999,-999
3090,0.43416,-999,-999
3091,15.398738,635.0238,150.773
3092,24.630542,-999,-999
3093,345.278136,2.1985,2.1929
3094,432.098476,0.0978,0.0437
3095,1.861701,-999,-999
3096,4.464286,-999,-999
3097,0.545715,-999,-999
3098,5.997031,-999,-999
3099,2.478448,-999,-999
3100,1.792264,-999,-999
3101,0.456288,-999,-999
3102,2.579553,-999,-999
3103,254.160346,76.5116,38.7676
3104,4.56621,-999,-999
3105,9.639395,-999,-999
3106,2.698764,-999,-999
3107,3.769067,-999,-999
3108,1.244555,-999,-999
3109,377.358491,-999,-999
3110,2.912038,-999,-999
3111,20.58512,-999,-999
3112,0.991179,-999,-999
3113,1.889656,-999,-999
3114,88.261253,-999,-999
3115,2.683706,-999,-999
3116,0.792393,-999,-999
3117,2.511471,-999,-999
3118,0.909379,-999,-999
3119,1.940924,-999,-999
3120,5.659072,-999,-999
3121,0.821825,-999,-999
3122,1.586011,-999,-999
3123,4.996787,-999,-999
3124,7.478313,-999,-999
3125,0.58193,-999,-999
3126,3.266053,-999,-999
3127,4.403925,-999,-999
3128,1.727116,-999,-999
3129,6.980975,16835,13580
3130,0.199465,-999,-999
3131,168.096678,56.3078,20.1631
3132,0.780202,-999,-999
3133,273.95,-999,-999
3134,0.735983,-999,-999
3135,1.992321,-999,-999
3136,0.482072,-999,-999
3137,1.616253,-999,-999
3138,6.25,-999,-999
3139,0.633999,-999,-999
3140,0.701967,-999,-999
3141,305.810398,-999,-999
3142,377.229363,0.228,0.4711
3143,1.15526,-999,-999
3144,1.776199,-999,-999
3145,220.569096,77.2006,24.57
3146,420.189443,1.4823,1.624
3147,10.402519,-999,-999
3148,1.70068,-999,-999
3149,0.618047,-999,-999
3150,0.718022,-999,-999
3151,2.528093,-999,-999
3152,31.563821,32.2978,46.9408
3153,337.837838,-999,-999
3154,0.646438,-999,-999
3155,0.878514,-999,-999
3156,2.097602,-999,-999
3157,233.100233,0.12,-999
3158,2.242431,-999,-999
3159,0.509795,-999,-999
3160,3.522355,-999,-999
3161,0.818987,-999,-999
3162,221.796284,0.0991,0.0451
3163,1.807771,-999,-999
3164,0.767365,-999,-999
3165,595.238095,-999,-999
3166,503.713303,0.1146,0.0614
3167,2.664464,-999,-999
3168,8.384496,-999,-999
3169,79.451623,2.4525,8.8043
3170,0.20365,-999,-999
3171,2.929661,-999,-999
3172,1.023541,-999,-999
3173,462.962963,-999,-999
3174,1.226721,-999,-999
3175,3.129291,-999,-999
3176,4.514517,-999,-999
3177,478.631428,0.1296,0.0453
3178,0.857118,-999,-999
3179,0.840336,-999,-999
3180,0.266907,-999,-999
3181,-999,-999,-999
3182,2.464651,-999,-999
3183,0.433862,-999,-999
3184,0.70269,-999,-999
3185,2.41039,-999,-999
3186,1.732417,-999,-999
3187,0.252918,-999,-999
3188,0.246245,-999,-999
3189,6.335934,-999,-999
3190,0.24626,-999,-999
3191,0.831358,-999,-999
3192,0.985528,-999,-999
3193,1.811037,-999,-999
3194,384.190302,0.1353,0.0448
3195,2.271937,-999,-999
3196,1.846991,-999,-999
3197,0.772798,-999,-999
3198,7.201079,-999,-999
3199,1.440811,-999,-999
3200,202.793894,-999,-999
3201,3.069638,-999,-999
3202,131.233596,0.6352,1.855
3203,9.036305,-999,-999
3204,17.814821,-999,-999
3205,32.755423,0.3353,2.5185
3206,208.211688,-999,-999
3207,214.987408,-999,-999
3208,248.321181,-999,-999
3209,26.553255,-999,-999
3210,148.293273,-999,-999
3211,195.3125,-999,-999
3212,0.592621,-999,-999
3213,268.359227,6.6255,3.5006
3214,0.300752,-999,-999
3215,98.522167,-999,-999
3216,143.472023,-999,-999
3217,333.333333,-999,-999
3218,236.966825,-999,-999
3219,270.27027,-999,-999
3220,0.81484,-999,-999
3221,3.740803,-999,-999
3222,0.571106,-999,-999
3223,1.436429,-999,-999
3224,3.200307,-999,-999
3225,0.922923,-999,-999
3226,3.535451,-999,-999
3227,1.795203,-999,-999
3228,90.749627,0.174,0.2349
3229,77.003746,-999,-999
3230,0.106064,-999,-999
3231,0.117511,-999,-999
3232,198.355483,10.5803,6.3611
3233,62.295888,6.8389,10.1641
3234,0.704722,-999,-999
3235,1.078749,-999,-999
3236,2.630607,-999,-999
3237,285.714286,-999,-999
3238,3.010183,-999,-999
3239,1.684825,-999,-999
3240,0.744401,-999,-999
3241,0.621496,-999,-999
3242,0.970872,-999,-999
3243,0.727985,-999,-999
3244,2.007431,-999,-999
3245,0.655624,-999,-999
3246,2.096436,-999,-999
3247,-999,-999,-999
3248,1.342282,-999,-999
3249,11.806011,815.2454,210.6806
3250,1.066082,-999,-999
3251,414.937759,-999,-999
3252,3.099107,-999,-999
3253,1.305483,-999,-999
3254,1.569964,-999,-999
3255,1.071625,-999,-999
3256,0.562778,-999,-999
3257,0.486043,-999,-999
3258,255.950857,-999,-999
3259,0.995428,-999,-999
3260,1.331558,-999,-999
3261,320.592292,0.4166,0.0591
3262,2.672397,-999,-999
3263,383.197594,0.1725,0.4681
3264,2.386052,-999,-999
3265,0.946213,-999,-999
3266,1.857118,-999,-999
3267,30.471214,2.4458,10.848
3268,3.553671,-999,-999
3269,0.748503,-999,-999
3270,1.06383,-999,-999
3271,1.46511,-999,-999
3272,1.187073,-999,-999
3273,0.528267,-999,-999
3274,0.364169,-999,-999
3275,335.816213,93.0159,18.9125
3276,19.370995,-999,-999
3277,2.257058,-999,-999
3278,279.596582,32.0014,13.9374
3279,275.707833,0.4197,0.0684
3280,0.735973,-999,-999
3281,16.731541,-999,-999
3282,144.769142,12.6892,8.7759
3283,6.145003,-999,-999
3284,0.325733,-999,-999
3285,7.1462,-999,-999
3286,457.31015,0.1457,0.0258
3287,1.169042,-999,-999
3288,0.600781,-999,-999
3289,1.675605,-999,-999
3290,2.169197,-999,-999
3291,2.095412,-999,-999
3292,0.556185,-999,-999
3293,0.082491,-999,-999
3294,1.26225,-999,-999
3295,435.818755,0.2129,0.083
3296,2.132196,-999,-999
3297,2.715573,-999,-999
3298,0.143286,-999,-999
3299,192.591964,125.9353,51.43
3300,0.82891,-999,-999
3301,0.634564,-999,-999
3302,0.93776,12.3395,32.6878
3303,2.9274,-999,-999
3304,1.866267,-999,-999
3305,2.104963,-999,-999
3306,382.762404,1.3971,1.3784
3307,0.514195,-999,-999
3308,1.229446,-999,-999
3309,2.861773,-999,-999
3310,0.942507,-999,-999
3311,290.254608,2.4593,2.3139
3312,0.692208,-999,-999
3313,4.629238,-999,-999
3314,0.443166,-999,-999
3315,207.968163,-999,-999
3316,288.758695,0.323,0.0028
3317,0.265993,-999,-999
3318,0.425987,-999,-999
3319,1.151099,-999,-999
3320,0.696229,-999,-999
3321,4.27987,-999,-999
3322,1.265823,-999,-999
3323,3.759398,-999,-999
3324,1.582028,-999,-999
3325,1.372856,-999,-999
3326,0.608412,-999,-999
3327,1.32118,-999,-999
3328,0.971062,-999,-999
3329,2.018694,-999,-999
3330,8.423872,95.2554,117.5857
3331,346.713379,0.1931,0.6117
3332,3.297066,-999,-999
3333,0.555864,-999,-999
3334,0.846408,-999,-999
3335,0.72282,-999,-999
3336,1.968117,-999,-999
3337,0.988409,-999,-999
3338,0.859107,-999,-999
3339,1.792128,-999,-999
3340,1.058443,-999,-999
3341,0.543187,-999,-999