1.000000000000000000e+00,5.237464990638575780e-04,5.436509336350711782e-04,5.463776915315563193e-04
8.286427728546845728e-01,5.191013919314249256e-04,5.425433296469842287e-04,5.458059648968506886e-04
6.866488450043002345e-01,5.136594086393601660e-04,5.412161229765236753e-04,5.451216910702367082e-04
5.689866029018295635e-01,5.072719877742930261e-04,5.396227273749759157e-04,5.443037622989132249e-04
4.714866363457394516e-01,4.997860785980355255e-04,5.377207759086072162e-04,5.433251710987694770e-04
3.906939937054617062e-01,4.910263008734195873e-04,5.354648303754403187e-04,5.421546734112080764e-04
3.237457542817643863e-01,4.807863696201784050e-04,5.328078683647216509e-04,5.407481250862789749e-04
2.682695795279725903e-01,4.688646484811151492e-04,5.296917669656405142e-04,5.390642447461565156e-04
2.222996482526194417e-01,4.550482130104305267e-04,5.260543539113681768e-04,5.370569369089636625e-04
1.842069969326716183e-01,4.391066379912571347e-04,5.218063560436795494e-04,5.346804444448850259e-04
1.526417967175233426e-01,4.208810325484336860e-04,5.168278343639097537e-04,5.318850676189531418e-04
1.264855216855295950e-01,4.002658150593193707e-04,5.109915308349605428e-04,5.286139303496721273e-04
1.048113134154685655e-01,3.772726145402447036e-04,5.041408943372666053e-04,5.247989496538237172e-04
8.685113737513525112e-02,3.520106350072339015e-04,4.961141795040827952e-04,5.203332980740726877e-04
7.196856730011520764e-02,3.247061175586493024e-04,4.867319982129624965e-04,5.151048635521637570e-04
5.963623316594642010e-02,2.955744415717574572e-04,4.757927278977565561e-04,5.089653933038910862e-04
4.941713361323835096e-02,2.649059343622335388e-04,4.630691597275788003e-04,5.017668660710729919e-04
4.094915062380424797e-02,2.331030784719703437e-04,4.483395917162168957e-04,4.933375635189577845e-04
3.393221771895327254e-02,2.006901331403585518e-04,4.314178191406810867e-04,4.834962349826153771e-04
2.811768697974231443e-02,1.684079784330666117e-04,4.121495774090742220e-04,4.720257079694824580e-04
2.329951810515371730e-02,1.371710899291101978e-04,3.904916526926331482e-04,4.586917135848429653e-04
1.930697728883250600e-02,1.079890582640559459e-04,3.664956422271308445e-04,4.432979632038894181e-04
1.599858719606058258e-02,8.184892714344405604e-05,3.403118071496146033e-04,4.256589241725472830e-04
1.325711365590108957e-02,5.952304383010534967e-05,3.121577108196277404e-04,4.056412613450168501e-04
1.098541141987558097e-02,4.139115232880519299e-05,2.823145639431441710e-04,3.832450817173020273e-04
9.102981779915217050e-03,2.745483776280207127e-05,2.511085239141129890e-04,3.585378456623218796e-04
7.543120063354614470e-03,1.733134795618767061e-05,2.189564260373619330e-04,3.317142678950044002e-04
6.250551925273976385e-03,1.039536554148518965e-05,1.865005935156224251e-04,3.030041644696088859e-04
5.179474679231212825e-03,5.915657785711816451e-06,1.545414821318720608e-04,2.726973601308690497e-04
4.291934260128777746e-03,3.190696348625163775e-06,1.240788670515981761e-04,2.411340265381300366e-04
3.556480306223127903e-03,1.629405517121158131e-06,9.612551645462601873e-05,2.088205351735741811e-04
2.947051702551809708e-03,7.872488823641698839e-07,7.158406492383125562e-05,1.764165162239496136e-04
2.442053094548652346e-03,3.595204770457749996e-07,5.106275258974129268e-05,1.448188818538132070e-04
2.023589647725157481e-03,1.549860272951608869e-07,3.479248078079270206e-05,1.150282640261293936e-04
1.676832936811008170e-03,6.299769129705519259e-08,2.258869075656293573e-05,8.806210078019519527e-05
1.389495494373137619e-03,2.409779952168044925e-08,1.394554324246785493e-05,6.472074699502406814e-05
1.151395399326446845e-03,8.658559186772452341e-09,8.175729778864382455e-06,4.552342135426809734e-05
9.540954763499942450e-04,2.916111847968997328e-09,4.545013100325914754e-06,3.056325886773184162e-05
7.906043210907701645e-04,9.187228132925222358e-10,2.393815969927450751e-06,1.953588279044099336e-05
6.551285568595510310e-04,2.703160489964239339e-10,1.193444875735784831e-06,1.187021038995293130e-05
5.428675439323860487e-04,7.410216739244177811e-11,5.626857595608622699e-07,6.844532165434279686e-06
4.498432668969443333e-04,1.889254966776863656e-11,2.505599319160513651e-07,3.741982676766268111e-06
3.727593720314942207e-04,4.475525389277049899e-12,1.052803009006545699e-07,1.937474685250401626e-06
3.088843596477482069e-04,9.818826298599106182e-13,4.167331148563965193e-08,9.493945893555621208e-07
2.559547922699535499e-04,1.996680341663616615e-13,1.551393718999353557e-08,4.397156188457527716e-07
2.120950887920190200e-04,3.756120066203511729e-14,5.419964304519561107e-09,1.923171401607007244e-07
1.757510624854791441e-04,6.550987316827726887e-15,1.774475151967622963e-09,7.933843064954392363e-08
1.456348477501243945e-04,1.084681091648317670e-15,5.426404430031820897e-10,3.080968242895897181e-08
1.206792640639328982e-04,1.945492510613398594e-16,1.548213547070185741e-10,1.124835731852325459e-08
1.000000000000000048e-04,6.031680303807230647e-17,4.113030939481245505e-11,3.852099604067429715e-09
