{
    "likelihood-type": "bilby.gw.likelihood.GravitationalWaveTransient",
    "waveform_approximant": "IMRPhenomXHM",
    "calibration-model": "CubicSpline",
    "calibration-marginalization": true,
    "number-of-response-curves": 1000
}
