bayespputils.py and nrutils.py: Addressing comments from David and John

27 jobs for spin_evolution_branch in 20 minutes and 45 seconds (queued for 2 seconds)
latest
Status Job ID Name Coverage
  Level0
passed #347951
level0:el7:lal

00:06:19

passed #347950
level0:stretch:lal

00:06:50

 
  Level1
passed #347956
level1:el7:lalframe

00:02:33

passed #347957
level1:el7:lalmetaio

00:03:18

passed #347958
level1:el7:lalsimulation

00:04:56

passed #347959
level1:el7:lalxml

00:03:06

passed #347952
level1:stretch:lalframe

00:03:47

passed #347953
level1:stretch:lalmetaio

00:03:29

passed #347954
level1:stretch:lalsimulation

00:06:22

passed #347955
level1:stretch:lalxml

00:03:19

 
  Level2
failed #352469
level2:el7:lalburst

passed #347965
level2:el7:lalinspiral

00:05:47

passed #347966
level2:el7:lalpulsar

00:04:40

passed #347967
level2:el7:lalstochastic

00:02:00

failed #347974
level2:stretch:lalburst

00:01:36

passed #347961
level2:stretch:lalinspiral

00:06:14

passed #347962
level2:stretch:lalpulsar

00:05:11

passed #347963
level2:stretch:lalstochastic

00:02:12

failed #352468
level2:el7:lalburst

failed #347964
level2:el7:lalburst

00:01:42

failed #347960
level2:stretch:lalburst

00:01:42

 
  Level3
skipped #347970
level3:el7:laldetchar
skipped #347971
level3:el7:lalinference
skipped #347968
level3:stretch:laldetchar
skipped #347969
level3:stretch:lalinference
 
  Level4
skipped #347973
level4:el7:lalapps
skipped #347972
level4:stretch:lalapps
 
Name Stage Failure
failed
level2:el7:lalburst Level2 There has been a missing dependency failure
No job log
failed
level2:stretch:lalburst Level2
make[4]: *** [test-suite.log] Error 1
make[3]: *** [check-TESTS] Error 2
make[2]: *** [check-am] Error 2
Makefile:616: recipe for target 'check-recursive' failed
make[1]: *** [check-recursive] Error 1
make[1]: Leaving directory '/builds/anuradha.gupta/lalsuite/lalburst-1.4.4.1/subdir'
Makefile:904: recipe for target 'check' failed
make: *** [check] Error 2
ERROR: Job failed: exit code 1