 ,Minimum,Maximum
Component Mass 1 $[\text{M}_{\odot}]$,31.54,491.68
Component Mass 2 $[\text{M}_{\odot}]$,1.32,121.01
Total Mass $[\text{M}_{\odot}]$,56.93,496.72
Chirp Mass $[\text{M}_{\odot}]$,8.00,174.56
Mass Ratio ,0.01,0.98
