event,mass_1,mass_1_n_unc,mass_1_p_unc,mass_2,mass_2_n_unc,mass_2_p_unc,mass_remnant,mass_remnant_n_unc,mass_remnant_p_unc
GW150914,35.6,-3,4.8,30.6,-4.4,3,63.1,-3,3.3
GW151012,23.3,-5.5,14,13.6,-4.8,4.1,35.7,-3.8,9.9
GW151226,13.7,-3.2,8.8,7.7,-2.6,2.2,20.5,-1.5,6.4
GW170104,31,-5.6,7.2,20.1,-4.5,4.9,49.1,-3.5,5.2
GW170608,10.9,-1.7,5.3,7.6,-2.1,1.3,17.8,-0.7,3.2
GW170729,50.6,-10.2,16.6,34.3,-10.1,9.1,80.3,-10.2,14.6
GW170809,35.2,-6,8.3,23.8,-5.1,5.2,56.4,-3.7,5.2
GW170814,30.7,-3,5.7,25.3,-4.1,2.9,53.4,-2.4,3.2
GW170818,35.5,-4.7,7.5,26.8,-5.2,4.3,59.8,-3.8,4.8
GW170823,39.6,-6.6,10,29.4,-7.1,6.3,65.6,-6.6,9.4