﻿Event,Catalog,BCR,PyCBC,GstLAL,cWB,IAS
GW170104,GWTC-1,0.99,1,1,1,0.99
GW170121,IAS-1,0.65,,,,0.99
GWC170402,IAS-2,0.33,,0.09,,0.68
GW170403,IAS-1,0.33,,,,0.56
IMBHC170423,IMBH-marginal,0.01,,0,1,
GW170425,IAS-1,0.36,,,,0.77
GW170502,Udall et al,0.4,,,,
GW170729,GWTC-1,0.98,0.52,0.98,0.94,