{
  "1": {
    "chunk_number": 1,
    "start_time": null,
    "end_time": null,
    "root": null,
    "stat_map": null,
    "h1_trigger_merge": null,
    "l1_trigger_merge": null,
    "bank": null,
    "injection_file": null,
    "inj_stat_map": null,
    "injection_search": null,
    "h1_inj_trigger_merge": null,
    "l1_inj_trigger_merge": null,
    "background_type": null,
    "foreground_type": null,
    "injection_type": null
  },
  "2": {
    "chunk_number": 2,
    "start_time": null,
    "end_time": null,
    "root": null,
    "stat_map": null,
    "h1_trigger_merge": null,
    "l1_trigger_merge": null,
    "bank": null,
    "injection_file": null,
    "inj_stat_map": null,
    "injection_search": null,
    "h1_inj_trigger_merge": null,
    "l1_inj_trigger_merge": null,
    "background_type": null,
    "foreground_type": null,
    "injection_type": null
  },
  "3": {
    "chunk_number": 3,
    "start_time": null,
    "end_time": null,
    "root": null,
    "stat_map": null,
    "h1_trigger_merge": null,
    "l1_trigger_merge": null,
    "bank": null,
    "injection_file": null,
    "inj_stat_map": null,
    "injection_search": null,
    "h1_inj_trigger_merge": null,
    "l1_inj_trigger_merge": null,
    "background_type": null,
    "foreground_type": null,
    "injection_type": null
  },
  "4": {
    "chunk_number": 4,
    "start_time": null,
    "end_time": null,
    "root": null,
    "stat_map": null,
    "h1_trigger_merge": null,
    "l1_trigger_merge": null,
    "bank": null,
    "injection_file": null,
    "inj_stat_map": null,
    "injection_search": null,
    "h1_inj_trigger_merge": null,
    "l1_inj_trigger_merge": null,
    "background_type": null,
    "foreground_type": null,
    "injection_type": null
  },
  "5": {
    "chunk_number": 5,
    "start_time": null,
    "end_time": null,
    "root": null,
    "stat_map": null,
    "h1_trigger_merge": null,
    "l1_trigger_merge": null,
    "bank": null,
    "injection_file": null,
    "inj_stat_map": null,
    "injection_search": null,
    "h1_inj_trigger_merge": null,
    "l1_inj_trigger_merge": null,
    "background_type": null,
    "foreground_type": null,
    "injection_type": null
  },
  "6": {
    "chunk_number": 6,
    "start_time": 1241725020.0,
    "end_time": 1242485126.0,
    "root": "/home/tdent/o3/analysis/pycbc/c00/hl/a6_gating_1/output/",
    "stat_map": "full_data/H1L1-STATMAP_FULL_DATA_FULL_VETOES-1241724868-760282.hdf",
    "h1_trigger_merge": "full_data/H1-HDF_TRIGGER_MERGE_FULL_DATA-1241724868-760282.hdf",
    "l1_trigger_merge": "full_data/L1-HDF_TRIGGER_MERGE_FULL_DATA-1241724868-760282.hdf",
    "bank": "bank/H1L1-BANK2HDF-1241724868-760282.hdf",
    "injection_file": {
      "BNS": {
        "STT2": "inj_files/H1L1-OPTIMAL_SNR_BNSSTT2_INJ-1241724868-760282.xml"
      },
      "BBH": {
        "SEOBNRV4": "inj_files/H1L1-OPTIMAL_SNR_BBHSEOBNRV4_INJ-1241724868-760282.xml"
      },
      "NSBH": {
        "SEOBNRV4": "inj_files/H1L1-OPTIMAL_SNR_NSBHSEOBNRV4_INJ-1241724868-760282.xml"
      }
    },
    "inj_stat_map": {
      "BNS": {
        "STT2": "BNSSTT2_INJ_coinc/H1L1-STATMAP_INJ_BNSSTT2_INJ_INJ-1241724868-760282.hdf"
      },
      "BBH": {
        "SEOBNRV4": "BBHSEOBNRV4_INJ_coinc/H1L1-STATMAP_INJ_BBHSEOBNRV4_INJ_INJ-1241724868-760282.hdf"
      },
      "NSBH": {
        "SEOBNRV4": "NSBHSEOBNRV4_INJ_coinc/H1L1-STATMAP_INJ_NSBHSEOBNRV4_INJ_INJ-1241724868-760282.hdf"
      }
    },
    "injection_search": {
      "BNS": {
        "STT2": "BNSSTT2_INJ_coinc/H1L1-HDFINJFIND_BNSSTT2_INJ_INJ_INJ-1241724868-760282.hdf"
      },
      "BBH": {
        "SEOBNRV4": "BBHSEOBNRV4_INJ_coinc/H1L1-HDFINJFIND_BBHSEOBNRV4_INJ_INJ_INJ-1241724868-760282.hdf"
      },
      "NSBH": {
        "SEOBNRV4": "NSBHSEOBNRV4_INJ_coinc/H1L1-HDFINJFIND_NSBHSEOBNRV4_INJ_INJ_INJ-1241724868-760282.hdf"
      }
    },
    "h1_inj_trigger_merge": {
      "BNS": {
        "STT2": "BNSSTT2_INJ_coinc/H1-HDF_TRIGGER_MERGE_BNSSTT2_INJ-1241724868-760282.hdf"
      },
      "BBH": {
        "SEOBNRV4": "BBHSEOBNRV4_INJ_coinc/H1-HDF_TRIGGER_MERGE_BBHSEOBNRV4_INJ-1241724868-760282.hdf"
      },
      "NSBH": {
        "SEOBNRV4": "NSBHSEOBNRV4_INJ_coinc/H1-HDF_TRIGGER_MERGE_NSBHSEOBNRV4_INJ-1241724868-760282.hdf"
      }
    },
    "l1_inj_trigger_merge": {
      "BNS": {
        "STT2": "BNSSTT2_INJ_coinc/L1-HDF_TRIGGER_MERGE_BNSSTT2_INJ-1241724868-760282.hdf"
      },
      "BBH": {
        "SEOBNRV4": "BBHSEOBNRV4_INJ_coinc/L1-HDF_TRIGGER_MERGE_BBHSEOBNRV4_INJ-1241724868-760282.hdf"
      },
      "NSBH": {
        "SEOBNRV4": "NSBHSEOBNRV4_INJ_coinc/L1-HDF_TRIGGER_MERGE_NSBHSEOBNRV4_INJ-1241724868-760282.hdf"
      }
    },
    "background_type": "background_exc",
    "foreground_type": "foreground",
    "injection_type": "found"
  },
  "7": {
    "chunk_number": 7,
    "start_time": null,
    "end_time": null,
    "root": null,
    "stat_map": null,
    "h1_trigger_merge": null,
    "l1_trigger_merge": null,
    "bank": null,
    "injection_file": null,
    "inj_stat_map": null,
    "injection_search": null,
    "h1_inj_trigger_merge": null,
    "l1_inj_trigger_merge": null,
    "background_type": null,
    "foreground_type": null,
    "injection_type": null
  },
  "8": {
    "chunk_number": 8,
    "start_time": null,
    "end_time": null,
    "root": null,
    "stat_map": null,
    "h1_trigger_merge": null,
    "l1_trigger_merge": null,
    "bank": null,
    "injection_file": null,
    "inj_stat_map": null,
    "injection_search": null,
    "h1_inj_trigger_merge": null,
    "l1_inj_trigger_merge": null,
    "background_type": null,
    "foreground_type": null,
    "injection_type": null
  },
  "9": {
    "chunk_number": 9,
    "start_time": null,
    "end_time": null,
    "root": null,
    "stat_map": null,
    "h1_trigger_merge": null,
    "l1_trigger_merge": null,
    "bank": null,
    "injection_file": null,
    "inj_stat_map": null,
    "injection_search": null,
    "h1_inj_trigger_merge": null,
    "l1_inj_trigger_merge": null,
    "background_type": null,
    "foreground_type": null,
    "injection_type": null
  },
  "10": {
    "chunk_number": 10,
    "start_time": null,
    "end_time": null,
    "root": null,
    "stat_map": null,
    "h1_trigger_merge": null,
    "l1_trigger_merge": null,
    "bank": null,
    "injection_file": null,
    "inj_stat_map": null,
    "injection_search": null,
    "h1_inj_trigger_merge": null,
    "l1_inj_trigger_merge": null,
    "background_type": null,
    "foreground_type": null,
    "injection_type": null
  },
  "11": {
    "chunk_number": 11,
    "start_time": null,
    "end_time": null,
    "root": null,
    "stat_map": null,
    "h1_trigger_merge": null,
    "l1_trigger_merge": null,
    "bank": null,
    "injection_file": null,
    "inj_stat_map": null,
    "injection_search": null,
    "h1_inj_trigger_merge": null,
    "l1_inj_trigger_merge": null,
    "background_type": null,
    "foreground_type": null,
    "injection_type": null
  },
  "12": {
    "chunk_number": 12,
    "start_time": null,
    "end_time": null,
    "root": null,
    "stat_map": null,
    "h1_trigger_merge": null,
    "l1_trigger_merge": null,
    "bank": null,
    "injection_file": null,
    "inj_stat_map": null,
    "injection_search": null,
    "h1_inj_trigger_merge": null,
    "l1_inj_trigger_merge": null,
    "background_type": null,
    "foreground_type": null,
    "injection_type": null
  },
  "13": {
    "chunk_number": 13,
    "start_time": null,
    "end_time": null,
    "root": null,
    "stat_map": null,
    "h1_trigger_merge": null,
    "l1_trigger_merge": null,
    "bank": null,
    "injection_file": null,
    "inj_stat_map": null,
    "injection_search": null,
    "h1_inj_trigger_merge": null,
    "l1_inj_trigger_merge": null,
    "background_type": null,
    "foreground_type": null,
    "injection_type": null
  },
  "14": {
    "chunk_number": 14,
    "start_time": null,
    "end_time": null,
    "root": null,
    "stat_map": null,
    "h1_trigger_merge": null,
    "l1_trigger_merge": null,
    "bank": null,
    "injection_file": null,
    "inj_stat_map": null,
    "injection_search": null,
    "h1_inj_trigger_merge": null,
    "l1_inj_trigger_merge": null,
    "background_type": null,
    "foreground_type": null,
    "injection_type": null
  },
  "15": {
    "chunk_number": 15,
    "start_time": null,
    "end_time": null,
    "root": null,
    "stat_map": null,
    "h1_trigger_merge": null,
    "l1_trigger_merge": null,
    "bank": null,
    "injection_file": null,
    "inj_stat_map": null,
    "injection_search": null,
    "h1_inj_trigger_merge": null,
    "l1_inj_trigger_merge": null,
    "background_type": null,
    "foreground_type": null,
    "injection_type": null
  },
  "16": {
    "chunk_number": 16,
    "start_time": null,
    "end_time": null,
    "root": null,
    "stat_map": null,
    "h1_trigger_merge": null,
    "l1_trigger_merge": null,
    "bank": null,
    "injection_file": null,
    "inj_stat_map": null,
    "injection_search": null,
    "h1_inj_trigger_merge": null,
    "l1_inj_trigger_merge": null,
    "background_type": null,
    "foreground_type": null,
    "injection_type": null
  },
  "17": {
    "chunk_number": 17,
    "start_time": null,
    "end_time": null,
    "root": null,
    "stat_map": null,
    "h1_trigger_merge": null,
    "l1_trigger_merge": null,
    "bank": null,
    "injection_file": null,
    "inj_stat_map": null,
    "injection_search": null,
    "h1_inj_trigger_merge": null,
    "l1_inj_trigger_merge": null,
    "background_type": null,
    "foreground_type": null,
    "injection_type": null
  },
  "18": {
    "chunk_number": 18,
    "start_time": null,
    "end_time": null,
    "root": null,
    "stat_map": null,
    "h1_trigger_merge": null,
    "l1_trigger_merge": null,
    "bank": null,
    "injection_file": null,
    "inj_stat_map": null,
    "injection_search": null,
    "h1_inj_trigger_merge": null,
    "l1_inj_trigger_merge": null,
    "background_type": null,
    "foreground_type": null,
    "injection_type": null
  },
  "19": {
    "chunk_number": 19,
    "start_time": null,
    "end_time": null,
    "root": null,
    "stat_map": null,
    "h1_trigger_merge": null,
    "l1_trigger_merge": null,
    "bank": null,
    "injection_file": null,
    "inj_stat_map": null,
    "injection_search": null,
    "h1_inj_trigger_merge": null,
    "l1_inj_trigger_merge": null,
    "background_type": null,
    "foreground_type": null,
    "injection_type": null
  },
  "20": {
    "chunk_number": 20,
    "start_time": null,
    "end_time": null,
    "root": null,
    "stat_map": null,
    "h1_trigger_merge": null,
    "l1_trigger_merge": null,
    "bank": null,
    "injection_file": null,
    "inj_stat_map": null,
    "injection_search": null,
    "h1_inj_trigger_merge": null,
    "l1_inj_trigger_merge": null,
    "background_type": null,
    "foreground_type": null,
    "injection_type": null
  },
  "21": {
    "chunk_number": 21,
    "start_time": null,
    "end_time": null,
    "root": null,
    "stat_map": null,
    "h1_trigger_merge": null,
    "l1_trigger_merge": null,
    "bank": null,
    "injection_file": null,
    "inj_stat_map": null,
    "injection_search": null,
    "h1_inj_trigger_merge": null,
    "l1_inj_trigger_merge": null,
    "background_type": null,
    "foreground_type": null,
    "injection_type": null
  },
  "22": {
    "chunk_number": 22,
    "start_time": null,
    "end_time": null,
    "root": null,
    "stat_map": null,
    "h1_trigger_merge": null,
    "l1_trigger_merge": null,
    "bank": null,
    "injection_file": null,
    "inj_stat_map": null,
    "injection_search": null,
    "h1_inj_trigger_merge": null,
    "l1_inj_trigger_merge": null,
    "background_type": null,
    "foreground_type": null,
    "injection_type": null
  }
}