Event,Catalog,Source,PyCBC Pbbh,GstLAL Pbbh,cWB Pbbh,IAS Pbbh,IMBH Pbbh,BCR Pastro,msource (M),Observing Run,PyCBC Chunk,Trigger Time,Timestamp
GW161202,IMBHc,https://arxiv.org/pdf/1906.08000.pdf,,,,,,,,2,2,1164686041.900,2016-12-02T03:53:44.9
GW170104,GWTC-1,https://arxiv.org/pdf/1811.12907.pdf,1,1,1,0.99,,0.99,[25.78 : 36.73],2,3,1167559936.600,2017-01-04T10_11_58.6
GW170121,IAS-1,https://arxiv.org/pdf/1904.07214.pdf,1,,,0.99,,0.65,[27.59 : 41.24],2,3,1169069154.565,
GW170202,IAS-1,https://arxiv.org/pdf/1904.07214.pdf,,,,0.68,,,[22.66 : 45.02],2,4,1170079035.715,
GW170219,IMBHc,https://arxiv.org/pdf/1906.08000.pdf,,,,,,,,2,6,1171548267.000,2017-02-19T14:04:09.0
GWC170302,IAS-1,https://arxiv.org/pdf/1904.07214.pdf,,,,0.45,,,[ : ],2,8,1172487817.477,
GW170304,IAS-1,https://arxiv.org/pdf/1904.07214.pdf,,,,0.98,,,[36.07 : 57.26],2,8,1172680691.356,
GW170402,IAS-2,https://arxiv.org/pdf/1910.09528.pdf,,0.086,,0.68,,0.33,,2,11,1175205128.565,
GW170403,IAS-1,https://arxiv.org/pdf/1904.07214.pdf,,,,0.56,,0.33,[39.25 : 72.61],2,11,1175295989.221,
GW170405,IMBHc,https://arxiv.org/pdf/1906.08000.pdf,,,,,,,,2,12,1175425510.700,2017-04-05T11:04:52.7
GWC170412,IMBHc,https://arxiv.org/pdf/1906.08000.pdf,,,,,,,,2,12,1176047817.000,2017-04-12T15:56:39.0
GW170423,IMBHc,https://arxiv.org/pdf/1906.08000.pdf,,0,1,,,0.01,,2,14,1176984663.000,2017-04-23T12:10:45.0
GW170425,IAS-1,https://arxiv.org/pdf/1904.07214.pdf,,,,0.77,,0.36,[35.08 : 65.20],2,14,1177134832.178,
GW170502,IMBHc,"https://arxiv.org/pdf/1906.08000.pdf, https://arxiv.org/pdf/1912.10533.pdf",,,,,,,,2,15,1177733342.9,2017-05-02T04:08:44.9
GW170608,GWTC-1,https://arxiv.org/pdf/1811.12907.pdf,,,,,,,[9.35 : 14.04],2,15,1180922494.500,2017-06-08T02_01_16.5
GW170616,IMBHc,https://arxiv.org/pdf/1906.08000.pdf,,,,,,0.4,[94 : 62],2,14,1181677658.800,2017-06-16T19:47:20.8
GW170727,IAS-1,https://arxiv.org/pdf/1904.07214.pdf,,,,0.98,,,[33.82 : 51.79],2,18,1185152688.019,
GW170729,GWTC-1,https://arxiv.org/pdf/1811.12907.pdf,0.52,0.98,0.94,,,0.98,[40.07 : 63.89],2,19,1185389807.300,2017-07-29T18_56_29.3
GW170809,GWTC-1,https://arxiv.org/pdf/1811.12907.pdf,,,,,,,[ : ],2,20,1186302519.8,2017-08-09T08_28_21.8
GW170814,GWTC-1,https://arxiv.org/pdf/1811.12907.pdf,,,,,,,[ : ],2,21,1186741861.5,2017-08-14T10_30_43.5
GW170817A,IAS-2,https://arxiv.org/pdf/1910.09528.pdf,,,,0.86,,,,2,21,1186974184.716,2017-08-17T03_02_46.716