// swiglaldetchar.i_preproc.i: generated by swig/Makefile
%module swiglal_preproc;
%warnfilter(SWIGWARN_PARSE_REDUNDANT) __swiglal__;
%warnfilter(SWIGWARN_PARSE_REDUNDANT) __swiglal_clear__;
#define SWIGLAL(...) const char __swiglal__[] = #__VA_ARGS__
#define SWIGLAL_CLEAR(...) const char __swiglal_clear__[] = #__VA_ARGS__
%import "/home/bedelman/src/lalsuite/lal/include/lal/LALStddef.h"
%include <lal/LALDetChar.h>
%include <lal/LALDetCharConfig.h>
%include <lal/LALDetCharGlib.h>
%include <lal/LALDetCharGlibTypes.h>
%include <lal/LALDetCharHveto.h>
%include <lal/LALDetCharHvetoUtils.h>
%include <lal/LALDetCharRange.h>
%include <lal/LALDetCharVCSInfo.h>
%include <lal/SWIGLALDetCharTest.h>
