// swiglaldetchar.i: generated by ./generate_swig_iface.py
%module laldetchar;
%include <lal/SWIGCommon.i>
#ifndef SWIGIMPORTED
%import <lal/swiglal.i>
%import <lal/swiglalmetaio.i>
%import <lal/swiglalsimulation.i>
%import <lal/swiglalburst.i>
#endif // !SWIGIMPORTED
%header %{
#include <lal/LALDetChar.h>
#include <lal/LALDetCharConfig.h>
#include <lal/LALDetCharGlib.h>
#include <lal/LALDetCharGlibTypes.h>
#include <lal/LALDetCharHveto.h>
#include <lal/LALDetCharHvetoUtils.h>
#include <lal/LALDetCharRange.h>
#include <lal/LALDetCharVCSInfo.h>
#include <lal/SWIGLALDetCharTest.h>
%}
%ignore XLALDestroyGHashTable;
%ignore XLALDestroyGSequence;
%ignore XLALDestroyGSequenceIter;
#ifdef SWIGLAL_MODULE_RENAME_CONSTANTS
#endif // SWIGLAL_MODULE_RENAME_CONSTANTS
#ifdef SWIGLAL_MODULE_RENAME_FUNCTIONS
%rename("AddGSeqSnglBurst") XLALAddGSeqSnglBurst;
%rename("CountUnmarkedSnglBurst") XLALCountUnmarkedSnglBurst;
%rename("CreateGHashTable") XLALCreateGHashTable;
%rename("CreateGSequence") XLALCreateGSequence;
%rename("DetCharHvetoSignificance") XLALDetCharHvetoSignificance;
%rename("DetCharPruneTrigs") XLALDetCharPruneTrigs;
%rename("DetCharRemoveTrigs") XLALDetCharRemoveTrigs;
%rename("DetCharScanTrigs") XLALDetCharScanTrigs;
%rename("DetCharTrigsToVetoList") XLALDetCharTrigsToVetoList;
%rename("DetCharVetoRound") XLALDetCharVetoRound;
%rename("GHashTableKeyExists") XLALGHashTableKeyExists;
%rename("GSequenceBegin") XLALGSequenceBegin;
%rename("GSequenceNext") XLALGSequenceNext;
%rename("GetChannelList") XLALGetChannelList;
%rename("GetGHashTableKey") XLALGetGHashTableKey;
%rename("GetGHashTableType") XLALGetGHashTableType;
%rename("GetGHashTblDbl") XLALGetGHashTblDbl;
%rename("GetGHashTblInt") XLALGetGHashTblInt;
%rename("GetGHashTblStr") XLALGetGHashTblStr;
%rename("GetGSeqSnglBurst") XLALGetGSeqSnglBurst;
%rename("GetGSequenceLength") XLALGetGSequenceLength;
%rename("GetGSequenceType") XLALGetGSequenceType;
%rename("PopulateTrigSequenceFromFile") XLALPopulateTrigSequenceFromFile;
%rename("PopulateTrigSequenceFromTrigList") XLALPopulateTrigSequenceFromTrigList;
%rename("REAL4InspiralRange") XLALREAL4InspiralRange;
%rename("REAL8InspiralRange") XLALREAL8InspiralRange;
%rename("SetGHashTblDbl") XLALSetGHashTblDbl;
%rename("SetGHashTblInt") XLALSetGHashTblInt;
%rename("SetGHashTblStr") XLALSetGHashTblStr;
#endif // SWIGLAL_MODULE_RENAME_FUNCTIONS
#ifdef SWIGLAL_MODULE_RENAME_TDSTRUCTS
%rename("GHashTable") tagLALGHashTable;
%rename("GSequence") tagLALGSequence;
%rename("GSequenceIter") tagLALGSequenceIter;
%rename("swig_laldetchar_test_parent_map_struct") tagswig_laldetchar_test_parent_map_struct;
#endif // SWIGLAL_MODULE_RENAME_TDSTRUCTS
#ifdef SWIGLAL_MODULE_RENAME_VARIABLES
%rename("DetCharVCSIdentInfo") lalDetCharVCSIdentInfo;
%rename("DetCharVCSInfo") lalDetCharVCSInfo;
%rename("DetCharVCSInfoList") lalDetCharVCSInfoList;
#endif // SWIGLAL_MODULE_RENAME_VARIABLES
%newobject XLALAddGSeqSnglBurst;
%newobject XLALCountUnmarkedSnglBurst;
%apply int SWIGLAL_MAYBE_RETURN_INT { int XLALCountUnmarkedSnglBurst };
%newobject XLALCreateGHashTable;
%newobject XLALCreateGSequence;
%newobject XLALDetCharHvetoSignificance;
%newobject XLALDetCharPruneTrigs;
%newobject XLALDetCharRemoveTrigs;
%newobject XLALDetCharScanTrigs;
%newobject XLALDetCharTrigsToVetoList;
%newobject XLALDetCharVetoRound;
%newobject XLALGHashTableKeyExists;
%newobject XLALGSequenceBegin;
%newobject XLALGSequenceNext;
%newobject XLALGetChannelList;
%newobject XLALGetGHashTableKey;
%newobject XLALGetGHashTableType;
%newobject XLALGetGHashTblDbl;
%newobject XLALGetGHashTblInt;
%apply int SWIGLAL_MAYBE_RETURN_INT { int XLALGetGHashTblInt };
%newobject XLALGetGHashTblStr;
%newobject XLALGetGSeqSnglBurst;
%newobject XLALGetGSequenceLength;
%newobject XLALGetGSequenceType;
%newobject XLALPopulateTrigSequenceFromFile;
%header %{#define swiglal_return_1starg_XLALPopulateTrigSequenceFromFile%}
%newobject XLALPopulateTrigSequenceFromTrigList;
%header %{#define swiglal_return_1starg_XLALPopulateTrigSequenceFromTrigList%}
%newobject XLALREAL4InspiralRange;
%newobject XLALREAL8InspiralRange;
%newobject XLALSetGHashTblDbl;
%newobject XLALSetGHashTblInt;
%newobject XLALSetGHashTblStr;
%include <lal/SWIGLALDetCharAlpha.i>
%include <lal/LALDetChar.h>
%include <lal/LALDetCharConfig.h>
%include <lal/LALDetCharGlib.h>
%include <lal/LALDetCharGlibTypes.h>
SWIGLAL_CLEAR(RETURN_OWNED_BY_1ST_ARG(SnglBurst*,XLALGetGSeqSnglBurst));
SWIGLAL_CLEAR(RETURN_OWNED_BY_1ST_ARG(LALGSequenceIter*,XLALGSequenceBegin));
%include <lal/LALDetCharHveto.h>
%include <lal/LALDetCharHvetoUtils.h>
%include <lal/LALDetCharRange.h>
%include <lal/LALDetCharVCSInfo.h>
%include <lal/SWIGLALDetCharTest.h>
%include <lal/SWIGLALDetCharOmega.i>
%swiglal_struct_extend(tagLALGHashTable,1,XLALDestroyGHashTable)
%swiglal_struct_extend(tagLALGSequence,1,XLALDestroyGSequence)
%swiglal_struct_extend(tagLALGSequenceIter,1,XLALDestroyGSequenceIter)
%swiglal_struct_extend(tagswig_laldetchar_test_parent_map_struct,0,)
