#Encoding of BACnet Engineering Units
#Code, UnitText
169,ampere_square_meters
3,amperes
167,amperes_per_meter
168,amperes_per_square_meter
55,bars
222,becquerels
20,btus
50,btus_per_hour
117,btus_per_pound
24,btus_per_pound_dry_air
179,candelas
180,candelas_per_square_meter
118,centimeters
60,centimeters_of_mercury
57,centimeters_of_water
79,cubic_feet
191,cubic_feet_per_hour
84,cubic_feet_per_minute
142,cubic_feet_per_second
80,cubic_meters
135,cubic_meters_per_hour
165,cubic_meters_per_minute
85,cubic_meters_per_second
105,currency1
114,currency10
106,currency2
107,currency3
108,currency4
109,currency5
110,currency6
111,currency7
112,currency8
113,currency9
25,cycles_per_hour
26,cycles_per_minute
70,days
199,decibels
232,decibels_a
200,decibels_millivolt
201,decibels_volt
65,degree_days_Celsius
66,degree_days_Fahrenheit
90,degrees_angular
62,degrees_Celsius
91,degrees_Celsius_per_hour
92,degrees_Celsius_per_minute
64,degrees_Fahrenheit
93,degrees_Fahrenheit_per_hour
94,degrees_Fahrenheit_per_minute
63,degrees_Kelvin
181,degrees_Kelvin_per_hour
182,degrees_Kelvin_per_minute
14,degrees_phase
120,delta_degrees_Fahrenheit
121,delta_degrees_Kelvin
170,farads
33,feet
77,feet_per_minute
76,feet_per_second
38,foot_candles
195,grams
28,grams_of_water_per_kilogram_dry_air
221,grams_per_cubic_centimeter
217,grams_per_cubic_meter
208,grams_per_gram
210,grams_per_kilogram
214,grams_per_liter
213,grams_per_milliliter
155,grams_per_minute
154,grams_per_second
235,grams_per_square_meter
225,gray
133,hectopascals
171,henrys
27,hertz
51,horsepower
71,hours
158,hundredths_seconds
81,imperial_gallons
86,imperial_gallons_per_minute
32,inches
61,inches_of_mercury
58,inches_of_water
183,joule_seconds
16,joules
127,joules_per_degree_Kelvin
128,joules_per_kilogram_degree_Kelvin
23,joules_per_kilogram_dry_air
147,kilo_btus
157,kilo_btus_per_hour
223,kilobecquerels
39,kilograms
186,kilograms_per_cubic_meter
44,kilograms_per_hour
209,kilograms_per_kilogram
43,kilograms_per_minute
42,kilograms_per_second
129,kilohertz
122,kilohms
17,kilojoules
151,kilojoules_per_degree_Kelvin
125,kilojoules_per_kilogram
149,kilojoules_per_kilogram_dry_air
193,kilometers
75,kilometers_per_hour
54,kilopascals
9,kilovolt_amperes
12,kilovolt_amperes_reactive
6,kilovolts
19,kilowatt_hours
138,kilowatt_hours_per_square_foot
137,kilowatt_hours_per_square_meter
204,kilowatt_hours_reactive
48,kilowatts
82,liters
136,liters_per_hour
88,liters_per_minute
87,liters_per_second
36,lumens
37,luxes
148,mega_btus
224,megabecquerels
130,megahertz
126,megajoules
152,megajoules_per_degree_Kelvin
150,megajoules_per_kilogram_dry_air
140,megajoules_per_square_foot
139,megajoules_per_square_meter
10,megavolt_amperes
13,megavolt_amperes_reactive
7,megavolts
146,megawatt_hours
205,megawatt_hours_reactive
49,megawatts
123,megohms
31,meters
164,meters_per_hour
163,meters_per_minute
74,meters_per_second
166,meters_per_second_per_second
219,micrograms_per_cubic_meter
216,micrograms_per_liter
227,microgray
194,micrometers
190,microsiemens
230,microsieverts
231,microsieverts_per_hour
78,miles_per_hour
2,milliamperes
134,millibars
196,milligrams
218,milligrams_per_cubic_meter
211,milligrams_per_gram
212,milligrams_per_kilogram
215,milligrams_per_liter
226,milligray
197,milliliters
198,milliliters_per_second
30,millimeters
59,millimeters_of_mercury
206,millimeters_of_water
162,millimeters_per_minute
161,millimeters_per_second
145,milliohms
159,milliseconds
202,millisiemens
229,millisieverts
124,millivolts
132,milliwatts
72,minutes
236,minutes_per_degree_kelvin
68,months
220,nanograms_per_cubic_meter
233,nephelometric_turbidity_unit
153,newton
160,newton_meters
187,newton_seconds
188,newtons_per_meter
95,no_units
172,ohm_meters
4,ohms
97,parts_per_billion
96,parts_per_million
53,pascals
131,per_hour
207,per_mille
100,per_minute
101,per_second
98,percent
143,percent_obscuration_per_foot
144,percent_obscuration_per_meter
99,percent_per_second
29,percent_relative_humidity
234,pH
56,pounds_force_per_square_inch
40,pounds_mass
46,pounds_mass_per_hour
45,pounds_mass_per_minute
119,pounds_mass_per_second
15,power_factor
102,psi_per_degree_Fahrenheit
103,radians
184,radians_per_second
104,revolutions_per_minute
73,seconds
173,siemens
174,siemens_per_meter
228,sieverts
116,square_centimeters
1,square_feet
115,square_inches
0,square_meters
185,square_meters_per_Newton
175,teslas
21,therms
22,ton_hours
41,tons
156,tons_per_hour
52,tons_refrigeration
83,us_gallons
192,us_gallons_per_hour
89,us_gallons_per_minute
8,volt_amperes
11,volt_amperes_reactive
5,volts
176,volts_per_degree_Kelvin
177,volts_per_meter
18,watt_hours
203,watt_hours_reactive
47,watts
189,watts_per_meter_per_degree_Kelvin
34,watts_per_square_foot
35,watts_per_square_meter
141,watts_per_square_meter_degree_kelvin
178,webers
69,weeks
67,years
