[
	{
		"target": "H0_VAC_EX_BSC5_AIP_SMALL.adl",
		"template": "AIP_SMALL.adl",
		"substitutions": {
			"AIPInst": "AIP525",
			"AIPIonCurrentMilliAmps": "H0:VAC-EX_BSC5_II525_AIP_IC_MA"
		}
	},
	{
		"target": "H0_VAC_EX_BSC5_AIP.adl",
		"template": "AIP.adl",
		"substitutions": {
			"AIPLoc": "BSC5",
			"AIPInst": "AIP525",
			"AIPIonCurrentMilliAmps": "H0:VAC-EX_BSC5_II525_AIP_IC_MA",
			"AIPPressTorr": "H0:VAC-EX_BSC5_VI525_AIP_PRESS_TORR"
		}
	},

	{
		"target": "H0_VAC_EX_BSC9_AIP_SMALL.adl",
		"template": "AIP_SMALL.adl",
		"substitutions": {
			"AIPInst": "AIP511",
			"AIPIonCurrentMilliAmps": "H0:VAC-EX_BSC9_II511_AIP_IC_MA"
		}
	},
	{
		"target": "H0_VAC_EX_BSC9_AIP.adl",
		"template": "AIP.adl",
		"substitutions": {
			"AIPLoc": "BSC9",
			"AIPInst": "AIP511",
			"AIPIonCurrentMilliAmps": "H0:VAC-EX_BSC9_II511_AIP_IC_MA",
			"AIPPressTorr": "H0:VAC-EX_BSC9_VI511_AIP_PRESS_TORR"
		}
	},

	{
		"target": "H0_VAC_EX_GV19_AIP.adl",
		"template": "AIP.adl",
		"substitutions": {
			"AIPLoc": "GV19",
			"AIPInst": "AIP509",
			"AIPIonCurrentMilliAmps": "H0:VAC-EX_GV19_II509_AIP_IC_MA",
			"AIPPressTorr": "H0:VAC-EX_GV19_VI509_AIP_PRESS_TORR"
		}
	},
	{
		"target": "H0_VAC_EX_GV19.adl",
		"template": "ELECTRIC_GATE_VALVE.adl",
		"substitutions": {
			"GVLoc": "GV19",
			"GVAnim": "H0:VAC-EX_GV19_ZSM509A_VALVE_ANIM",
			"GVPosStr": "H0:VAC-EX_GV19_ZSM509_VALVE_POS_STR",
			"GVMtr": "H0:VAC-EX_GV19_XA509M_VALVE_MTR"
		}
	},

	{
		"target": "H0_VAC_EX_GV20_AIP.adl",
		"template": "AIP.adl",
		"substitutions": {
			"AIPLoc": "GV20",
			"AIPInst": "AIP519",
			"AIPIonCurrentMilliAmps": "H0:VAC-EX_GV20_II519_AIP_IC_MA",
			"AIPPressTorr": "H0:VAC-EX_GV20_VI519_AIP_PRESS_TORR"
		}
	},
	{
		"target": "H0_VAC_EX_GV20.adl",
		"template": "ELECTRIC_GATE_VALVE.adl",
		"substitutions": {
			"GVLoc": "GV20",
			"GVAnim": "H0:VAC-EX_GV20_ZSM519A_VALVE_ANIM",
			"GVPosStr": "H0:VAC-EX_GV20_ZSM519_VALVE_POS_STR",
			"GVMtr": "H0:VAC-EX_GV20_XA519M_VALVE_MTR"
		}
	},

	{
		"target": "H0_VAC_EX_X1.adl",
		"template": "GAUGE_PAIR.adl",
		"substitutions": {
			"GPLoc": "X1",
			"GPInst": "523",
			"PiraniPressVolts": "H0:VAC-EX_X1_PT523A_PRESS_VOLTS",
			"PiraniPressTorr": "H0:VAC-EX_X1_PT523A_PRESS_TORR",
			"ColdCathodePiraniIntlk": "H0:VAC-EX_X1_523_PIRANI_INTLK",
			"ColdCathodePwrReq": "H0:VAC-EX_X1_523_PWR_REQ",
			"ColdCathodePressVolts": "H0:VAC-EX_X1_PT523B_PRESS_VOLTS",
			"ColdCathodePressTorr": "H0:VAC-EX_X1_PT523B_PRESS_TORR",
			"ColdCathodePressLogTorr": "H0:VAC-EX_X1_PT523B_PRESS_LOGTORR"
		}
	},
	{
		"target": "H0_VAC_EX_X1_GV.adl",
		"template": "GAUGE_PAIR_GATE_VALVE.adl",
		"substitutions": {
			"GPLoc": "X1",
			"GPInst": "523",
			"PiraniPressVolts": "H0:VAC-EX_X1_PT523A_PRESS_VOLTS",
			"PiraniPressTorr": "H0:VAC-EX_X1_PT523A_PRESS_TORR",
			"ColdCathodePiraniIntlk": "H0:VAC-EX_X1_523_PIRANI_INTLK",
			"ColdCathodePwrReq": "H0:VAC-EX_X1_523_PWR_REQ",
			"ColdCathodePressVolts": "H0:VAC-EX_X1_PT523B_PRESS_VOLTS",
			"ColdCathodePressTorr": "H0:VAC-EX_X1_PT523B_PRESS_TORR",
			"ColdCathodePressLogTorr": "H0:VAC-EX_X1_PT523B_PRESS_LOGTORR"
		}
	},

	{
		"target": "H0_VAC_EX_X2.adl",
		"template": "GAUGE_PAIR.adl",
		"substitutions": {
			"GPLoc": "X2",
			"GPInst": "524",
			"PiraniPressVolts": "H0:VAC-EX_X2_PT524A_PRESS_VOLTS",
			"PiraniPressTorr": "H0:VAC-EX_X2_PT524A_PRESS_TORR",
			"ColdCathodePiraniIntlk": "H0:VAC-EX_X2_524_PIRANI_INTLK",
			"ColdCathodePwrReq": "H0:VAC-EX_X2_524_PWR_REQ",
			"ColdCathodePressVolts": "H0:VAC-EX_X2_PT524B_PRESS_VOLTS",
			"ColdCathodePressTorr": "H0:VAC-EX_X2_PT524B_PRESS_TORR",
			"ColdCathodePressLogTorr": "H0:VAC-EX_X2_PT524B_PRESS_LOGTORR"
		}
	},
	{
		"target": "H0_VAC_EX_X2_GV.adl",
		"template": "GAUGE_PAIR_GATE_VALVE.adl",
		"substitutions": {
			"GPLoc": "X2",
			"GPInst": "524",
			"PiraniPressVolts": "H0:VAC-EX_X2_PT524A_PRESS_VOLTS",
			"PiraniPressTorr": "H0:VAC-EX_X2_PT524A_PRESS_TORR",
			"ColdCathodePiraniIntlk": "H0:VAC-EX_X2_524_PIRANI_INTLK",
			"ColdCathodePwrReq": "H0:VAC-EX_X2_524_PWR_REQ",
			"ColdCathodePressVolts": "H0:VAC-EX_X2_PT524B_PRESS_VOLTS",
			"ColdCathodePressTorr": "H0:VAC-EX_X2_PT524B_PRESS_TORR",
			"ColdCathodePressLogTorr": "H0:VAC-EX_X2_PT524B_PRESS_LOGTORR"
		}
	},

	{
		"target": "H0_VAC_EX_X3.adl",
		"template": "GAUGE_PAIR.adl",
		"substitutions": {
			"GPLoc": "X3",
			"GPInst": "510",
			"PiraniPressVolts": "H0:VAC-EX_X3_PT510A_PRESS_VOLTS",
			"PiraniPressTorr": "H0:VAC-EX_X3_PT510A_PRESS_TORR",
			"ColdCathodePiraniIntlk": "H0:VAC-EX_X3_510_PIRANI_INTLK",
			"ColdCathodePwrReq": "H0:VAC-EX_X3_510_PWR_REQ",
			"ColdCathodePressVolts": "H0:VAC-EX_X3_PT510B_PRESS_VOLTS",
			"ColdCathodePressTorr": "H0:VAC-EX_X3_PT510B_PRESS_TORR",
			"ColdCathodePressLogTorr": "H0:VAC-EX_X3_PT510B_PRESS_LOGTORR"
		}
	},
	{
		"target": "H0_VAC_EX_X3_GV.adl",
		"template": "GAUGE_PAIR_GATE_VALVE.adl",
		"substitutions": {
			"GPLoc": "X3",
			"GPInst": "510",
			"PiraniPressVolts": "H0:VAC-EX_X3_PT510A_PRESS_VOLTS",
			"PiraniPressTorr": "H0:VAC-EX_X3_PT510A_PRESS_TORR",
			"ColdCathodePiraniIntlk": "H0:VAC-EX_X3_510_PIRANI_INTLK",
			"ColdCathodePwrReq": "H0:VAC-EX_X3_510_PWR_REQ",
			"ColdCathodePressVolts": "H0:VAC-EX_X3_PT510B_PRESS_VOLTS",
			"ColdCathodePressTorr": "H0:VAC-EX_X3_PT510B_PRESS_TORR",
			"ColdCathodePressLogTorr": "H0:VAC-EX_X3_PT510B_PRESS_LOGTORR"
		}
	},

	{
		"target": "H0_VAC_EX_X4.adl",
		"template": "BPG402.adl",
		"substitutions": {
			"Loc": "X4",
			"Inst": "525",
			"Mod1Valid": "H0:VAC-EX_X4_PT525_MOD1_VALID",
			"Mod1Overrange": "H0:VAC-EX_X4_PT525_MOD1_OVERRANGE",
			"Mod1Underrange": "H0:VAC-EX_X4_PT525_MOD1_UNDERRANGE",
			"Mod1PressTorr": "H0:VAC-EX_X4_PT525_MOD1_PRESS_TORR",
			"Mod1Sensor": "H0:VAC-EX_X4_PT525_MOD1_SENSOR",
			"Mod1Trip": "H0:VAC-EX_X4_PT525_MOD1_TRIP",
			"Mod2Valid": "H0:VAC-EX_X4_PT525_MOD2_VALID",
			"Mod2Overrange": "H0:VAC-EX_X4_PT525_MOD2_OVERRANGE",
			"Mod2Underrange": "H0:VAC-EX_X4_PT525_MOD2_UNDERRANGE",
			"Mod2PressTorr": "H0:VAC-EX_X4_PT525_MOD2_PRESS_TORR",
			"Mod2Sensor": "H0:VAC-EX_X4_PT525_MOD2_SENSOR",
			"Mod2Trip": "H0:VAC-EX_X4_PT525_MOD2_TRIP",
			"Error": "H0:VAC-EX_X4_PT525_ERROR"
		}
	},

	{
		"target": "H0_VAC_EX_X5.adl",
		"template": "BPG402.adl",
		"substitutions": {
			"Loc": "X5",
			"Inst": "526",
			"Mod1Valid": "H0:VAC-EX_X5_PT526_MOD1_VALID",
			"Mod1Overrange": "H0:VAC-EX_X5_PT526_MOD1_OVERRANGE",
			"Mod1Underrange": "H0:VAC-EX_X5_PT526_MOD1_UNDERRANGE",
			"Mod1PressTorr": "H0:VAC-EX_X5_PT526_MOD1_PRESS_TORR",
			"Mod1Sensor": "H0:VAC-EX_X5_PT526_MOD1_SENSOR",
			"Mod1Trip": "H0:VAC-EX_X5_PT526_MOD1_TRIP",
			"Mod2Valid": "H0:VAC-EX_X5_PT526_MOD2_VALID",
			"Mod2Overrange": "H0:VAC-EX_X5_PT526_MOD2_OVERRANGE",
			"Mod2Underrange": "H0:VAC-EX_X5_PT526_MOD2_UNDERRANGE",
			"Mod2PressTorr": "H0:VAC-EX_X5_PT526_MOD2_PRESS_TORR",
			"Mod2Sensor": "H0:VAC-EX_X5_PT526_MOD2_SENSOR",
			"Mod2Trip": "H0:VAC-EX_X5_PT526_MOD2_TRIP",
			"Error": "H0:VAC-EX_X5_PT526_ERROR"
		}
	},

	{
		"target": "H0_VAC_EX_X6.adl",
		"template": "BPG402.adl",
		"substitutions": {
			"Loc": "X6",
			"Inst": "527",
			"Mod1Valid": "H0:VAC-EX_X6_PT527_MOD1_VALID",
			"Mod1Overrange": "H0:VAC-EX_X6_PT527_MOD1_OVERRANGE",
			"Mod1Underrange": "H0:VAC-EX_X6_PT527_MOD1_UNDERRANGE",
			"Mod1PressTorr": "H0:VAC-EX_X6_PT527_MOD1_PRESS_TORR",
			"Mod1Sensor": "H0:VAC-EX_X6_PT527_MOD1_SENSOR",
			"Mod1Trip": "H0:VAC-EX_X6_PT527_MOD1_TRIP",
			"Mod2Valid": "H0:VAC-EX_X6_PT527_MOD2_VALID",
			"Mod2Overrange": "H0:VAC-EX_X6_PT527_MOD2_OVERRANGE",
			"Mod2Underrange": "H0:VAC-EX_X6_PT527_MOD2_UNDERRANGE",
			"Mod2PressTorr": "H0:VAC-EX_X6_PT527_MOD2_PRESS_TORR",
			"Mod2Sensor": "H0:VAC-EX_X6_PT527_MOD2_SENSOR",
			"Mod2Trip": "H0:VAC-EX_X6_PT527_MOD2_TRIP",
			"Error": "H0:VAC-EX_X6_PT527_ERROR"
		}
	},

	{
		"target": "H0_VAC_EX_IP12.adl",
		"template": "IP_SINGLE_CONTROLLER.adl",
		"substitutions": {
			"IPLoc": "IP12",
			"IPStatus": "H0:VAC-EX_IP12_CS522_STATUS",
			"IPIonCurrentVolts": "H0:VAC-EX_IP12_II522_IC_VOLTS",
			"IPPressTorr": "H0:VAC-EX_IP12_VI522_PRESS_TORR",
			"IPHighVoltageKiloVolts": "H0:VAC-EX_IP12_EI522_HV_KVOLTS"
		}
	},

	{
		"target": "H0_VAC_EX_IP12_SMALL.adl",
		"template": "IP_SINGLE_CONTROLLER_SMALL.adl",
		"substitutions": {
			"IPLoc": "IP12",
			"IPStatus": "H0:VAC-EX_IP12_CS522_STATUS",
			"IPIonCurrentVolts": "H0:VAC-EX_IP12_II522_IC_VOLTS",
			"IPHighVoltageKiloVolts": "H0:VAC-EX_IP12_EI522_HV_KVOLTS"
		}
	},

	{
		"target": "H0_VAC_EX_IP16.adl",
		"template": "IP_SINGLE_CONTROLLER.adl",
		"substitutions": {
			"IPLoc": "IP16",
			"IPStatus": "H0:VAC-EX_IP16_CS523_STATUS",
			"IPIonCurrentVolts": "H0:VAC-EX_IP16_II523_IC_VOLTS",
			"IPPressTorr": "H0:VAC-EX_IP16_VI523_PRESS_TORR",
			"IPHighVoltageKiloVolts": "H0:VAC-EX_IP16_EI523_HV_KVOLTS"
		}
	},

	{
		"target": "H0_VAC_EX_IP16_SMALL.adl",
		"template": "IP_SINGLE_CONTROLLER_SMALL.adl",
		"substitutions": {
			"IPLoc": "IP16",
			"IPStatus": "H0:VAC-EX_IP16_CS523_STATUS",
			"IPIonCurrentVolts": "H0:VAC-EX_IP16_II523_IC_VOLTS",
			"IPHighVoltageKiloVolts": "H0:VAC-EX_IP16_EI523_HV_KVOLTS"
		}
	},

	{
		"target": "H0_VAC_EX_CP8.adl",
		"template": "CP.adl",
		"substitutions": {
			"CPLoc": "CP8",
			"CPDewarLevelPct": "H0:VAC-EX_CP8_LT505_DEWAR_LEVEL_PCT",
			"CPPumpLevelPct": "H0:VAC-EX_CP8_LT500_PUMP_LEVEL_PCT",
			"CPDischargeTempADegC": "H0:VAC-EX_CP8_TE502A_DISCHARGE_TEMP_DEGC",
			"CPDischargeTempBDegC": "H0:VAC-EX_CP8_TE502B_DISCHARGE_TEMP_DEGC",
			"CPDischargeTempComp": "H0:VAC-EX_CP8_DISCHARGE_TEMP_COMP",
			"CPDischargePressPsig": "H0:VAC-EX_CP8_PT501_DISCHARGE_PRESS_PSIG",
			"CPLLCVPIDSetptPct": "H0:VAC-EX_CP8_500_LLCV_PID_SETPT_PCT",
			"CPLLCVManPosPct": "H0:VAC-EX_CP8_500_LLCV_MAN_POS_PCT",
			"CPLLCVCtrl": "H0:VAC-EX_CP8_500_LLCV_CTRL",
			"CPLLCVPosCtrlPct": "H0:VAC-EX_CP8_LIC500_LLCV_POS_CTRL_PCT",
			"CPLLCVDischargeIntlk": "H0:VAC-EX_CP8_500_LLCV_DISCHARGE_INTLK",
			"CPLLCVIntlk": "H0:VAC-EX_CP8_500_LLCV_INTLK",
			"CPLLCVEnableCtrl": "H0:VAC-EX_CP8_XV500_LLCV_ENABLE_CTRL"
		}
	},
	{
		"target": "H0_VAC_EX_CP8_FILL_CONTROL.adl",
		"template": "FILL_CONTROL_TEST.adl",
		"substitutions": {
			"CPLoc": "CP8",
			"CPDewarLevelPct": "H0:VAC-EX_CP8_LT505_DEWAR_LEVEL_PCT",
			"CPLLCVPIDSetptPct": "H0:VAC-EX_CP8_500_LLCV_PID_SETPT_PCT",
			"CPLLCVPIDKp": "H0:VAC-EX_CP8_500_LLCV_PID_KP",
			"CPLLCVPIDKi": "H0:VAC-EX_CP8_500_LLCV_PID_KI",
			"CPLLCVPIDOffset": "H0:VAC-EX_CP8_500_LLCV_PID_OFFSET",
			"CPLLCVPIDITermHigh": "H0:VAC-EX_CP8_500_LLCV_PID_ITERM_MAX_LIM",
			"CPLLCVPIDITermLow": "H0:VAC-EX_CP8_500_LLCV_PID_ITERM_MIN_LIM",
			"CPLLCVPIDOutputHigh": "H0:VAC-EX_CP8_500_LLCV_PID_OUT_MAX_LIM",
			"CPLLCVPIDOutputLow": "H0:VAC-EX_CP8_500_LLCV_PID_OUT_MIN_LIM",
			"CPLLCVPIDDeadBand": "H0:VAC-EX_CP8_500_LLCV_PID_OUT_DEAD_BAND",		
			"CPLLCVPIDCycleTime": "H0:VAC-EX_CP8_500_LLCV_PID_CYCLE_TIME",
			"CPLLCVManPosPct": "H0:VAC-EX_CP8_500_LLCV_MAN_POS_PCT",
			"CPLLCVCtrl": "H0:VAC-EX_CP8_500_LLCV_CTRL",	
			"PiraniPressTorr": "H0:VAC-EX_X2_PT524A_PRESS_TORR",
			"CPLLCVPiraniIntlk": "H0:VAC-EX_CP8_500_LLCV_PIRANI_INTLK",
			"CPDischargePressPsig": "H0:VAC-EX_CP8_PT501_DISCHARGE_PRESS_PSIG",
			"CPLLCVDischargeIntlk": "H0:VAC-EX_CP8_500_LLCV_DISCHARGE_INTLK",
			"CPLLCVPosCtrlPct": "H0:VAC-EX_CP8_LIC500_LLCV_POS_CTRL_PCT",
			"CPLLCVEnableCtrl": "H0:VAC-EX_CP8_XV500_LLCV_ENABLE_CTRL",
			"CPPumpLevelPct": "H0:VAC-EX_CP8_LT500_PUMP_LEVEL_PCT",
			"CPPumpLevelPctSmoo": "H0:VAC-EX_CP8_LT500_PUMP_LEVEL_MA_SMOO"
		}
	},

	{
		"target": "H0_VAC_EX_CP8_REGEN_HEATER.adl",
		"template": "REGEN_HEATER.adl",
		"substitutions": {
			"CPLoc": "CP8",
			"CPRegenPIDSetptReqDegC": "H0:VAC-EX_CP8_503_REGEN_PID_SETPT_REQ_DEGC",
			"CPRegenTempIntlk": "H0:VAC-EX_CP8_503_REGEN_TEMP_INTLK",
			"CPRegenTempAlrmIntlk": "H0:VAC-EX_CP8_503_REGEN_TEMP_ALRM_INTLK",
			"CPRegenGVACloseIntlk": "H0:VAC-EX_CP8_503_REGEN_GV_A_CLOSE_INTLK",
			"CPRegenGVBCloseIntlk": "H0:VAC-EX_CP8_503_REGEN_GV_B_CLOSE_INTLK",
			"CPRegenLLCVPosIntlk": "H0:VAC-EX_CP8_503_REGEN_LLCV_POS_INTLK",
			"CPRegenRunReq": "H0:VAC-EX_CP8_503_REGEN_RUN_REQ",
			"CPRegenPIDSetptDegC": "H0:VAC-EX_CP8_503_REGEN_PID_SETPT_DEGC",
			"CPRegenPIDKp": "H0:VAC-EX_CP8_503_REGEN_PID_KP",
			"CPRegenPIDTn": "H0:VAC-EX_CP8_503_REGEN_PID_TN",
			"CPRegenPIDTv": "H0:VAC-EX_CP8_503_REGEN_PID_TV",
			"CPRegenPIDTd": "H0:VAC-EX_CP8_503_REGEN_PID_TD",
			"CPRegenPIDCycleTime": "H0:VAC-EX_CP8_503_REGEN_PID_CYCLE_TIME",
			"CPRegenPIDErrFlag": "H0:VAC-EX_CP8_503_REGEN_PID_ERR_FLAG",
			"CPRegenPIDErrStr": "H0:VAC-EX_CP8_503_REGEN_PID_ERR_STR",
			"CPRegenHtrCtrlDegC": "H0:VAC-EX_CP8_TY503_REGEN_HTR_CTRL_DEGC",
			"CPRegenTempDegC": "H0:VAC-EX_CP8_TE503A_REGEN_TEMP_DEGC"
		}
	}
]

