t strain*1e23
-0.45756 5.7
-0.45732 5.3
-0.45707 4.9
-0.45683 4.4
-0.45658 4.0
-0.45634 3.6
-0.4561 3.1
-0.45585 2.7
-0.45561 2.2
-0.45536 1.8
-0.45512 1.3
-0.45488 0.9
-0.45463 0.4
-0.45439 0.0
-0.45414 -0.5
-0.4539 -1.0
-0.45366 -1.4
-0.45341 -1.9
-0.45317 -2.3
-0.45292 -2.8
-0.45268 -3.2
-0.45243 -3.7
-0.45219 -4.1
-0.45195 -4.5
-0.4517 -5.0
-0.45146 -5.4
-0.45121 -5.8
-0.45097 -6.2
-0.45073 -6.6
-0.45048 -7.0
-0.45024 -7.4
-0.44999 -7.8
-0.44975 -8.1
-0.4495 -8.5
-0.44926 -8.8
-0.44902 -9.2
-0.44877 -9.5
-0.44853 -9.8
-0.44828 -10.1
-0.44804 -10.4
-0.4478 -10.7
-0.44755 -10.9
-0.44731 -11.2
-0.44706 -11.4
-0.44682 -11.6
-0.44658 -11.9
-0.44633 -12.0
-0.44609 -12.2
-0.44584 -12.4
-0.4456 -12.5
-0.44535 -12.7
-0.44511 -12.8
-0.44487 -12.9
-0.44462 -12.9
-0.44438 -13.0
-0.44413 -13.1
-0.44389 -13.1
-0.44365 -13.1
-0.4434 -13.1
-0.44316 -13.1
-0.44291 -13.1
-0.44267 -13.0
-0.44242 -12.9
-0.44218 -12.9
-0.44194 -12.8
-0.44169 -12.7
-0.44145 -12.5
-0.4412 -12.4
-0.44096 -12.2
-0.44072 -12.0
-0.44047 -11.8
-0.44023 -11.6
-0.43998 -11.4
-0.43974 -11.2
-0.4395 -10.9
-0.43925 -10.7
-0.43901 -10.4
-0.43876 -10.1
-0.43852 -9.8
-0.43827 -9.5
-0.43803 -9.1
-0.43779 -8.8
-0.43754 -8.4
-0.4373 -8.1
-0.43705 -7.7
-0.43681 -7.3
-0.43657 -6.9
-0.43632 -6.5
-0.43608 -6.1
-0.43583 -5.7
-0.43559 -5.3
-0.43534 -4.8
-0.4351 -4.4
-0.43486 -3.9
-0.43461 -3.5
-0.43437 -3.0
-0.43412 -2.6
-0.43388 -2.1
-0.43364 -1.6
-0.43339 -1.2
-0.43315 -0.7
-0.4329 -0.2
-0.43266 0.2
-0.43242 0.7
-0.43217 1.2
-0.43193 1.6
-0.43168 2.1
-0.43144 2.6
-0.43119 3.0
-0.43095 3.5
-0.43071 4.0
-0.43046 4.4
-0.43022 4.8
-0.42997 5.3
-0.42973 5.7
-0.42949 6.1
-0.42924 6.6
-0.429 7.0
-0.42875 7.4
-0.42851 7.8
-0.42826 8.1
-0.42802 8.5
-0.42778 8.9
-0.42753 9.2
-0.42729 9.5
-0.42704 9.9
-0.4268 10.2
-0.42656 10.5
-0.42631 10.8
-0.42607 11.0
-0.42582 11.3
-0.42558 11.5
-0.42533 11.8
-0.42509 12.0
-0.42485 12.2
-0.4246 12.4
-0.42436 12.5
-0.42411 12.7
-0.42387 12.8
-0.42363 12.9
-0.42338 13.0
-0.42314 13.1
-0.42289 13.2
-0.42265 13.2
-0.42241 13.2
-0.42216 13.3
-0.42192 13.3
-0.42167 13.2
-0.42143 13.2
-0.42118 13.1
-0.42094 13.1
-0.4207 13.0
-0.42045 12.9
-0.42021 12.8
-0.41996 12.6
-0.41972 12.5
-0.41948 12.3
-0.41923 12.1
-0.41899 11.9
-0.41874 11.7
-0.4185 11.4
-0.41825 11.2
-0.41801 10.9
-0.41777 10.7
-0.41752 10.4
-0.41728 10.1
-0.41703 9.7
-0.41679 9.4
-0.41655 9.1
-0.4163 8.7
-0.41606 8.3
-0.41581 7.9
-0.41557 7.6
-0.41533 7.2
-0.41508 6.7
-0.41484 6.3
-0.41459 5.9
-0.41435 5.5
-0.4141 5.0
-0.41386 4.6
-0.41362 4.1
-0.41337 3.6
-0.41313 3.2
-0.41288 2.7
-0.41264 2.2
-0.4124 1.7
-0.41215 1.3
-0.41191 0.8
-0.41166 0.3
-0.41142 -0.2
-0.41117 -0.7
-0.41093 -1.2
-0.41069 -1.6
-0.41044 -2.1
-0.4102 -2.6
-0.40995 -3.1
-0.40971 -3.5
-0.40947 -4.0
-0.40922 -4.5
-0.40898 -4.9
-0.40873 -5.4
-0.40849 -5.8
-0.40825 -6.3
-0.408 -6.7
-0.40776 -7.1
-0.40751 -7.5
-0.40727 -7.9
-0.40702 -8.3
-0.40678 -8.7
-0.40654 -9.0
-0.40629 -9.4
-0.40605 -9.7
-0.4058 -10.1
-0.40556 -10.4
-0.40532 -10.7
-0.40507 -11.0
-0.40483 -11.3
-0.40458 -11.5
-0.40434 -11.8
-0.40409 -12.0
-0.40385 -12.2
-0.40361 -12.4
-0.40336 -12.6
-0.40312 -12.7
-0.40287 -12.9
-0.40263 -13.0
-0.40239 -13.1
-0.40214 -13.2
-0.4019 -13.3
-0.40165 -13.3
-0.40141 -13.4
-0.40117 -13.4
-0.40092 -13.4
-0.40068 -13.4
-0.40043 -13.4
-0.40019 -13.3
-0.39994 -13.2
-0.3997 -13.2
-0.39946 -13.1
-0.39921 -12.9
-0.39897 -12.8
-0.39872 -12.6
-0.39848 -12.5
-0.39824 -12.3
-0.39799 -12.1
-0.39775 -11.8
-0.3975 -11.6
-0.39726 -11.3
-0.39701 -11.1
-0.39677 -10.8
-0.39653 -10.5
-0.39628 -10.2
-0.39604 -9.8
-0.39579 -9.5
-0.39555 -9.1
-0.39531 -8.8
-0.39506 -8.4
-0.39482 -8.0
-0.39457 -7.6
-0.39433 -7.2
-0.39408 -6.8
-0.39384 -6.3
-0.3936 -5.9
-0.39335 -5.4
-0.39311 -5.0
-0.39286 -4.5
-0.39262 -4.0
-0.39238 -3.6
-0.39213 -3.1
-0.39189 -2.6
-0.39164 -2.1
-0.3914 -1.6
-0.39116 -1.1
-0.39091 -0.6
-0.39067 -0.1
-0.39042 0.4
-0.39018 0.9
-0.38993 1.4
-0.38969 1.9
-0.38945 2.4
-0.3892 2.9
-0.38896 3.4
-0.38871 3.8
-0.38847 4.3
-0.38823 4.8
-0.38798 5.3
-0.38774 5.7
-0.38749 6.2
-0.38725 6.6
-0.387 7.0
-0.38676 7.5
-0.38652 7.9
-0.38627 8.3
-0.38603 8.7
-0.38578 9.1
-0.38554 9.4
-0.3853 9.8
-0.38505 10.1
-0.38481 10.5
-0.38456 10.8
-0.38432 11.1
-0.38408 11.4
-0.38383 11.6
-0.38359 11.9
-0.38334 12.1
-0.3831 12.3
-0.38285 12.5
-0.38261 12.7
-0.38237 12.9
-0.38212 13.0
-0.38188 13.2
-0.38163 13.3
-0.38139 13.4
-0.38115 13.5
-0.3809 13.5
-0.38066 13.5
-0.38041 13.6
-0.38017 13.6
-0.37992 13.6
-0.37968 13.5
-0.37944 13.5
-0.37919 13.4
-0.37895 13.3
-0.3787 13.2
-0.37846 13.1
-0.37822 12.9
-0.37797 12.7
-0.37773 12.6
-0.37748 12.3
-0.37724 12.1
-0.377 11.9
-0.37675 11.6
-0.37651 11.4
-0.37626 11.1
-0.37602 10.8
-0.37577 10.5
-0.37553 10.1
-0.37529 9.8
-0.37504 9.4
-0.3748 9.0
-0.37455 8.7
-0.37431 8.3
-0.37407 7.9
-0.37382 7.4
-0.37358 7.0
-0.37333 6.6
-0.37309 6.1
-0.37284 5.6
-0.3726 5.2
-0.37236 4.7
-0.37211 4.2
-0.37187 3.7
-0.37162 3.2
-0.37138 2.7
-0.37114 2.2
-0.37089 1.7
-0.37065 1.2
-0.3704 0.7
-0.37016 0.2
-0.36992 -0.3
-0.36967 -0.9
-0.36943 -1.4
-0.36918 -1.9
-0.36894 -2.4
-0.36869 -2.9
-0.36845 -3.4
-0.36821 -3.9
-0.36796 -4.4
-0.36772 -4.9
-0.36747 -5.4
-0.36723 -5.8
-0.36699 -6.3
-0.36674 -6.8
-0.3665 -7.2
-0.36625 -7.6
-0.36601 -8.1
-0.36576 -8.5
-0.36552 -8.9
-0.36528 -9.3
-0.36503 -9.6
-0.36479 -10.0
-0.36454 -10.4
-0.3643 -10.7
-0.36406 -11.0
-0.36381 -11.3
-0.36357 -11.6
-0.36332 -11.9
-0.36308 -12.1
-0.36283 -12.4
-0.36259 -12.6
-0.36235 -12.8
-0.3621 -13.0
-0.36186 -13.1
-0.36161 -13.3
-0.36137 -13.4
-0.36113 -13.5
-0.36088 -13.6
-0.36064 -13.7
-0.36039 -13.7
-0.36015 -13.7
-0.35991 -13.7
-0.35966 -13.7
-0.35942 -13.7
-0.35917 -13.6
-0.35893 -13.6
-0.35868 -13.5
-0.35844 -13.4
-0.3582 -13.2
-0.35795 -13.1
-0.35771 -12.9
-0.35746 -12.7
-0.35722 -12.5
-0.35698 -12.3
-0.35673 -12.1
-0.35649 -11.8
-0.35624 -11.5
-0.356 -11.2
-0.35575 -10.9
-0.35551 -10.6
-0.35527 -10.2
-0.35502 -9.9
-0.35478 -9.5
-0.35453 -9.1
-0.35429 -8.7
-0.35405 -8.3
-0.3538 -7.9
-0.35356 -7.4
-0.35331 -7.0
-0.35307 -6.5
-0.35283 -6.1
-0.35258 -5.6
-0.35234 -5.1
-0.35209 -4.6
-0.35185 -4.1
-0.3516 -3.6
-0.35136 -3.1
-0.35112 -2.6
-0.35087 -2.0
-0.35063 -1.5
-0.35038 -1.0
-0.35014 -0.5
-0.3499 0.0
-0.34965 0.6
-0.34941 1.1
-0.34916 1.7
-0.34892 2.2
-0.34867 2.7
-0.34843 3.2
-0.34819 3.8
-0.34794 4.3
-0.3477 4.8
-0.34745 5.3
-0.34721 5.8
-0.34697 6.2
-0.34672 6.7
-0.34648 7.2
-0.34623 7.6
-0.34599 8.1
-0.34575 8.5
-0.3455 8.9
-0.34526 9.3
-0.34501 9.7
-0.34477 10.1
-0.34452 10.5
-0.34428 10.8
-0.34404 11.1
-0.34379 11.4
-0.34355 11.7
-0.3433 12.0
-0.34306 12.3
-0.34282 12.5
-0.34257 12.8
-0.34233 13.0
-0.34208 13.1
-0.34184 13.3
-0.34159 13.5
-0.34135 13.6
-0.34111 13.7
-0.34086 13.8
-0.34062 13.8
-0.34037 13.9
-0.34013 13.9
-0.33989 13.9
-0.33964 13.9
-0.3394 13.9
-0.33915 13.8
-0.33891 13.7
-0.33867 13.6
-0.33842 13.5
-0.33818 13.4
-0.33793 13.2
-0.33769 13.0
-0.33744 12.8
-0.3372 12.6
-0.33696 12.3
-0.33671 12.1
-0.33647 11.8
-0.33622 11.5
-0.33598 11.2
-0.33574 10.9
-0.33549 10.5
-0.33525 10.1
-0.335 9.8
-0.33476 9.4
-0.33451 9.0
-0.33427 8.5
-0.33403 8.1
-0.33378 7.7
-0.33354 7.2
-0.33329 6.7
-0.33305 6.2
-0.33281 5.7
-0.33256 5.2
-0.33232 4.7
-0.33207 4.2
-0.33183 3.7
-0.33158 3.2
-0.33134 2.6
-0.3311 2.1
-0.33085 1.5
-0.33061 1.0
-0.33036 0.4
-0.33012 -0.1
-0.32988 -0.7
-0.32963 -1.2
-0.32939 -1.8
-0.32914 -2.3
-0.3289 -2.8
-0.32866 -3.4
-0.32841 -3.9
-0.32817 -4.4
-0.32792 -5.0
-0.32768 -5.5
-0.32743 -6.0
-0.32719 -6.5
-0.32695 -7.0
-0.3267 -7.4
-0.32646 -7.9
-0.32621 -8.3
-0.32597 -8.8
-0.32573 -9.2
-0.32548 -9.6
-0.32524 -10.0
-0.32499 -10.4
-0.32475 -10.8
-0.3245 -11.1
-0.32426 -11.5
-0.32402 -11.8
-0.32377 -12.1
-0.32353 -12.3
-0.32328 -12.6
-0.32304 -12.8
-0.3228 -13.1
-0.32255 -13.3
-0.32231 -13.4
-0.32206 -13.6
-0.32182 -13.7
-0.32158 -13.9
-0.32133 -13.9
-0.32109 -14.0
-0.32084 -14.1
-0.3206 -14.1
-0.32035 -14.1
-0.32011 -14.1
-0.31987 -14.1
-0.31962 -14.0
-0.31938 -13.9
-0.31913 -13.8
-0.31889 -13.7
-0.31865 -13.5
-0.3184 -13.4
-0.31816 -13.2
-0.31791 -13.0
-0.31767 -12.7
-0.31742 -12.5
-0.31718 -12.2
-0.31694 -11.9
-0.31669 -11.6
-0.31645 -11.3
-0.3162 -10.9
-0.31596 -10.6
-0.31572 -10.2
-0.31547 -9.8
-0.31523 -9.4
-0.31498 -8.9
-0.31474 -8.5
-0.3145 -8.0
-0.31425 -7.6
-0.31401 -7.1
-0.31376 -6.6
-0.31352 -6.1
-0.31327 -5.6
-0.31303 -5.1
-0.31279 -4.5
-0.31254 -4.0
-0.3123 -3.4
-0.31205 -2.9
-0.31181 -2.3
-0.31157 -1.8
-0.31132 -1.2
-0.31108 -0.6
-0.31083 0.0
-0.31059 0.5
-0.31034 1.1
-0.3101 1.6
-0.30986 2.2
-0.30961 2.8
-0.30937 3.3
-0.30912 3.9
-0.30888 4.4
-0.30864 5.0
-0.30839 5.5
-0.30815 6.0
-0.3079 6.5
-0.30766 7.0
-0.30742 7.5
-0.30717 8.0
-0.30693 8.5
-0.30668 8.9
-0.30644 9.4
-0.30619 9.8
-0.30595 10.2
-0.30571 10.6
-0.30546 11.0
-0.30522 11.3
-0.30497 11.7
-0.30473 12.0
-0.30449 12.3
-0.30424 12.6
-0.304 12.8
-0.30375 13.1
-0.30351 13.3
-0.30326 13.5
-0.30302 13.7
-0.30278 13.8
-0.30253 14.0
-0.30229 14.1
-0.30204 14.2
-0.3018 14.2
-0.30156 14.3
-0.30131 14.3
-0.30107 14.3
-0.30082 14.3
-0.30058 14.2
-0.30033 14.1
-0.30009 14.0
-0.29985 13.9
-0.2996 13.8
-0.29936 13.6
-0.29911 13.4
-0.29887 13.2
-0.29863 13.0
-0.29838 12.7
-0.29814 12.4
-0.29789 12.1
-0.29765 11.8
-0.29741 11.5
-0.29716 11.1
-0.29692 10.8
-0.29667 10.4
-0.29643 10.0
-0.29618 9.5
-0.29594 9.1
-0.2957 8.6
-0.29545 8.1
-0.29521 7.7
-0.29496 7.2
-0.29472 6.6
-0.29448 6.1
-0.29423 5.6
-0.29399 5.0
-0.29374 4.5
-0.2935 3.9
-0.29325 3.4
-0.29301 2.8
-0.29277 2.2
-0.29252 1.6
-0.29228 1.0
-0.29203 0.5
-0.29179 -0.1
-0.29155 -0.7
-0.2913 -1.3
-0.29106 -1.9
-0.29081 -2.5
-0.29057 -3.1
-0.29033 -3.6
-0.29008 -4.2
-0.28984 -4.8
-0.28959 -5.3
-0.28935 -5.9
-0.2891 -6.4
-0.28886 -6.9
-0.28862 -7.4
-0.28837 -7.9
-0.28813 -8.4
-0.28788 -8.9
-0.28764 -9.4
-0.2874 -9.8
-0.28715 -10.2
-0.28691 -10.7
-0.28666 -11.1
-0.28642 -11.4
-0.28617 -11.8
-0.28593 -12.1
-0.28569 -12.4
-0.28544 -12.7
-0.2852 -13.0
-0.28495 -13.3
-0.28471 -13.5
-0.28447 -13.7
-0.28422 -13.9
-0.28398 -14.0
-0.28373 -14.2
-0.28349 -14.3
-0.28325 -14.4
-0.283 -14.5
-0.28276 -14.5
-0.28251 -14.5
-0.28227 -14.5
-0.28202 -14.5
-0.28178 -14.4
-0.28154 -14.3
-0.28129 -14.2
-0.28105 -14.1
-0.2808 -13.9
-0.28056 -13.7
-0.28032 -13.5
-0.28007 -13.3
-0.27983 -13.1
-0.27958 -12.8
-0.27934 -12.5
-0.27909 -12.2
-0.27885 -11.8
-0.27861 -11.5
-0.27836 -11.1
-0.27812 -10.7
-0.27787 -10.3
-0.27763 -9.8
-0.27739 -9.4
-0.27714 -8.9
-0.2769 -8.4
-0.27665 -7.9
-0.27641 -7.4
-0.27617 -6.9
-0.27592 -6.3
-0.27568 -5.8
-0.27543 -5.2
-0.27519 -4.7
-0.27494 -4.1
-0.2747 -3.5
-0.27446 -2.9
-0.27421 -2.3
-0.27397 -1.7
-0.27372 -1.1
-0.27348 -0.5
-0.27324 0.1
-0.27299 0.7
-0.27275 1.3
-0.2725 2.0
-0.27226 2.6
-0.27201 3.2
-0.27177 3.8
-0.27153 4.3
-0.27128 4.9
-0.27104 5.5
-0.27079 6.1
-0.27055 6.6
-0.27031 7.2
-0.27006 7.7
-0.26982 8.2
-0.26957 8.7
-0.26933 9.2
-0.26908 9.7
-0.26884 10.1
-0.2686 10.6
-0.26835 11.0
-0.26811 11.4
-0.26786 11.8
-0.26762 12.1
-0.26738 12.5
-0.26713 12.8
-0.26689 13.1
-0.26664 13.4
-0.2664 13.6
-0.26616 13.8
-0.26591 14.0
-0.26567 14.2
-0.26542 14.4
-0.26518 14.5
-0.26493 14.6
-0.26469 14.7
-0.26445 14.7
-0.2642 14.7
-0.26396 14.7
-0.26371 14.7
-0.26347 14.6
-0.26323 14.5
-0.26298 14.4
-0.26274 14.3
-0.26249 14.1
-0.26225 13.9
-0.262 13.7
-0.26176 13.5
-0.26152 13.2
-0.26127 12.9
-0.26103 12.6
-0.26078 12.3
-0.26054 11.9
-0.2603 11.6
-0.26005 11.2
-0.25981 10.7
-0.25956 10.3
-0.25932 9.9
-0.25908 9.4
-0.25883 8.9
-0.25859 8.4
-0.25834 7.8
-0.2581 7.3
-0.25785 6.8
-0.25761 6.2
-0.25737 5.6
-0.25712 5.0
-0.25688 4.4
-0.25663 3.8
-0.25639 3.2
-0.25615 2.6
-0.2559 2.0
-0.25566 1.3
-0.25541 0.7
-0.25517 0.0
-0.25492 -0.6
-0.25468 -1.2
-0.25444 -1.8
-0.25419 -2.5
-0.25395 -3.1
-0.2537 -3.7
-0.25346 -4.3
-0.25322 -4.9
-0.25297 -5.5
-0.25273 -6.1
-0.25248 -6.7
-0.25224 -7.3
-0.252 -7.8
-0.25175 -8.4
-0.25151 -8.9
-0.25126 -9.4
-0.25102 -9.9
-0.25077 -10.4
-0.25053 -10.8
-0.25029 -11.2
-0.25004 -11.7
-0.2498 -12.0
-0.24955 -12.4
-0.24931 -12.8
-0.24907 -13.1
-0.24882 -13.4
-0.24858 -13.7
-0.24833 -13.9
-0.24809 -14.1
-0.24784 -14.3
-0.2476 -14.5
-0.24736 -14.6
-0.24711 -14.8
-0.24687 -14.9
-0.24662 -14.9
-0.24638 -15.0
-0.24614 -15.0
-0.24589 -14.9
-0.24565 -14.9
-0.2454 -14.8
-0.24516 -14.7
-0.24492 -14.6
-0.24467 -14.4
-0.24443 -14.2
-0.24418 -14.0
-0.24394 -13.8
-0.24369 -13.5
-0.24345 -13.2
-0.24321 -12.9
-0.24296 -12.5
-0.24272 -12.2
-0.24247 -11.8
-0.24223 -11.4
-0.24199 -10.9
-0.24174 -10.5
-0.2415 -10.0
-0.24125 -9.5
-0.24101 -9.0
-0.24076 -8.5
-0.24052 -7.9
-0.24028 -7.3
-0.24003 -6.8
-0.23979 -6.2
-0.23954 -5.6
-0.2393 -5.0
-0.23906 -4.3
-0.23881 -3.7
-0.23857 -3.0
-0.23832 -2.4
-0.23808 -1.7
-0.23783 -1.1
-0.23759 -0.4
-0.23735 0.2
-0.2371 0.9
-0.23686 1.6
-0.23661 2.2
-0.23637 2.9
-0.23613 3.5
-0.23588 4.2
-0.23564 4.8
-0.23539 5.4
-0.23515 6.0
-0.23491 6.6
-0.23466 7.2
-0.23442 7.8
-0.23417 8.4
-0.23393 8.9
-0.23368 9.5
-0.23344 10.0
-0.2332 10.5
-0.23295 10.9
-0.23271 11.4
-0.23246 11.8
-0.23222 12.2
-0.23198 12.6
-0.23173 13.0
-0.23149 13.3
-0.23124 13.6
-0.231 13.9
-0.23075 14.2
-0.23051 14.4
-0.23027 14.6
-0.23002 14.8
-0.22978 14.9
-0.22953 15.0
-0.22929 15.1
-0.22905 15.2
-0.2288 15.2
-0.22856 15.2
-0.22831 15.2
-0.22807 15.1
-0.22783 15.0
-0.22758 14.9
-0.22734 14.7
-0.22709 14.6
-0.22685 14.3
-0.2266 14.1
-0.22636 13.8
-0.22612 13.5
-0.22587 13.2
-0.22563 12.9
-0.22538 12.5
-0.22514 12.1
-0.2249 11.7
-0.22465 11.2
-0.22441 10.7
-0.22416 10.3
-0.22392 9.7
-0.22367 9.2
-0.22343 8.7
-0.22319 8.1
-0.22294 7.5
-0.2227 6.9
-0.22245 6.3
-0.22221 5.6
-0.22197 5.0
-0.22172 4.3
-0.22148 3.7
-0.22123 3.0
-0.22099 2.3
-0.22075 1.7
-0.2205 1.0
-0.22026 0.3
-0.22001 -0.4
-0.21977 -1.1
-0.21952 -1.8
-0.21928 -2.5
-0.21904 -3.2
-0.21879 -3.8
-0.21855 -4.5
-0.2183 -5.2
-0.21806 -5.8
-0.21782 -6.4
-0.21757 -7.1
-0.21733 -7.7
-0.21708 -8.3
-0.21684 -8.9
-0.21659 -9.4
-0.21635 -10.0
-0.21611 -10.5
-0.21586 -11.0
-0.21562 -11.5
-0.21537 -11.9
-0.21513 -12.4
-0.21489 -12.8
-0.21464 -13.2
-0.2144 -13.5
-0.21415 -13.8
-0.21391 -14.1
-0.21367 -14.4
-0.21342 -14.6
-0.21318 -14.9
-0.21293 -15.0
-0.21269 -15.2
-0.21244 -15.3
-0.2122 -15.4
-0.21196 -15.5
-0.21171 -15.5
-0.21147 -15.5
-0.21122 -15.4
-0.21098 -15.4
-0.21074 -15.2
-0.21049 -15.1
-0.21025 -14.9
-0.21 -14.7
-0.20976 -14.5
-0.20951 -14.3
-0.20927 -14.0
-0.20903 -13.6
-0.20878 -13.3
-0.20854 -12.9
-0.20829 -12.5
-0.20805 -12.1
-0.20781 -11.6
-0.20756 -11.1
-0.20732 -10.6
-0.20707 -10.1
-0.20683 -9.5
-0.20658 -9.0
-0.20634 -8.4
-0.2061 -7.8
-0.20585 -7.1
-0.20561 -6.5
-0.20536 -5.8
-0.20512 -5.2
-0.20488 -4.5
-0.20463 -3.8
-0.20439 -3.1
-0.20414 -2.4
-0.2039 -1.7
-0.20366 -1.0
-0.20341 -0.2
-0.20317 0.5
-0.20292 1.2
-0.20268 1.9
-0.20243 2.6
-0.20219 3.4
-0.20195 4.1
-0.2017 4.8
-0.20146 5.4
-0.20121 6.1
-0.20097 6.8
-0.20073 7.4
-0.20048 8.1
-0.20024 8.7
-0.19999 9.3
-0.19975 9.9
-0.1995 10.4
-0.19926 11.0
-0.19902 11.5
-0.19877 12.0
-0.19853 12.4
-0.19828 12.9
-0.19804 13.3
-0.1978 13.7
-0.19755 14.0
-0.19731 14.3
-0.19706 14.6
-0.19682 14.9
-0.19658 15.1
-0.19633 15.3
-0.19609 15.5
-0.19584 15.6
-0.1956 15.7
-0.19535 15.7
-0.19511 15.8
-0.19487 15.8
-0.19462 15.7
-0.19438 15.6
-0.19413 15.5
-0.19389 15.4
-0.19365 15.2
-0.1934 15.0
-0.19316 14.7
-0.19291 14.4
-0.19267 14.1
-0.19242 13.8
-0.19218 13.4
-0.19194 13.0
-0.19169 12.6
-0.19145 12.1
-0.1912 11.6
-0.19096 11.1
-0.19072 10.5
-0.19047 10.0
-0.19023 9.4
-0.18998 8.8
-0.18974 8.1
-0.1895 7.5
-0.18925 6.8
-0.18901 6.1
-0.18876 5.4
-0.18852 4.7
-0.18827 4.0
-0.18803 3.3
-0.18779 2.5
-0.18754 1.8
-0.1873 1.0
-0.18705 0.3
-0.18681 -0.5
-0.18657 -1.2
-0.18632 -2.0
-0.18608 -2.7
-0.18583 -3.5
-0.18559 -4.2
-0.18534 -5.0
-0.1851 -5.7
-0.18486 -6.4
-0.18461 -7.1
-0.18437 -7.7
-0.18412 -8.4
-0.18388 -9.0
-0.18364 -9.7
-0.18339 -10.3
-0.18315 -10.8
-0.1829 -11.4
-0.18266 -11.9
-0.18242 -12.4
-0.18217 -12.9
-0.18193 -13.3
-0.18168 -13.8
-0.18144 -14.1
-0.18119 -14.5
-0.18095 -14.8
-0.18071 -15.1
-0.18046 -15.3
-0.18022 -15.5
-0.17997 -15.7
-0.17973 -15.9
-0.17949 -16.0
-0.17924 -16.0
-0.179 -16.1
-0.17875 -16.1
-0.17851 -16.0
-0.17826 -15.9
-0.17802 -15.8
-0.17778 -15.7
-0.17753 -15.5
-0.17729 -15.2
-0.17704 -15.0
-0.1768 -14.7
-0.17656 -14.3
-0.17631 -14.0
-0.17607 -13.6
-0.17582 -13.1
-0.17558 -12.7
-0.17533 -12.2
-0.17509 -11.6
-0.17485 -11.1
-0.1746 -10.5
-0.17436 -9.9
-0.17411 -9.3
-0.17387 -8.6
-0.17363 -7.9
-0.17338 -7.2
-0.17314 -6.5
-0.17289 -5.8
-0.17265 -5.1
-0.17241 -4.3
-0.17216 -3.5
-0.17192 -2.8
-0.17167 -2.0
-0.17143 -1.2
-0.17118 -0.4
-0.17094 0.4
-0.1707 1.2
-0.17045 2.0
-0.17021 2.8
-0.16996 3.6
-0.16972 4.3
-0.16948 5.1
-0.16923 5.9
-0.16899 6.6
-0.16874 7.3
-0.1685 8.0
-0.16825 8.7
-0.16801 9.4
-0.16777 10.0
-0.16752 10.7
-0.16728 11.3
-0.16703 11.8
-0.16679 12.4
-0.16655 12.9
-0.1663 13.4
-0.16606 13.8
-0.16581 14.3
-0.16557 14.6
-0.16533 15.0
-0.16508 15.3
-0.16484 15.6
-0.16459 15.8
-0.16435 16.0
-0.1641 16.2
-0.16386 16.3
-0.16362 16.4
-0.16337 16.4
-0.16313 16.4
-0.16288 16.4
-0.16264 16.3
-0.1624 16.1
-0.16215 16.0
-0.16191 15.8
-0.16166 15.5
-0.16142 15.3
-0.16117 14.9
-0.16093 14.6
-0.16069 14.2
-0.16044 13.7
-0.1602 13.3
-0.15995 12.8
-0.15971 12.2
-0.15947 11.7
-0.15922 11.1
-0.15898 10.5
-0.15873 9.8
-0.15849 9.1
-0.15825 8.4
-0.158 7.7
-0.15776 7.0
-0.15751 6.2
-0.15727 5.4
-0.15702 4.6
-0.15678 3.8
-0.15654 3.0
-0.15629 2.2
-0.15605 1.4
-0.1558 0.5
-0.15556 -0.3
-0.15532 -1.2
-0.15507 -2.0
-0.15483 -2.8
-0.15458 -3.6
-0.15434 -4.5
-0.15409 -5.3
-0.15385 -6.1
-0.15361 -6.8
-0.15336 -7.6
-0.15312 -8.4
-0.15287 -9.1
-0.15263 -9.8
-0.15239 -10.5
-0.15214 -11.1
-0.1519 -11.7
-0.15165 -12.3
-0.15141 -12.9
-0.15117 -13.4
-0.15092 -13.9
-0.15068 -14.4
-0.15043 -14.8
-0.15019 -15.2
-0.14994 -15.5
-0.1497 -15.8
-0.14946 -16.1
-0.14921 -16.3
-0.14897 -16.5
-0.14872 -16.6
-0.14848 -16.7
-0.14824 -16.8
-0.14799 -16.8
-0.14775 -16.7
-0.1475 -16.6
-0.14726 -16.5
-0.14701 -16.3
-0.14677 -16.1
-0.14653 -15.9
-0.14628 -15.6
-0.14604 -15.2
-0.14579 -14.8
-0.14555 -14.4
-0.14531 -13.9
-0.14506 -13.4
-0.14482 -12.9
-0.14457 -12.3
-0.14433 -11.7
-0.14408 -11.1
-0.14384 -10.4
-0.1436 -9.7
-0.14335 -9.0
-0.14311 -8.2
-0.14286 -7.4
-0.14262 -6.6
-0.14238 -5.8
-0.14213 -5.0
-0.14189 -4.1
-0.14164 -3.3
-0.1414 -2.4
-0.14116 -1.5
-0.14091 -0.6
-0.14067 0.3
-0.14042 1.1
-0.14018 2.0
-0.13993 2.9
-0.13969 3.8
-0.13945 4.6
-0.1392 5.5
-0.13896 6.3
-0.13871 7.2
-0.13847 8.0
-0.13823 8.8
-0.13798 9.5
-0.13774 10.3
-0.13749 11.0
-0.13725 11.6
-0.137 12.3
-0.13676 12.9
-0.13652 13.5
-0.13627 14.0
-0.13603 14.5
-0.13578 15.0
-0.13554 15.4
-0.1353 15.8
-0.13505 16.1
-0.13481 16.4
-0.13456 16.7
-0.13432 16.9
-0.13408 17.0
-0.13383 17.1
-0.13359 17.2
-0.13334 17.2
-0.1331 17.1
-0.13285 17.0
-0.13261 16.9
-0.13237 16.7
-0.13212 16.5
-0.13188 16.2
-0.13163 15.8
-0.13139 15.5
-0.13115 15.0
-0.1309 14.6
-0.13066 14.1
-0.13041 13.5
-0.13017 12.9
-0.12992 12.3
-0.12968 11.6
-0.12944 10.9
-0.12919 10.2
-0.12895 9.4
-0.1287 8.7
-0.12846 7.8
-0.12822 7.0
-0.12797 6.1
-0.12773 5.2
-0.12748 4.3
-0.12724 3.4
-0.127 2.5
-0.12675 1.6
-0.12651 0.6
-0.12626 -0.3
-0.12602 -1.3
-0.12577 -2.2
-0.12553 -3.1
-0.12529 -4.1
-0.12504 -5.0
-0.1248 -5.9
-0.12455 -6.8
-0.12431 -7.6
-0.12407 -8.5
-0.12382 -9.3
-0.12358 -10.1
-0.12333 -10.9
-0.12309 -11.6
-0.12284 -12.3
-0.1226 -13.0
-0.12236 -13.6
-0.12211 -14.2
-0.12187 -14.8
-0.12162 -15.3
-0.12138 -15.7
-0.12114 -16.1
-0.12089 -16.5
-0.12065 -16.8
-0.1204 -17.1
-0.12016 -17.3
-0.11992 -17.4
-0.11967 -17.6
-0.11943 -17.6
-0.11918 -17.6
-0.11894 -17.5
-0.11869 -17.4
-0.11845 -17.3
-0.11821 -17.1
-0.11796 -16.8
-0.11772 -16.5
-0.11747 -16.1
-0.11723 -15.7
-0.11699 -15.2
-0.11674 -14.7
-0.1165 -14.1
-0.11625 -13.5
-0.11601 -12.8
-0.11576 -12.1
-0.11552 -11.4
-0.11528 -10.6
-0.11503 -9.8
-0.11479 -9.0
-0.11454 -8.1
-0.1143 -7.2
-0.11406 -6.3
-0.11381 -5.4
-0.11357 -4.4
-0.11332 -3.4
-0.11308 -2.4
-0.11283 -1.4
-0.11259 -0.4
-0.11235 0.6
-0.1121 1.6
-0.11186 2.6
-0.11161 3.6
-0.11137 4.6
-0.11113 5.6
-0.11088 6.5
-0.11064 7.5
-0.11039 8.4
-0.11015 9.3
-0.10991 10.1
-0.10966 11.0
-0.10942 11.8
-0.10917 12.5
-0.10893 13.2
-0.10868 13.9
-0.10844 14.6
-0.1082 15.1
-0.10795 15.7
-0.10771 16.2
-0.10746 16.6
-0.10722 17.0
-0.10698 17.3
-0.10673 17.6
-0.10649 17.8
-0.10624 18.0
-0.106 18.1
-0.10575 18.1
-0.10551 18.1
-0.10527 18.0
-0.10502 17.8
-0.10478 17.6
-0.10453 17.4
-0.10429 17.1
-0.10405 16.7
-0.1038 16.2
-0.10356 15.7
-0.10331 15.2
-0.10307 14.6
-0.10283 14.0
-0.10258 13.3
-0.10234 12.5
-0.10209 11.7
-0.10185 10.9
-0.1016 10.0
-0.10136 9.1
-0.10112 8.2
-0.10087 7.2
-0.10063 6.2
-0.10038 5.2
-0.10014 4.2
-0.0999 3.1
-0.09965 2.0
-0.09941 1.0
-0.09916 -0.1
-0.09892 -1.2
-0.09867 -2.3
-0.09843 -3.4
-0.09819 -4.4
-0.09794 -5.5
-0.0977 -6.5
-0.09745 -7.5
-0.09721 -8.5
-0.09697 -9.5
-0.09672 -10.4
-0.09648 -11.3
-0.09623 -12.2
-0.09599 -13.0
-0.09575 -13.7
-0.0955 -14.5
-0.09526 -15.1
-0.09501 -15.8
-0.09477 -16.3
-0.09452 -16.8
-0.09428 -17.3
-0.09404 -17.7
-0.09379 -18.0
-0.09355 -18.3
-0.0933 -18.5
-0.09306 -18.6
-0.09282 -18.6
-0.09257 -18.6
-0.09233 -18.6
-0.09208 -18.4
-0.09184 -18.2
-0.09159 -17.9
-0.09135 -17.6
-0.09111 -17.2
-0.09086 -16.7
-0.09062 -16.2
-0.09037 -15.6
-0.09013 -14.9
-0.08989 -14.2
-0.08964 -13.4
-0.0894 -12.6
-0.08915 -11.7
-0.08891 -10.8
-0.08867 -9.9
-0.08842 -8.9
-0.08818 -7.8
-0.08793 -6.8
-0.08769 -5.7
-0.08744 -4.6
-0.0872 -3.4
-0.08696 -2.3
-0.08671 -1.1
-0.08647 0.0
-0.08622 1.2
-0.08598 2.4
-0.08574 3.5
-0.08549 4.7
-0.08525 5.8
-0.085 6.9
-0.08476 8.0
-0.08451 9.1
-0.08427 10.1
-0.08403 11.1
-0.08378 12.1
-0.08354 13.0
-0.08329 13.8
-0.08305 14.7
-0.08281 15.4
-0.08256 16.1
-0.08232 16.7
-0.08207 17.3
-0.08183 17.8
-0.08158 18.2
-0.08134 18.6
-0.0811 18.9
-0.08085 19.1
-0.08061 19.2
-0.08036 19.3
-0.08012 19.3
-0.07988 19.2
-0.07963 19.0
-0.07939 18.7
-0.07914 18.4
-0.0789 18.0
-0.07866 17.5
-0.07841 17.0
-0.07817 16.3
-0.07792 15.7
-0.07768 14.9
-0.07743 14.1
-0.07719 13.2
-0.07695 12.3
-0.0767 11.3
-0.07646 10.2
-0.07621 9.2
-0.07597 8.0
-0.07573 6.9
-0.07548 5.7
-0.07524 4.5
-0.07499 3.2
-0.07475 2.0
-0.0745 0.7
-0.07426 -0.6
-0.07402 -1.9
-0.07377 -3.1
-0.07353 -4.4
-0.07328 -5.6
-0.07304 -6.9
-0.0728 -8.1
-0.07255 -9.2
-0.07231 -10.4
-0.07206 -11.5
-0.07182 -12.5
-0.07158 -13.5
-0.07133 -14.4
-0.07109 -15.3
-0.07084 -16.1
-0.0706 -16.9
-0.07035 -17.5
-0.07011 -18.1
-0.06987 -18.7
-0.06962 -19.1
-0.06938 -19.4
-0.06913 -19.7
-0.06889 -19.9
-0.06865 -20.0
-0.0684 -20.0
-0.06816 -19.9
-0.06791 -19.7
-0.06767 -19.5
-0.06742 -19.1
-0.06718 -18.7
-0.06694 -18.1
-0.06669 -17.5
-0.06645 -16.8
-0.0662 -16.0
-0.06596 -15.2
-0.06572 -14.3
-0.06547 -13.3
-0.06523 -12.2
-0.06498 -11.1
-0.06474 -9.9
-0.0645 -8.7
-0.06425 -7.4
-0.06401 -6.1
-0.06376 -4.8
-0.06352 -3.4
-0.06327 -2.1
-0.06303 -0.7
-0.06279 0.8
-0.06254 2.2
-0.0623 3.6
-0.06205 5.0
-0.06181 6.3
-0.06157 7.7
-0.06132 9.0
-0.06108 10.2
-0.06083 11.5
-0.06059 12.6
-0.06034 13.8
-0.0601 14.8
-0.05986 15.8
-0.05961 16.7
-0.05937 17.5
-0.05912 18.3
-0.05888 18.9
-0.05864 19.5
-0.05839 20.0
-0.05815 20.3
-0.0579 20.6
-0.05766 20.8
-0.05742 20.8
-0.05717 20.8
-0.05693 20.6
-0.05668 20.4
-0.05644 20.0
-0.05619 19.6
-0.05595 19.0
-0.05571 18.3
-0.05546 17.6
-0.05522 16.7
-0.05497 15.7
-0.05473 14.7
-0.05449 13.6
-0.05424 12.4
-0.054 11.1
-0.05375 9.8
-0.05351 8.4
-0.05326 7.0
-0.05302 5.5
-0.05278 4.0
-0.05253 2.5
-0.05229 0.9
-0.05204 -0.7
-0.0518 -2.2
-0.05156 -3.8
-0.05131 -5.4
-0.05107 -6.9
-0.05082 -8.4
-0.05058 -9.8
-0.05033 -11.2
-0.05009 -12.6
-0.04985 -13.9
-0.0496 -15.1
-0.04936 -16.2
-0.04911 -17.3
-0.04887 -18.2
-0.04863 -19.1
-0.04838 -19.8
-0.04814 -20.5
-0.04789 -21.0
-0.04765 -21.4
-0.04741 -21.7
-0.04716 -21.8
-0.04692 -21.8
-0.04667 -21.7
-0.04643 -21.5
-0.04618 -21.2
-0.04594 -20.7
-0.0457 -20.1
-0.04545 -19.3
-0.04521 -18.5
-0.04496 -17.5
-0.04472 -16.5
-0.04448 -15.3
-0.04423 -14.0
-0.04399 -12.6
-0.04374 -11.2
-0.0435 -9.7
-0.04325 -8.1
-0.04301 -6.4
-0.04277 -4.7
-0.04252 -3.0
-0.04228 -1.2
-0.04203 0.6
-0.04179 2.4
-0.04155 4.1
-0.0413 5.9
-0.04106 7.6
-0.04081 9.3
-0.04057 11.0
-0.04033 12.5
-0.04008 14.0
-0.03984 15.5
-0.03959 16.8
-0.03935 18.0
-0.0391 19.1
-0.03886 20.1
-0.03862 21.0
-0.03837 21.7
-0.03813 22.3
-0.03788 22.7
-0.03764 23.0
-0.0374 23.1
-0.03715 23.0
-0.03691 22.8
-0.03666 22.5
-0.03642 22.0
-0.03617 21.3
-0.03593 20.5
-0.03569 19.5
-0.03544 18.4
-0.0352 17.1
-0.03495 15.7
-0.03471 14.2
-0.03447 12.6
-0.03422 10.8
-0.03398 9.0
-0.03373 7.1
-0.03349 5.2
-0.03325 3.2
-0.033 1.1
-0.03276 -1.0
-0.03251 -3.0
-0.03227 -5.1
-0.03202 -7.1
-0.03178 -9.1
-0.03154 -11.1
-0.03129 -12.9
-0.03105 -14.7
-0.0308 -16.4
-0.03056 -17.9
-0.03032 -19.3
-0.03007 -20.6
-0.02983 -21.7
-0.02958 -22.7
-0.02934 -23.5
-0.02909 -24.0
-0.02885 -24.4
-0.02861 -24.6
-0.02836 -24.6
-0.02812 -24.4
-0.02787 -23.9
-0.02763 -23.3
-0.02739 -22.4
-0.02714 -21.4
-0.0269 -20.1
-0.02665 -18.7
-0.02641 -17.1
-0.02617 -15.3
-0.02592 -13.4
-0.02568 -11.4
-0.02543 -9.2
-0.02519 -6.9
-0.02494 -4.6
-0.0247 -2.1
-0.02446 0.3
-0.02421 2.8
-0.02397 5.3
-0.02372 7.7
-0.02348 10.1
-0.02324 12.4
-0.02299 14.7
-0.02275 16.7
-0.0225 18.7
-0.02226 20.5
-0.02201 22.0
-0.02177 23.4
-0.02153 24.6
-0.02128 25.5
-0.02104 26.1
-0.02079 26.5
-0.02055 26.6
-0.02031 26.4
-0.02006 26.0
-0.01982 25.2
-0.01957 24.2
-0.01933 22.9
-0.01908 21.3
-0.01884 19.4
-0.0186 17.4
-0.01835 15.0
-0.01811 12.5
-0.01786 9.8
-0.01762 7.0
-0.01738 4.1
-0.01713 1.0
-0.01689 -2.1
-0.01664 -5.1
-0.0164 -8.2
-0.01616 -11.2
-0.01591 -14.1
-0.01567 -16.9
-0.01542 -19.4
-0.01518 -21.8
-0.01493 -23.9
-0.01469 -25.7
-0.01445 -27.1
-0.0142 -28.2
-0.01396 -28.9
-0.01371 -29.3
-0.01347 -29.2
-0.01323 -28.7
-0.01298 -27.7
-0.01274 -26.3
-0.01249 -24.5
-0.01225 -22.3
-0.012 -19.7
-0.01176 -16.8
-0.01152 -13.5
-0.01127 -10.0
-0.01103 -6.2
-0.01078 -2.3
-0.01054 1.8
-0.0103 5.9
-0.01005 9.9
-0.00981 13.9
-0.00956 17.7
-0.00932 21.2
-0.00908 24.4
-0.00883 27.2
-0.00859 29.5
-0.00834 31.2
-0.0081 32.4
-0.00785 32.9
-0.00761 32.7
-0.00737 31.8
-0.00712 30.2
-0.00688 27.9
-0.00663 24.8
-0.00639 21.1
-0.00615 16.8
-0.0059 12.0
-0.00566 6.7
-0.00541 1.1
-0.00517 -4.7
-0.00492 -10.5
-0.00468 -16.2
-0.00444 -21.5
-0.00419 -26.4
-0.00395 -30.6
-0.0037 -34.0
-0.00346 -36.4
-0.00322 -37.6
-0.00297 -37.5
-0.00273 -36.1
-0.00248 -33.2
-0.00224 -28.9
-0.002 -23.3
-0.00175 -16.5
-0.00151 -8.6
-0.00126 0.0
-0.00102 8.9
-0.00077 17.7
-0.00053 25.9
-0.00029 32.8
-4e-05 37.9
0.0002 40.6
0.00045 40.5
0.00069 37.4
0.00093 31.2
0.00118 22.4
0.00142 11.6
0.00167 -0.1
0.00191 -11.7
0.00216 -21.9
0.0024 -29.6
0.00264 -33.9
0.00289 -34.4
0.00313 -31.1
0.00338 -24.4
0.00362 -15.3
0.00386 -5.1
0.00411 5.0
0.00435 13.8
0.0046 20.0
0.00484 23.2
0.00508 23.2
0.00533 20.2
0.00557 14.8
0.00582 8.0
0.00606 0.9
0.00631 -5.6
0.00655 -10.7
0.00679 -13.7
0.00704 -14.5
0.00728 -13.2
0.00753 -10.2
0.00777 -6.1
0.00801 -1.6
0.00826 2.6
0.0085 5.9
0.00875 8.0
0.00899 8.7
0.00924 8.0
0.00948 6.3
0.00972 3.9
0.00997 1.2
0.01021 -1.4
0.01046 -3.5
0.0107 -4.8
0.01094 -5.2
0.01119 -4.8
0.01143 -3.8
0.01168 -2.3
0.01192 -0.7
0.01217 0.9
0.01241 2.1
0.01265 2.9
0.0129 3.2
0.01314 2.9
0.01339 2.3
0.01363 1.4
0.01387 0.4
0.01412 -0.6
0.01436 -1.3
0.01461 -1.8
0.01485 -1.9
0.01509 -1.8
0.01534 -1.4
0.01558 -0.8
0.01583 -0.2
0.01607 0.4
0.01632 0.8
0.01656 1.1
0.0168 1.2
0.01705 1.1
0.01729 0.8
0.01754 0.5
0.01778 0.0
0.01802 -0.2
0.01827 -0.5
0.01851 -0.7
0.01876 -0.7
0.019 -0.6
0.01925 -0.5
0.01949 -0.3
0.01973 0.0
0.01998 0.2
0.02022 0.3
0.02047 0.4
0.02071 0.4
0.02095 0.4
0.0212 0.3
0.02144 0.2
0.02169 0.0
0.02193 -0.1
0.02217 -0.2
0.02242 -0.3
0.02266 -0.3
0.02291 -0.2
0.02315 -0.2
0.0234 0.0
0.02364 0.0
0.02388 0.0
0.02413 0.1
0.02437 0.2
0.02462 0.2
0.02486 0.1
0.0251 0.1
0.02535 0.0
0.02559 0.0
0.02584 0.0
0.02608 0.0
0.02633 0.0
0.02657 0.0
0.02681 0.0
0.02706 0.0
0.0273 0.0
0.02755 0.0
0.02779 0.0
0.02803 0.0
0.02828 0.0
0.02852 0.0
0.02877 0.0
0.02901 0.0
0.02925 0.0
0.0295 0.0
0.02974 0.0
0.02999 0.0
0.03023 0.0
0.03048 0.0
0.03072 0.0
0.03096 0.0
0.03121 0.0
0.03145 0.0
0.0317 0.0
0.03194 0.0
0.03218 0.0
0.03243 0.0
0.03267 0.0
0.03292 0.0
0.03316 0.0
0.03341 0.0
0.03365 0.0
0.03389 0.0
0.03414 0.0
0.03438 0.0
0.03463 0.0
0.03487 0.0
0.03511 0.0
0.03536 0.0
0.0356 0.0
0.03585 0.0
0.03609 0.0
0.03633 0.0
0.03658 0.0
0.03682 0.0
0.03707 0.0
0.03731 0.0
0.03756 0.0
0.0378 0.0
0.03804 0.0
0.03829 0.0
0.03853 0.0
0.03878 0.0
0.03902 0.0
0.03926 0.0
0.03951 0.0
0.03975 0.0
0.04 0.0
0.04024 0.0
0.04049 0.0
0.04073 0.0
0.04097 0.0
0.04122 0.0
0.04146 0.0
0.04171 0.0
0.04195 0.0
0.04219 0.0
0.04244 0.0
0.04268 0.0
0.04293 0.0
0.04317 0.0
0.04342 0.0
0.04366 0.0
0.0439 0.0
0.04415 0.0
0.04439 0.0
0.04464 0.0
0.04488 0.0
0.04512 0.0
0.04537 0.0
0.04561 0.0
0.04586 0.0
0.0461 0.0
0.04634 0.0
0.04659 0.0
0.04683 0.0
0.04708 0.0
0.04732 0.0
0.04757 0.0
0.04781 0.0
0.04805 0.0
0.0483 0.0
0.04854 0.0
0.04879 0.0
0.04903 0.0
0.04927 0.0
0.04952 0.0
0.04976 0.0
0.05001 0.0
0.05025 0.0
0.0505 0.0
0.05074 0.0
0.05098 0.0
0.05123 0.0
0.05147 0.0
0.05172 0.0
0.05196 0.0
0.0522 0.0
0.05245 0.0
0.05269 0.0
0.05294 0.0
0.05318 0.0
0.05342 0.0
0.05367 0.0
0.05391 0.0
0.05416 0.0
0.0544 0.0
0.05465 0.0
0.05489 0.0
0.05513 0.0
0.05538 0.0
0.05562 0.0
0.05587 0.0
0.05611 0.0
0.05635 0.0
0.0566 0.0
0.05684 0.0
0.05709 0.0
0.05733 0.0
0.05758 0.0
0.05782 0.0
0.05806 0.0
0.05831 0.0
0.05855 0.0
0.0588 0.0
0.05904 0.0
0.05928 0.0
0.05953 0.0
0.05977 0.0
0.06002 0.0
0.06026 0.0
0.0605 0.0
0.06075 0.0
0.06099 0.0
0.06124 0.0
0.06148 0.0
0.06173 0.0
0.06197 0.0
0.06221 0.0
0.06246 0.0
0.0627 0.0
0.06295 0.0
0.06319 0.0
0.06343 0.0
0.06368 0.0
0.06392 0.0
0.06417 0.0
0.06441 0.0
0.06466 0.0
0.0649 0.0
0.06514 0.0
0.06539 0.0
0.06563 0.0
0.06588 0.0
0.06612 0.0
0.06636 0.0
0.06661 0.0
0.06685 0.0
0.0671 0.0
0.06734 0.0
0.06758 0.0
0.06783 0.0
0.06807 0.0
0.06832 0.0
0.06856 0.0
0.06881 0.0
0.06905 0.0
0.06929 0.0
0.06954 0.0
0.06978 0.0
0.07003 0.0
0.07027 0.0
0.07051 0.0
0.07076 0.0
0.071 0.0
0.07125 0.0
0.07149 0.0
0.07174 0.0
0.07198 0.0
0.07222 0.0
0.07247 0.0
0.07271 0.0
0.07296 0.0
0.0732 0.0
0.07344 0.0
0.07369 0.0
0.07393 0.0
0.07418 0.0
0.07442 0.0
0.07467 0.0
0.07491 0.0
0.07515 0.0
0.0754 0.0
0.07564 0.0
0.07589 0.0
0.07613 0.0
0.07637 0.0
0.07662 0.0
0.07686 0.0
0.07711 0.0
0.07735 0.0
0.07759 0.0
0.07784 0.0
0.07808 0.0
0.07833 0.0
0.07857 0.0
0.07882 0.0
0.07906 0.0
0.0793 0.0
0.07955 0.0
0.07979 0.0
0.08004 0.0
0.08028 0.0
0.08052 0.0
0.08077 0.0
0.08101 0.0
0.08126 0.0
0.0815 0.0
0.08175 0.0
0.08199 0.0
0.08223 0.0
0.08248 0.0
0.08272 0.0
0.08297 0.0
0.08321 0.0
0.08345 0.0
0.0837 0.0
0.08394 0.0
0.08419 0.0
0.08443 0.0
0.08467 0.0
0.08492 0.0
0.08516 0.0
0.08541 0.0
0.08565 0.0
0.0859 0.0
0.08614 0.0
0.08638 0.0
0.08663 0.0
0.08687 0.0
0.08712 0.0
0.08736 0.0
0.0876 0.0
0.08785 0.0
0.08809 0.0
0.08834 0.0
0.08858 0.0
0.08883 0.0
0.08907 0.0
0.08931 0.0
0.08956 0.0
0.0898 0.0
0.09005 0.0
0.09029 0.0
0.09053 0.0
0.09078 0.0
0.09102 0.0
0.09127 0.0
0.09151 0.0
0.09175 0.0
0.092 0.0
0.09224 0.0
0.09249 0.0
0.09273 0.0
0.09298 0.0
0.09322 0.0
0.09346 0.0
0.09371 0.0
0.09395 0.0
0.0942 0.0
0.09444 0.0
0.09468 0.0
0.09493 0.0
0.09517 0.0
0.09542 0.0
0.09566 0.0
0.09591 0.0
0.09615 0.0
0.09639 0.0
0.09664 0.0
0.09688 0.0
0.09713 0.0
0.09737 0.0
0.09761 0.0
0.09786 0.0
0.0981 0.0
0.09835 0.0
0.09859 0.0
0.09883 0.0
0.09908 0.0
0.09932 0.0
0.09957 0.0
0.09981 0.0
0.10006 0.0
0.1003 0.0
0.10054 0.0
0.10079 0.0
0.10103 0.0
0.10128 0.0
0.10152 0.0
0.10176 0.0
0.10201 0.0
0.10225 0.0
0.1025 0.0
0.10274 0.0
0.10299 0.0
0.10323 0.0
0.10347 0.0
0.10372 0.0
0.10396 0.0
0.10421 0.0
0.10445 0.0
0.10469 0.0
0.10494 0.0
0.10518 0.0
0.10543 0.0
0.10567 0.0
0.10592 0.0
0.10616 0.0
0.1064 0.0
0.10665 0.0
0.10689 0.0
0.10714 0.0
0.10738 0.0
0.10762 0.0
0.10787 0.0
0.10811 0.0
0.10836 0.0
0.1086 0.0
0.10884 0.0
0.10909 0.0
0.10933 0.0
0.10958 0.0
0.10982 0.0
0.11007 0.0
0.11031 0.0
0.11055 0.0
0.1108 0.0
0.11104 0.0
0.11129 0.0
0.11153 0.0
0.11177 0.0
0.11202 0.0
0.11226 0.0
0.11251 0.0
0.11275 0.0
0.113 0.0
0.11324 0.0
0.11348 0.0
0.11373 0.0
0.11397 0.0
0.11422 0.0
0.11446 0.0
0.1147 0.0
0.11495 0.0
0.11519 0.0
0.11544 0.0
0.11568 0.0
0.11592 0.0
0.11617 0.0
0.11641 0.0
0.11666 0.0
0.1169 0.0
0.11715 0.0
0.11739 0.0
0.11763 0.0
0.11788 0.0
0.11812 0.0
0.11837 0.0
0.11861 0.0
0.11885 0.0
0.1191 0.0
0.11934 0.0
0.11959 0.0
0.11983 0.0
0.12008 0.0
0.12032 0.0
0.12056 0.0
0.12081 0.0
0.12105 0.0
0.1213 0.0
0.12154 0.0
0.12178 0.0
0.12203 0.0
0.12227 0.0
0.12252 0.0
0.12276 0.0
0.123 0.0
0.12325 0.0
0.12349 0.0
0.12374 0.0
0.12398 0.0
0.12423 0.0
0.12447 0.0
0.12471 0.0
0.12496 0.0
0.1252 0.0
0.12545 0.0
0.12569 0.0
0.12593 0.0
0.12618 0.0
0.12642 0.0
0.12667 0.0
0.12691 0.0
0.12716 0.0
0.1274 0.0
0.12764 0.0
0.12789 0.0
0.12813 0.0
0.12838 0.0
0.12862 0.0
0.12886 0.0
0.12911 0.0
0.12935 0.0
0.1296 0.0
0.12984 0.0
0.13008 0.0
0.13033 0.0
0.13057 0.0
0.13082 0.0
0.13106 0.0
0.13131 0.0
0.13155 0.0
0.13179 0.0
0.13204 0.0
0.13228 0.0
0.13253 0.0
0.13277 0.0
0.13301 0.0
0.13326 0.0
0.1335 0.0
0.13375 0.0
0.13399 0.0
0.13424 0.0
0.13448 0.0
0.13472 0.0
0.13497 0.0
0.13521 0.0
0.13546 0.0
0.1357 0.0
0.13594 0.0
0.13619 0.0
0.13643 0.0
0.13668 0.0
0.13692 0.0
0.13717 0.0
0.13741 0.0
0.13765 0.0
0.1379 0.0
0.13814 0.0
0.13839 0.0
0.13863 0.0
0.13887 0.0
0.13912 0.0
0.13936 0.0
0.13961 0.0
0.13985 0.0
0.14009 0.0
0.14034 0.0
0.14058 0.0
0.14083 0.0
0.14107 0.0
0.14132 0.0
0.14156 0.0
0.1418 0.0
0.14205 0.0
0.14229 0.0
0.14254 0.0
0.14278 0.0
0.14302 0.0
0.14327 0.0
0.14351 0.0
0.14376 0.0
0.144 0.0
0.14425 0.0
0.14449 0.0
0.14473 0.0
0.14498 0.0
0.14522 0.0
0.14547 0.0
0.14571 0.0
0.14595 0.0
0.1462 0.0
0.14644 0.0
0.14669 0.0
0.14693 0.0
0.14717 0.0
0.14742 0.0
0.14766 0.0
0.14791 0.0
0.14815 0.0
0.1484 0.0
0.14864 0.0
0.14888 0.0
0.14913 0.0
0.14937 0.0
0.14962 0.0
0.14986 0.0
0.1501 0.0
0.15035 0.0
0.15059 0.0
0.15084 0.0
0.15108 0.0
0.15133 0.0
0.15157 0.0
0.15181 0.0
0.15206 0.0
0.1523 0.0
0.15255 0.0
0.15279 0.0
0.15303 0.0
0.15328 0.0
0.15352 0.0
0.15377 0.0
0.15401 0.0
0.15425 0.0
0.1545 0.0
0.15474 0.0
0.15499 0.0
0.15523 0.0
0.15548 0.0
0.15572 0.0
0.15596 0.0
0.15621 0.0
0.15645 0.0
0.1567 0.0
0.15694 0.0
0.15718 0.0
0.15743 0.0
0.15767 0.0
