t strain*1e23
-0.39583 3.1
-0.39558 2.9
-0.39534 2.6
-0.3951 2.3
-0.39485 2.0
-0.39461 1.7
-0.39436 1.4
-0.39412 1.1
-0.39388 0.8
-0.39363 0.5
-0.39339 0.2
-0.39314 0.0
-0.3929 -0.4
-0.39265 -0.7
-0.39241 -1.0
-0.39217 -1.2
-0.39192 -1.5
-0.39168 -1.8
-0.39143 -2.1
-0.39119 -2.4
-0.39095 -2.7
-0.3907 -3.0
-0.39046 -3.3
-0.39021 -3.5
-0.38997 -3.8
-0.38972 -4.1
-0.38948 -4.3
-0.38924 -4.6
-0.38899 -4.8
-0.38875 -5.1
-0.3885 -5.3
-0.38826 -5.6
-0.38802 -5.8
-0.38777 -6.0
-0.38753 -6.2
-0.38728 -6.4
-0.38704 -6.6
-0.3868 -6.8
-0.38655 -7.0
-0.38631 -7.2
-0.38606 -7.3
-0.38582 -7.5
-0.38557 -7.6
-0.38533 -7.8
-0.38509 -7.9
-0.38484 -8.0
-0.3846 -8.1
-0.38435 -8.2
-0.38411 -8.3
-0.38387 -8.4
-0.38362 -8.4
-0.38338 -8.5
-0.38313 -8.5
-0.38289 -8.6
-0.38264 -8.6
-0.3824 -8.6
-0.38216 -8.6
-0.38191 -8.6
-0.38167 -8.6
-0.38142 -8.6
-0.38118 -8.5
-0.38094 -8.5
-0.38069 -8.4
-0.38045 -8.4
-0.3802 -8.3
-0.37996 -8.2
-0.37971 -8.1
-0.37947 -8.0
-0.37923 -7.8
-0.37898 -7.7
-0.37874 -7.6
-0.37849 -7.4
-0.37825 -7.3
-0.37801 -7.1
-0.37776 -6.9
-0.37752 -6.7
-0.37727 -6.5
-0.37703 -6.3
-0.37679 -6.1
-0.37654 -5.9
-0.3763 -5.7
-0.37605 -5.5
-0.37581 -5.2
-0.37556 -5.0
-0.37532 -4.7
-0.37508 -4.5
-0.37483 -4.2
-0.37459 -3.9
-0.37434 -3.6
-0.3741 -3.4
-0.37386 -3.1
-0.37361 -2.8
-0.37337 -2.5
-0.37312 -2.2
-0.37288 -1.9
-0.37263 -1.6
-0.37239 -1.3
-0.37215 -1.0
-0.3719 -0.7
-0.37166 -0.4
-0.37141 0.0
-0.37117 0.2
-0.37093 0.5
-0.37068 0.8
-0.37044 1.2
-0.37019 1.5
-0.36995 1.8
-0.36971 2.1
-0.36946 2.4
-0.36922 2.7
-0.36897 2.9
-0.36873 3.2
-0.36848 3.5
-0.36824 3.8
-0.368 4.1
-0.36775 4.4
-0.36751 4.6
-0.36726 4.9
-0.36702 5.1
-0.36678 5.4
-0.36653 5.6
-0.36629 5.9
-0.36604 6.1
-0.3658 6.3
-0.36555 6.5
-0.36531 6.7
-0.36507 6.9
-0.36482 7.1
-0.36458 7.3
-0.36433 7.4
-0.36409 7.6
-0.36385 7.7
-0.3636 7.9
-0.36336 8.0
-0.36311 8.1
-0.36287 8.2
-0.36263 8.3
-0.36238 8.4
-0.36214 8.5
-0.36189 8.6
-0.36165 8.6
-0.3614 8.7
-0.36116 8.7
-0.36092 8.7
-0.36067 8.7
-0.36043 8.7
-0.36018 8.7
-0.35994 8.7
-0.3597 8.7
-0.35945 8.6
-0.35921 8.6
-0.35896 8.5
-0.35872 8.4
-0.35847 8.3
-0.35823 8.2
-0.35799 8.1
-0.35774 8.0
-0.3575 7.9
-0.35725 7.7
-0.35701 7.6
-0.35677 7.4
-0.35652 7.2
-0.35628 7.1
-0.35603 6.9
-0.35579 6.7
-0.35555 6.5
-0.3553 6.2
-0.35506 6.0
-0.35481 5.8
-0.35457 5.5
-0.35432 5.3
-0.35408 5.0
-0.35384 4.8
-0.35359 4.5
-0.35335 4.2
-0.3531 4.0
-0.35286 3.7
-0.35262 3.4
-0.35237 3.1
-0.35213 2.8
-0.35188 2.5
-0.35164 2.2
-0.35139 1.9
-0.35115 1.6
-0.35091 1.2
-0.35066 0.9
-0.35042 0.6
-0.35017 0.3
-0.34993 0.0
-0.34969 -0.3
-0.34944 -0.7
-0.3492 -1.0
-0.34895 -1.3
-0.34871 -1.6
-0.34846 -1.9
-0.34822 -2.2
-0.34798 -2.5
-0.34773 -2.8
-0.34749 -3.1
-0.34724 -3.4
-0.347 -3.7
-0.34676 -4.0
-0.34651 -4.3
-0.34627 -4.6
-0.34602 -4.9
-0.34578 -5.1
-0.34554 -5.4
-0.34529 -5.6
-0.34505 -5.9
-0.3448 -6.1
-0.34456 -6.3
-0.34431 -6.6
-0.34407 -6.8
-0.34383 -7.0
-0.34358 -7.2
-0.34334 -7.4
-0.34309 -7.5
-0.34285 -7.7
-0.34261 -7.8
-0.34236 -8.0
-0.34212 -8.1
-0.34187 -8.2
-0.34163 -8.4
-0.34138 -8.5
-0.34114 -8.6
-0.3409 -8.6
-0.34065 -8.7
-0.34041 -8.8
-0.34016 -8.8
-0.33992 -8.8
-0.33968 -8.8
-0.33943 -8.9
-0.33919 -8.9
-0.33894 -8.8
-0.3387 -8.8
-0.33846 -8.8
-0.33821 -8.7
-0.33797 -8.7
-0.33772 -8.6
-0.33748 -8.5
-0.33723 -8.4
-0.33699 -8.3
-0.33675 -8.2
-0.3365 -8.0
-0.33626 -7.9
-0.33601 -7.7
-0.33577 -7.6
-0.33553 -7.4
-0.33528 -7.2
-0.33504 -7.0
-0.33479 -6.8
-0.33455 -6.6
-0.3343 -6.4
-0.33406 -6.2
-0.33382 -5.9
-0.33357 -5.7
-0.33333 -5.4
-0.33308 -5.2
-0.33284 -4.9
-0.3326 -4.6
-0.33235 -4.3
-0.33211 -4.1
-0.33186 -3.8
-0.33162 -3.5
-0.33138 -3.2
-0.33113 -2.8
-0.33089 -2.5
-0.33064 -2.2
-0.3304 -1.9
-0.33015 -1.6
-0.32991 -1.2
-0.32967 -0.9
-0.32942 -0.6
-0.32918 -0.3
-0.32893 0.0
-0.32869 0.4
-0.32845 0.7
-0.3282 1.1
-0.32796 1.4
-0.32771 1.7
-0.32747 2.0
-0.32722 2.4
-0.32698 2.7
-0.32674 3.0
-0.32649 3.3
-0.32625 3.6
-0.326 3.9
-0.32576 4.2
-0.32552 4.5
-0.32527 4.8
-0.32503 5.1
-0.32478 5.3
-0.32454 5.6
-0.3243 5.8
-0.32405 6.1
-0.32381 6.3
-0.32356 6.6
-0.32332 6.8
-0.32307 7.0
-0.32283 7.2
-0.32259 7.4
-0.32234 7.6
-0.3221 7.8
-0.32185 7.9
-0.32161 8.1
-0.32137 8.2
-0.32112 8.3
-0.32088 8.5
-0.32063 8.6
-0.32039 8.7
-0.32014 8.7
-0.3199 8.8
-0.31966 8.9
-0.31941 8.9
-0.31917 9.0
-0.31892 9.0
-0.31868 9.0
-0.31844 9.0
-0.31819 9.0
-0.31795 8.9
-0.3177 8.9
-0.31746 8.8
-0.31721 8.8
-0.31697 8.7
-0.31673 8.6
-0.31648 8.5
-0.31624 8.4
-0.31599 8.3
-0.31575 8.1
-0.31551 8.0
-0.31526 7.8
-0.31502 7.6
-0.31477 7.4
-0.31453 7.3
-0.31429 7.0
-0.31404 6.8
-0.3138 6.6
-0.31355 6.4
-0.31331 6.1
-0.31306 5.9
-0.31282 5.6
-0.31258 5.3
-0.31233 5.1
-0.31209 4.8
-0.31184 4.5
-0.3116 4.2
-0.31136 3.9
-0.31111 3.6
-0.31087 3.3
-0.31062 3.0
-0.31038 2.6
-0.31013 2.3
-0.30989 2.0
-0.30965 1.6
-0.3094 1.3
-0.30916 1.0
-0.30891 0.6
-0.30867 0.3
-0.30843 0.0
-0.30818 -0.4
-0.30794 -0.7
-0.30769 -1.1
-0.30745 -1.4
-0.30721 -1.8
-0.30696 -2.1
-0.30672 -2.4
-0.30647 -2.8
-0.30623 -3.1
-0.30598 -3.4
-0.30574 -3.7
-0.3055 -4.0
-0.30525 -4.3
-0.30501 -4.6
-0.30476 -4.9
-0.30452 -5.2
-0.30428 -5.5
-0.30403 -5.8
-0.30379 -6.0
-0.30354 -6.3
-0.3033 -6.5
-0.30305 -6.8
-0.30281 -7.0
-0.30257 -7.2
-0.30232 -7.4
-0.30208 -7.6
-0.30183 -7.8
-0.30159 -8.0
-0.30135 -8.1
-0.3011 -8.3
-0.30086 -8.4
-0.30061 -8.6
-0.30037 -8.7
-0.30013 -8.8
-0.29988 -8.9
-0.29964 -8.9
-0.29939 -9.0
-0.29915 -9.0
-0.2989 -9.1
-0.29866 -9.1
-0.29842 -9.1
-0.29817 -9.1
-0.29793 -9.1
-0.29768 -9.1
-0.29744 -9.0
-0.2972 -9.0
-0.29695 -8.9
-0.29671 -8.8
-0.29646 -8.7
-0.29622 -8.6
-0.29597 -8.5
-0.29573 -8.4
-0.29549 -8.2
-0.29524 -8.1
-0.295 -7.9
-0.29475 -7.7
-0.29451 -7.5
-0.29427 -7.3
-0.29402 -7.1
-0.29378 -6.9
-0.29353 -6.6
-0.29329 -6.4
-0.29305 -6.1
-0.2928 -5.9
-0.29256 -5.6
-0.29231 -5.3
-0.29207 -5.0
-0.29182 -4.7
-0.29158 -4.4
-0.29134 -4.1
-0.29109 -3.8
-0.29085 -3.5
-0.2906 -3.1
-0.29036 -2.8
-0.29012 -2.4
-0.28987 -2.1
-0.28963 -1.8
-0.28938 -1.4
-0.28914 -1.1
-0.28889 -0.7
-0.28865 -0.4
-0.28841 0.0
-0.28816 0.4
-0.28792 0.7
-0.28767 1.1
-0.28743 1.4
-0.28719 1.8
-0.28694 2.1
-0.2867 2.5
-0.28645 2.8
-0.28621 3.1
-0.28596 3.5
-0.28572 3.8
-0.28548 4.1
-0.28523 4.4
-0.28499 4.8
-0.28474 5.1
-0.2845 5.4
-0.28426 5.6
-0.28401 5.9
-0.28377 6.2
-0.28352 6.5
-0.28328 6.7
-0.28304 7.0
-0.28279 7.2
-0.28255 7.4
-0.2823 7.6
-0.28206 7.8
-0.28181 8.0
-0.28157 8.2
-0.28133 8.3
-0.28108 8.5
-0.28084 8.6
-0.28059 8.8
-0.28035 8.9
-0.28011 9.0
-0.27986 9.0
-0.27962 9.1
-0.27937 9.2
-0.27913 9.2
-0.27888 9.2
-0.27864 9.3
-0.2784 9.3
-0.27815 9.2
-0.27791 9.2
-0.27766 9.2
-0.27742 9.1
-0.27718 9.0
-0.27693 9.0
-0.27669 8.9
-0.27644 8.8
-0.2762 8.6
-0.27596 8.5
-0.27571 8.3
-0.27547 8.2
-0.27522 8.0
-0.27498 7.8
-0.27473 7.6
-0.27449 7.4
-0.27425 7.2
-0.274 6.9
-0.27376 6.7
-0.27351 6.4
-0.27327 6.1
-0.27303 5.9
-0.27278 5.6
-0.27254 5.3
-0.27229 5.0
-0.27205 4.7
-0.2718 4.3
-0.27156 4.0
-0.27132 3.7
-0.27107 3.3
-0.27083 3.0
-0.27058 2.7
-0.27034 2.3
-0.2701 1.9
-0.26985 1.6
-0.26961 1.2
-0.26936 0.8
-0.26912 0.5
-0.26888 0.1
-0.26863 -0.3
-0.26839 -0.6
-0.26814 -1.0
-0.2679 -1.4
-0.26765 -1.7
-0.26741 -2.1
-0.26717 -2.5
-0.26692 -2.8
-0.26668 -3.2
-0.26643 -3.5
-0.26619 -3.9
-0.26595 -4.2
-0.2657 -4.5
-0.26546 -4.8
-0.26521 -5.2
-0.26497 -5.5
-0.26472 -5.8
-0.26448 -6.1
-0.26424 -6.3
-0.26399 -6.6
-0.26375 -6.9
-0.2635 -7.1
-0.26326 -7.4
-0.26302 -7.6
-0.26277 -7.8
-0.26253 -8.0
-0.26228 -8.2
-0.26204 -8.4
-0.2618 -8.5
-0.26155 -8.7
-0.26131 -8.8
-0.26106 -8.9
-0.26082 -9.1
-0.26057 -9.1
-0.26033 -9.2
-0.26009 -9.3
-0.25984 -9.3
-0.2596 -9.4
-0.25935 -9.4
-0.25911 -9.4
-0.25887 -9.4
-0.25862 -9.4
-0.25838 -9.3
-0.25813 -9.3
-0.25789 -9.2
-0.25764 -9.1
-0.2574 -9.0
-0.25716 -8.9
-0.25691 -8.8
-0.25667 -8.6
-0.25642 -8.5
-0.25618 -8.3
-0.25594 -8.1
-0.25569 -7.9
-0.25545 -7.7
-0.2552 -7.5
-0.25496 -7.3
-0.25471 -7.0
-0.25447 -6.8
-0.25423 -6.5
-0.25398 -6.2
-0.25374 -5.9
-0.25349 -5.6
-0.25325 -5.3
-0.25301 -5.0
-0.25276 -4.6
-0.25252 -4.3
-0.25227 -4.0
-0.25203 -3.6
-0.25179 -3.3
-0.25154 -2.9
-0.2513 -2.5
-0.25105 -2.2
-0.25081 -1.8
-0.25056 -1.4
-0.25032 -1.0
-0.25008 -0.6
-0.24983 -0.3
-0.24959 0.1
-0.24934 0.5
-0.2491 0.9
-0.24886 1.3
-0.24861 1.7
-0.24837 2.0
-0.24812 2.4
-0.24788 2.8
-0.24763 3.2
-0.24739 3.5
-0.24715 3.9
-0.2469 4.2
-0.24666 4.6
-0.24641 4.9
-0.24617 5.2
-0.24593 5.6
-0.24568 5.9
-0.24544 6.2
-0.24519 6.5
-0.24495 6.7
-0.24471 7.0
-0.24446 7.3
-0.24422 7.5
-0.24397 7.8
-0.24373 8.0
-0.24348 8.2
-0.24324 8.4
-0.243 8.6
-0.24275 8.7
-0.24251 8.9
-0.24226 9.0
-0.24202 9.1
-0.24178 9.3
-0.24153 9.3
-0.24129 9.4
-0.24104 9.5
-0.2408 9.5
-0.24055 9.6
-0.24031 9.6
-0.24007 9.6
-0.23982 9.5
-0.23958 9.5
-0.23933 9.5
-0.23909 9.4
-0.23885 9.3
-0.2386 9.2
-0.23836 9.1
-0.23811 9.0
-0.23787 8.8
-0.23763 8.6
-0.23738 8.5
-0.23714 8.3
-0.23689 8.1
-0.23665 7.9
-0.2364 7.6
-0.23616 7.4
-0.23592 7.1
-0.23567 6.8
-0.23543 6.6
-0.23518 6.3
-0.23494 6.0
-0.2347 5.6
-0.23445 5.3
-0.23421 5.0
-0.23396 4.6
-0.23372 4.3
-0.23347 3.9
-0.23323 3.5
-0.23299 3.2
-0.23274 2.8
-0.2325 2.4
-0.23225 2.0
-0.23201 1.6
-0.23177 1.2
-0.23152 0.8
-0.23128 0.4
-0.23103 0.0
-0.23079 -0.4
-0.23055 -0.8
-0.2303 -1.2
-0.23006 -1.6
-0.22981 -2.0
-0.22957 -2.4
-0.22932 -2.8
-0.22908 -3.1
-0.22884 -3.5
-0.22859 -3.9
-0.22835 -4.3
-0.2281 -4.6
-0.22786 -5.0
-0.22762 -5.3
-0.22737 -5.7
-0.22713 -6.0
-0.22688 -6.3
-0.22664 -6.6
-0.22639 -6.9
-0.22615 -7.2
-0.22591 -7.5
-0.22566 -7.7
-0.22542 -8.0
-0.22517 -8.2
-0.22493 -8.4
-0.22469 -8.6
-0.22444 -8.8
-0.2242 -9.0
-0.22395 -9.1
-0.22371 -9.2
-0.22346 -9.4
-0.22322 -9.5
-0.22298 -9.6
-0.22273 -9.6
-0.22249 -9.7
-0.22224 -9.7
-0.222 -9.7
-0.22176 -9.7
-0.22151 -9.7
-0.22127 -9.7
-0.22102 -9.6
-0.22078 -9.6
-0.22054 -9.5
-0.22029 -9.4
-0.22005 -9.3
-0.2198 -9.1
-0.21956 -9.0
-0.21931 -8.8
-0.21907 -8.6
-0.21883 -8.4
-0.21858 -8.2
-0.21834 -8.0
-0.21809 -7.7
-0.21785 -7.5
-0.21761 -7.2
-0.21736 -6.9
-0.21712 -6.6
-0.21687 -6.3
-0.21663 -6.0
-0.21638 -5.7
-0.21614 -5.3
-0.2159 -5.0
-0.21565 -4.6
-0.21541 -4.2
-0.21516 -3.8
-0.21492 -3.4
-0.21468 -3.1
-0.21443 -2.7
-0.21419 -2.2
-0.21394 -1.8
-0.2137 -1.4
-0.21346 -1.0
-0.21321 -0.6
-0.21297 -0.2
-0.21272 0.3
-0.21248 0.7
-0.21223 1.1
-0.21199 1.5
-0.21175 1.9
-0.2115 2.3
-0.21126 2.8
-0.21101 3.2
-0.21077 3.6
-0.21053 4.0
-0.21028 4.3
-0.21004 4.7
-0.20979 5.1
-0.20955 5.5
-0.2093 5.8
-0.20906 6.1
-0.20882 6.5
-0.20857 6.8
-0.20833 7.1
-0.20808 7.4
-0.20784 7.7
-0.2076 7.9
-0.20735 8.2
-0.20711 8.4
-0.20686 8.6
-0.20662 8.8
-0.20638 9.0
-0.20613 9.2
-0.20589 9.4
-0.20564 9.5
-0.2054 9.6
-0.20515 9.7
-0.20491 9.8
-0.20467 9.9
-0.20442 9.9
-0.20418 9.9
-0.20393 9.9
-0.20369 9.9
-0.20345 9.9
-0.2032 9.8
-0.20296 9.8
-0.20271 9.7
-0.20247 9.6
-0.20222 9.5
-0.20198 9.3
-0.20174 9.2
-0.20149 9.0
-0.20125 8.8
-0.201 8.6
-0.20076 8.4
-0.20052 8.1
-0.20027 7.9
-0.20003 7.6
-0.19978 7.3
-0.19954 7.0
-0.1993 6.7
-0.19905 6.3
-0.19881 6.0
-0.19856 5.6
-0.19832 5.3
-0.19807 4.9
-0.19783 4.5
-0.19759 4.1
-0.19734 3.7
-0.1971 3.3
-0.19685 2.9
-0.19661 2.5
-0.19637 2.0
-0.19612 1.6
-0.19588 1.2
-0.19563 0.7
-0.19539 0.3
-0.19514 -0.2
-0.1949 -0.6
-0.19466 -1.1
-0.19441 -1.5
-0.19417 -1.9
-0.19392 -2.4
-0.19368 -2.8
-0.19344 -3.2
-0.19319 -3.6
-0.19295 -4.1
-0.1927 -4.5
-0.19246 -4.9
-0.19221 -5.2
-0.19197 -5.6
-0.19173 -6.0
-0.19148 -6.3
-0.19124 -6.7
-0.19099 -7.0
-0.19075 -7.3
-0.19051 -7.6
-0.19026 -7.9
-0.19002 -8.2
-0.18977 -8.5
-0.18953 -8.7
-0.18929 -8.9
-0.18904 -9.1
-0.1888 -9.3
-0.18855 -9.5
-0.18831 -9.6
-0.18806 -9.8
-0.18782 -9.9
-0.18758 -10.0
-0.18733 -10.0
-0.18709 -10.1
-0.18684 -10.1
-0.1866 -10.1
-0.18636 -10.1
-0.18611 -10.1
-0.18587 -10.0
-0.18562 -10.0
-0.18538 -9.9
-0.18513 -9.8
-0.18489 -9.6
-0.18465 -9.5
-0.1844 -9.3
-0.18416 -9.1
-0.18391 -8.9
-0.18367 -8.7
-0.18343 -8.5
-0.18318 -8.2
-0.18294 -7.9
-0.18269 -7.6
-0.18245 -7.3
-0.18221 -7.0
-0.18196 -6.7
-0.18172 -6.3
-0.18147 -5.9
-0.18123 -5.6
-0.18098 -5.2
-0.18074 -4.8
-0.1805 -4.4
-0.18025 -3.9
-0.18001 -3.5
-0.17976 -3.1
-0.17952 -2.6
-0.17928 -2.2
-0.17903 -1.7
-0.17879 -1.3
-0.17854 -0.8
-0.1783 -0.3
-0.17805 0.1
-0.17781 0.6
-0.17757 1.1
-0.17732 1.5
-0.17708 2.0
-0.17683 2.4
-0.17659 2.9
-0.17635 3.3
-0.1761 3.8
-0.17586 4.2
-0.17561 4.6
-0.17537 5.1
-0.17513 5.5
-0.17488 5.9
-0.17464 6.2
-0.17439 6.6
-0.17415 7.0
-0.1739 7.3
-0.17366 7.6
-0.17342 8.0
-0.17317 8.2
-0.17293 8.5
-0.17268 8.8
-0.17244 9.0
-0.1722 9.2
-0.17195 9.5
-0.17171 9.6
-0.17146 9.8
-0.17122 9.9
-0.17097 10.1
-0.17073 10.2
-0.17049 10.2
-0.17024 10.3
-0.17 10.3
-0.16975 10.3
-0.16951 10.3
-0.16927 10.3
-0.16902 10.3
-0.16878 10.2
-0.16853 10.1
-0.16829 10.0
-0.16805 9.8
-0.1678 9.7
-0.16756 9.5
-0.16731 9.3
-0.16707 9.0
-0.16682 8.8
-0.16658 8.5
-0.16634 8.3
-0.16609 8.0
-0.16585 7.6
-0.1656 7.3
-0.16536 7.0
-0.16512 6.6
-0.16487 6.2
-0.16463 5.8
-0.16438 5.4
-0.16414 5.0
-0.16389 4.5
-0.16365 4.1
-0.16341 3.6
-0.16316 3.2
-0.16292 2.7
-0.16267 2.2
-0.16243 1.8
-0.16219 1.3
-0.16194 0.8
-0.1617 0.3
-0.16145 -0.2
-0.16121 -0.7
-0.16096 -1.2
-0.16072 -1.7
-0.16048 -2.2
-0.16023 -2.6
-0.15999 -3.1
-0.15974 -3.6
-0.1595 -4.0
-0.15926 -4.5
-0.15901 -4.9
-0.15877 -5.4
-0.15852 -5.8
-0.15828 -6.2
-0.15804 -6.6
-0.15779 -7.0
-0.15755 -7.4
-0.1573 -7.7
-0.15706 -8.0
-0.15681 -8.4
-0.15657 -8.7
-0.15633 -8.9
-0.15608 -9.2
-0.15584 -9.4
-0.15559 -9.7
-0.15535 -9.8
-0.15511 -10.0
-0.15486 -10.2
-0.15462 -10.3
-0.15437 -10.4
-0.15413 -10.5
-0.15388 -10.5
-0.15364 -10.6
-0.1534 -10.6
-0.15315 -10.6
-0.15291 -10.5
-0.15266 -10.5
-0.15242 -10.4
-0.15218 -10.3
-0.15193 -10.1
-0.15169 -10.0
-0.15144 -9.8
-0.1512 -9.6
-0.15096 -9.4
-0.15071 -9.1
-0.15047 -8.8
-0.15022 -8.5
-0.14998 -8.2
-0.14973 -7.9
-0.14949 -7.5
-0.14925 -7.2
-0.149 -6.8
-0.14876 -6.4
-0.14851 -6.0
-0.14827 -5.5
-0.14803 -5.1
-0.14778 -4.6
-0.14754 -4.2
-0.14729 -3.7
-0.14705 -3.2
-0.1468 -2.7
-0.14656 -2.2
-0.14632 -1.7
-0.14607 -1.2
-0.14583 -0.6
-0.14558 -0.1
-0.14534 0.4
-0.1451 0.9
-0.14485 1.5
-0.14461 2.0
-0.14436 2.5
-0.14412 3.0
-0.14388 3.5
-0.14363 4.0
-0.14339 4.5
-0.14314 4.9
-0.1429 5.4
-0.14265 5.9
-0.14241 6.3
-0.14217 6.7
-0.14192 7.1
-0.14168 7.5
-0.14143 7.9
-0.14119 8.3
-0.14095 8.6
-0.1407 8.9
-0.14046 9.2
-0.14021 9.5
-0.13997 9.7
-0.13972 9.9
-0.13948 10.1
-0.13924 10.3
-0.13899 10.5
-0.13875 10.6
-0.1385 10.7
-0.13826 10.8
-0.13802 10.8
-0.13777 10.8
-0.13753 10.8
-0.13728 10.8
-0.13704 10.8
-0.1368 10.7
-0.13655 10.6
-0.13631 10.4
-0.13606 10.2
-0.13582 10.1
-0.13557 9.8
-0.13533 9.6
-0.13509 9.3
-0.13484 9.1
-0.1346 8.7
-0.13435 8.4
-0.13411 8.0
-0.13387 7.7
-0.13362 7.3
-0.13338 6.9
-0.13313 6.4
-0.13289 6.0
-0.13264 5.5
-0.1324 5.0
-0.13216 4.5
-0.13191 4.0
-0.13167 3.5
-0.13142 3.0
-0.13118 2.5
-0.13094 1.9
-0.13069 1.4
-0.13045 0.8
-0.1302 0.3
-0.12996 -0.3
-0.12971 -0.9
-0.12947 -1.4
-0.12923 -2.0
-0.12898 -2.5
-0.12874 -3.1
-0.12849 -3.6
-0.12825 -4.1
-0.12801 -4.6
-0.12776 -5.1
-0.12752 -5.6
-0.12727 -6.1
-0.12703 -6.6
-0.12679 -7.0
-0.12654 -7.5
-0.1263 -7.9
-0.12605 -8.3
-0.12581 -8.6
-0.12556 -9.0
-0.12532 -9.3
-0.12508 -9.6
-0.12483 -9.9
-0.12459 -10.1
-0.12434 -10.4
-0.1241 -10.6
-0.12386 -10.7
-0.12361 -10.9
-0.12337 -11.0
-0.12312 -11.1
-0.12288 -11.1
-0.12263 -11.1
-0.12239 -11.1
-0.12215 -11.1
-0.1219 -11.0
-0.12166 -10.9
-0.12141 -10.8
-0.12117 -10.7
-0.12093 -10.5
-0.12068 -10.3
-0.12044 -10.0
-0.12019 -9.8
-0.11995 -9.5
-0.11971 -9.2
-0.11946 -8.8
-0.11922 -8.4
-0.11897 -8.0
-0.11873 -7.6
-0.11848 -7.2
-0.11824 -6.7
-0.118 -6.3
-0.11775 -5.8
-0.11751 -5.2
-0.11726 -4.7
-0.11702 -4.2
-0.11678 -3.6
-0.11653 -3.1
-0.11629 -2.5
-0.11604 -1.9
-0.1158 -1.3
-0.11555 -0.7
-0.11531 -0.1
-0.11507 0.5
-0.11482 1.1
-0.11458 1.7
-0.11433 2.2
-0.11409 2.8
-0.11385 3.4
-0.1136 4.0
-0.11336 4.5
-0.11311 5.1
-0.11287 5.6
-0.11263 6.1
-0.11238 6.6
-0.11214 7.1
-0.11189 7.6
-0.11165 8.0
-0.1114 8.5
-0.11116 8.9
-0.11092 9.2
-0.11067 9.6
-0.11043 9.9
-0.11018 10.2
-0.10994 10.5
-0.1097 10.7
-0.10945 10.9
-0.10921 11.1
-0.10896 11.2
-0.10872 11.3
-0.10847 11.4
-0.10823 11.5
-0.10799 11.5
-0.10774 11.4
-0.1075 11.4
-0.10725 11.3
-0.10701 11.2
-0.10677 11.0
-0.10652 10.8
-0.10628 10.6
-0.10603 10.4
-0.10579 10.1
-0.10555 9.8
-0.1053 9.4
-0.10506 9.0
-0.10481 8.6
-0.10457 8.2
-0.10432 7.8
-0.10408 7.3
-0.10384 6.8
-0.10359 6.3
-0.10335 5.7
-0.1031 5.2
-0.10286 4.6
-0.10262 4.0
-0.10237 3.4
-0.10213 2.8
-0.10188 2.2
-0.10164 1.5
-0.10139 0.9
-0.10115 0.3
-0.10091 -0.4
-0.10066 -1.0
-0.10042 -1.7
-0.10017 -2.3
-0.09993 -2.9
-0.09969 -3.6
-0.09944 -4.2
-0.0992 -4.8
-0.09895 -5.4
-0.09871 -5.9
-0.09846 -6.5
-0.09822 -7.0
-0.09798 -7.5
-0.09773 -8.0
-0.09749 -8.5
-0.09724 -9.0
-0.097 -9.4
-0.09676 -9.8
-0.09651 -10.1
-0.09627 -10.4
-0.09602 -10.7
-0.09578 -11.0
-0.09554 -11.2
-0.09529 -11.4
-0.09505 -11.6
-0.0948 -11.7
-0.09456 -11.8
-0.09431 -11.8
-0.09407 -11.8
-0.09383 -11.8
-0.09358 -11.7
-0.09334 -11.6
-0.09309 -11.5
-0.09285 -11.3
-0.09261 -11.1
-0.09236 -10.8
-0.09212 -10.5
-0.09187 -10.2
-0.09163 -9.9
-0.09138 -9.5
-0.09114 -9.0
-0.0909 -8.6
-0.09065 -8.1
-0.09041 -7.6
-0.09016 -7.1
-0.08992 -6.5
-0.08968 -5.9
-0.08943 -5.3
-0.08919 -4.7
-0.08894 -4.0
-0.0887 -3.4
-0.08846 -2.7
-0.08821 -2.0
-0.08797 -1.3
-0.08772 -0.6
-0.08748 0.0
-0.08723 0.8
-0.08699 1.4
-0.08675 2.1
-0.0865 2.8
-0.08626 3.5
-0.08601 4.2
-0.08577 4.8
-0.08553 5.5
-0.08528 6.1
-0.08504 6.7
-0.08479 7.3
-0.08455 7.9
-0.0843 8.4
-0.08406 8.9
-0.08382 9.4
-0.08357 9.8
-0.08333 10.2
-0.08308 10.6
-0.08284 11.0
-0.0826 11.3
-0.08235 11.5
-0.08211 11.8
-0.08186 11.9
-0.08162 12.1
-0.08138 12.2
-0.08113 12.2
-0.08089 12.3
-0.08064 12.2
-0.0804 12.2
-0.08015 12.0
-0.07991 11.9
-0.07967 11.7
-0.07942 11.4
-0.07918 11.1
-0.07893 10.8
-0.07869 10.4
-0.07845 10.0
-0.0782 9.6
-0.07796 9.1
-0.07771 8.6
-0.07747 8.0
-0.07722 7.5
-0.07698 6.9
-0.07674 6.2
-0.07649 5.6
-0.07625 4.9
-0.076 4.2
-0.07576 3.5
-0.07552 2.7
-0.07527 2.0
-0.07503 1.2
-0.07478 0.5
-0.07454 -0.3
-0.0743 -1.1
-0.07405 -1.8
-0.07381 -2.6
-0.07356 -3.3
-0.07332 -4.1
-0.07307 -4.8
-0.07283 -5.5
-0.07259 -6.2
-0.07234 -6.9
-0.0721 -7.5
-0.07185 -8.1
-0.07161 -8.7
-0.07137 -9.3
-0.07112 -9.8
-0.07088 -10.3
-0.07063 -10.7
-0.07039 -11.1
-0.07014 -11.5
-0.0699 -11.8
-0.06966 -12.1
-0.06941 -12.3
-0.06917 -12.5
-0.06892 -12.6
-0.06868 -12.7
-0.06844 -12.7
-0.06819 -12.7
-0.06795 -12.6
-0.0677 -12.5
-0.06746 -12.3
-0.06721 -12.1
-0.06697 -11.8
-0.06673 -11.5
-0.06648 -11.1
-0.06624 -10.7
-0.06599 -10.3
-0.06575 -9.8
-0.06551 -9.2
-0.06526 -8.6
-0.06502 -8.0
-0.06477 -7.3
-0.06453 -6.6
-0.06429 -5.9
-0.06404 -5.2
-0.0638 -4.4
-0.06355 -3.6
-0.06331 -2.8
-0.06306 -2.0
-0.06282 -1.1
-0.06258 -0.3
-0.06233 0.6
-0.06209 1.4
-0.06184 2.3
-0.0616 3.1
-0.06136 3.9
-0.06111 4.8
-0.06087 5.6
-0.06062 6.3
-0.06038 7.1
-0.06013 7.8
-0.05989 8.5
-0.05965 9.1
-0.0594 9.8
-0.05916 10.3
-0.05891 10.9
-0.05867 11.4
-0.05843 11.8
-0.05818 12.2
-0.05794 12.5
-0.05769 12.8
-0.05745 13.0
-0.05721 13.2
-0.05696 13.3
-0.05672 13.3
-0.05647 13.3
-0.05623 13.2
-0.05598 13.1
-0.05574 12.9
-0.0555 12.6
-0.05525 12.3
-0.05501 11.9
-0.05476 11.5
-0.05452 11.0
-0.05428 10.5
-0.05403 9.9
-0.05379 9.2
-0.05354 8.5
-0.0533 7.8
-0.05305 7.0
-0.05281 6.2
-0.05257 5.4
-0.05232 4.5
-0.05208 3.6
-0.05183 2.7
-0.05159 1.7
-0.05135 0.8
-0.0511 -0.2
-0.05086 -1.1
-0.05061 -2.1
-0.05037 -3.0
-0.05013 -4.0
-0.04988 -4.9
-0.04964 -5.8
-0.04939 -6.7
-0.04915 -7.5
-0.0489 -8.3
-0.04866 -9.1
-0.04842 -9.8
-0.04817 -10.5
-0.04793 -11.1
-0.04768 -11.7
-0.04744 -12.2
-0.0472 -12.7
-0.04695 -13.1
-0.04671 -13.4
-0.04646 -13.7
-0.04622 -13.9
-0.04597 -14.0
-0.04573 -14.0
-0.04549 -14.0
-0.04524 -13.9
-0.045 -13.7
-0.04475 -13.4
-0.04451 -13.1
-0.04427 -12.7
-0.04402 -12.2
-0.04378 -11.7
-0.04353 -11.1
-0.04329 -10.4
-0.04305 -9.7
-0.0428 -8.9
-0.04256 -8.0
-0.04231 -7.1
-0.04207 -6.2
-0.04182 -5.2
-0.04158 -4.2
-0.04134 -3.2
-0.04109 -2.1
-0.04085 -1.0
-0.0406 0.0
-0.04036 1.2
-0.04012 2.3
-0.03987 3.4
-0.03963 4.4
-0.03938 5.5
-0.03914 6.5
-0.03889 7.5
-0.03865 8.5
-0.03841 9.4
-0.03816 10.2
-0.03792 11.0
-0.03767 11.8
-0.03743 12.4
-0.03719 13.0
-0.03694 13.6
-0.0367 14.0
-0.03645 14.4
-0.03621 14.6
-0.03596 14.8
-0.03572 14.9
-0.03548 14.9
-0.03523 14.8
-0.03499 14.6
-0.03474 14.3
-0.0345 13.9
-0.03426 13.4
-0.03401 12.8
-0.03377 12.1
-0.03352 11.4
-0.03328 10.6
-0.03304 9.7
-0.03279 8.7
-0.03255 7.6
-0.0323 6.5
-0.03206 5.4
-0.03181 4.2
-0.03157 3.0
-0.03133 1.7
-0.03108 0.4
-0.03084 -0.9
-0.03059 -2.2
-0.03035 -3.5
-0.03011 -4.7
-0.02986 -6.0
-0.02962 -7.2
-0.02937 -8.4
-0.02913 -9.5
-0.02888 -10.5
-0.02864 -11.5
-0.0284 -12.4
-0.02815 -13.2
-0.02791 -14.0
-0.02766 -14.6
-0.02742 -15.1
-0.02718 -15.5
-0.02693 -15.8
-0.02669 -15.9
-0.02644 -16.0
-0.0262 -15.9
-0.02596 -15.7
-0.02571 -15.3
-0.02547 -14.9
-0.02522 -14.3
-0.02498 -13.5
-0.02473 -12.7
-0.02449 -11.8
-0.02425 -10.7
-0.024 -9.5
-0.02376 -8.3
-0.02351 -7.0
-0.02327 -5.6
-0.02303 -4.1
-0.02278 -2.6
-0.02254 -1.0
-0.02229 0.5
-0.02205 2.1
-0.0218 3.7
-0.02156 5.3
-0.02132 6.8
-0.02107 8.3
-0.02083 9.7
-0.02058 11.0
-0.02034 12.2
-0.0201 13.4
-0.01985 14.4
-0.01961 15.3
-0.01936 16.0
-0.01912 16.6
-0.01888 17.1
-0.01863 17.3
-0.01839 17.4
-0.01814 17.3
-0.0179 17.1
-0.01765 16.6
-0.01741 16.0
-0.01717 15.1
-0.01692 14.1
-0.01668 13.0
-0.01643 11.7
-0.01619 10.2
-0.01595 8.6
-0.0157 6.8
-0.01546 5.0
-0.01521 3.1
-0.01497 1.1
-0.01472 -0.9
-0.01448 -2.9
-0.01424 -4.9
-0.01399 -6.9
-0.01375 -8.8
-0.0135 -10.7
-0.01326 -12.4
-0.01302 -14.0
-0.01277 -15.4
-0.01253 -16.7
-0.01228 -17.7
-0.01204 -18.5
-0.0118 -19.1
-0.01155 -19.3
-0.01131 -19.4
-0.01106 -19.1
-0.01082 -18.5
-0.01057 -17.6
-0.01033 -16.5
-0.01009 -15.1
-0.00984 -13.4
-0.0096 -11.4
-0.00935 -9.3
-0.00911 -6.9
-0.00887 -4.3
-0.00862 -1.7
-0.00838 1.1
-0.00813 3.8
-0.00789 6.6
-0.00764 9.3
-0.0074 11.9
-0.00716 14.3
-0.00691 16.5
-0.00667 18.4
-0.00642 19.9
-0.00618 21.1
-0.00594 21.8
-0.00569 22.0
-0.00545 21.8
-0.0052 21.0
-0.00496 19.7
-0.00471 17.9
-0.00447 15.6
-0.00423 12.8
-0.00398 9.5
-0.00374 5.9
-0.00349 2.1
-0.00325 -2.0
-0.00301 -6.1
-0.00276 -10.2
-0.00252 -14.0
-0.00227 -17.6
-0.00203 -20.6
-0.00179 -22.9
-0.00154 -24.5
-0.0013 -25.1
-0.00105 -24.7
-0.00081 -23.2
-0.00056 -20.5
-0.00032 -16.6
-8e-05 -11.8
0.00017 -6.1
0.00041 0.0
0.00066 6.4
0.0009 12.3
0.00114 17.5
0.00139 21.4
0.00163 23.7
0.00188 24.2
0.00212 22.7
0.00237 19.3
0.00261 14.4
0.00285 8.3
0.0031 1.7
0.00334 -4.8
0.00359 -10.5
0.00383 -14.8
0.00407 -17.4
0.00432 -18.1
0.00456 -16.9
0.00481 -14.0
0.00505 -9.8
0.00529 -5.0
0.00554 0.0
0.00578 4.6
0.00603 8.2
0.00627 10.6
0.00652 11.6
0.00676 11.1
0.007 9.4
0.00725 6.8
0.00749 3.6
0.00774 0.4
0.00798 -2.6
0.00822 -4.9
0.00847 -6.4
0.00871 -7.0
0.00896 -6.7
0.0092 -5.6
0.00945 -3.9
0.00969 -1.9
0.00993 0.0
0.01018 1.8
0.01042 3.2
0.01067 4.0
0.01091 4.2
0.01115 3.9
0.0114 3.1
0.01164 2.0
0.01189 0.8
0.01213 -0.4
0.01237 -1.4
0.01262 -2.1
0.01286 -2.5
0.01311 -2.5
0.01335 -2.2
0.0136 -1.7
0.01384 -1.0
0.01408 -0.3
0.01433 0.4
0.01457 1.0
0.01482 1.4
0.01506 1.5
0.0153 1.5
0.01555 1.3
0.01579 0.9
0.01604 0.4
0.01628 0.0
0.01653 -0.4
0.01677 -0.7
0.01701 -0.9
0.01726 -0.9
0.0175 -0.9
0.01775 -0.7
0.01799 -0.5
0.01823 -0.2
0.01848 0.0
0.01872 0.3
0.01897 0.5
0.01921 0.6
0.01945 0.6
0.0197 0.5
0.01994 0.4
0.02019 0.2
0.02043 0.0
0.02068 -0.1
0.02092 -0.2
0.02116 -0.3
0.02141 -0.4
0.02165 -0.3
0.0219 -0.3
0.02214 -0.2
0.02238 0.0
0.02263 0.0
0.02287 0.0
0.02312 0.2
0.02336 0.2
0.02361 0.2
0.02385 0.2
0.02409 0.2
0.02434 0.0
0.02458 0.0
0.02483 0.0
0.02507 0.0
0.02531 -0.1
0.02556 -0.1
0.0258 -0.1
0.02605 -0.1
0.02629 0.0
0.02654 0.0
0.02678 0.0
0.02702 0.0
0.02727 0.0
0.02751 0.0
0.02776 0.0
0.028 0.0
0.02824 0.0
0.02849 0.0
0.02873 0.0
0.02898 0.0
0.02922 0.0
0.02946 0.0
0.02971 0.0
0.02995 0.0
0.0302 0.0
0.03044 0.0
0.03069 0.0
0.03093 0.0
0.03117 0.0
0.03142 0.0
0.03166 0.0
0.03191 0.0
0.03215 0.0
0.03239 0.0
0.03264 0.0
0.03288 0.0
0.03313 0.0
0.03337 0.0
0.03362 0.0
0.03386 0.0
0.0341 0.0
0.03435 0.0
0.03459 0.0
0.03484 0.0
0.03508 0.0
0.03532 0.0
0.03557 0.0
0.03581 0.0
0.03606 0.0
0.0363 0.0
0.03654 0.0
0.03679 0.0
0.03703 0.0
0.03728 0.0
0.03752 0.0
0.03777 0.0
0.03801 0.0
0.03825 0.0
0.0385 0.0
0.03874 0.0
0.03899 0.0
0.03923 0.0
0.03947 0.0
0.03972 0.0
0.03996 0.0
0.04021 0.0
0.04045 0.0
0.0407 0.0
0.04094 0.0
0.04118 0.0
0.04143 0.0
0.04167 0.0
0.04192 0.0
0.04216 0.0
0.0424 0.0
0.04265 0.0
0.04289 0.0
0.04314 0.0
0.04338 0.0
0.04362 0.0
0.04387 0.0
0.04411 0.0
0.04436 0.0
0.0446 0.0
0.04485 0.0
0.04509 0.0
0.04533 0.0
0.04558 0.0
0.04582 0.0
0.04607 0.0
0.04631 0.0
0.04655 0.0
0.0468 0.0
0.04704 0.0
0.04729 0.0
0.04753 0.0
0.04778 0.0
0.04802 0.0
0.04826 0.0
0.04851 0.0
0.04875 0.0
0.049 0.0
0.04924 0.0
0.04948 0.0
0.04973 0.0
0.04997 0.0
0.05022 0.0
0.05046 0.0
0.0507 0.0
0.05095 0.0
0.05119 0.0
0.05144 0.0
0.05168 0.0
0.05193 0.0
0.05217 0.0
0.05241 0.0
0.05266 0.0
0.0529 0.0
0.05315 0.0
0.05339 0.0
0.05363 0.0
0.05388 0.0
0.05412 0.0
0.05437 0.0
0.05461 0.0
0.05486 0.0
0.0551 0.0
0.05534 0.0
0.05559 0.0
0.05583 0.0
0.05608 0.0
0.05632 0.0
0.05656 0.0
0.05681 0.0
0.05705 0.0
0.0573 0.0
0.05754 0.0
0.05779 0.0
0.05803 0.0
0.05827 0.0
0.05852 0.0
0.05876 0.0
0.05901 0.0
0.05925 0.0
0.05949 0.0
0.05974 0.0
0.05998 0.0
0.06023 0.0
0.06047 0.0
0.06071 0.0
0.06096 0.0
0.0612 0.0
0.06145 0.0
0.06169 0.0
0.06194 0.0
0.06218 0.0
0.06242 0.0
0.06267 0.0
0.06291 0.0
0.06316 0.0
0.0634 0.0
0.06364 0.0
0.06389 0.0
0.06413 0.0
0.06438 0.0
0.06462 0.0
0.06487 0.0
0.06511 0.0
0.06535 0.0
0.0656 0.0
0.06584 0.0
0.06609 0.0
0.06633 0.0
0.06657 0.0
0.06682 0.0
0.06706 0.0
0.06731 0.0
0.06755 0.0
0.06779 0.0
0.06804 0.0
0.06828 0.0
0.06853 0.0
0.06877 0.0
0.06902 0.0
0.06926 0.0
0.0695 0.0
0.06975 0.0
0.06999 0.0
0.07024 0.0
0.07048 0.0
0.07072 0.0
0.07097 0.0
0.07121 0.0
0.07146 0.0
0.0717 0.0
0.07195 0.0
0.07219 0.0
0.07243 0.0
0.07268 0.0
0.07292 0.0
0.07317 0.0
0.07341 0.0
0.07365 0.0
0.0739 0.0
0.07414 0.0
0.07439 0.0
0.07463 0.0
0.07487 0.0
0.07512 0.0
0.07536 0.0
0.07561 0.0
0.07585 0.0
0.0761 0.0
0.07634 0.0
0.07658 0.0
0.07683 0.0
0.07707 0.0
0.07732 0.0
0.07756 0.0
0.0778 0.0
0.07805 0.0
0.07829 0.0
0.07854 0.0
0.07878 0.0
0.07903 0.0
0.07927 0.0
0.07951 0.0
0.07976 0.0
0.08 0.0
0.08025 0.0
0.08049 0.0
0.08073 0.0
0.08098 0.0
0.08122 0.0
0.08147 0.0
0.08171 0.0
0.08195 0.0
0.0822 0.0
0.08244 0.0
0.08269 0.0
0.08293 0.0
0.08318 0.0
0.08342 0.0
0.08366 0.0
0.08391 0.0
0.08415 0.0
0.0844 0.0
0.08464 0.0
0.08488 0.0
0.08513 0.0
0.08537 0.0
0.08562 0.0
0.08586 0.0
0.08611 0.0
0.08635 0.0
0.08659 0.0
0.08684 0.0
0.08708 0.0
0.08733 0.0
0.08757 0.0
0.08781 0.0
0.08806 0.0
0.0883 0.0
0.08855 0.0
0.08879 0.0
0.08904 0.0
0.08928 0.0
0.08952 0.0
0.08977 0.0
0.09001 0.0
0.09026 0.0
0.0905 0.0
0.09074 0.0
0.09099 0.0
0.09123 0.0
0.09148 0.0
0.09172 0.0
0.09196 0.0
0.09221 0.0
0.09245 0.0
0.0927 0.0
0.09294 0.0
0.09319 0.0
0.09343 0.0
0.09367 0.0
0.09392 0.0
0.09416 0.0
0.09441 0.0
0.09465 0.0
0.09489 0.0
0.09514 0.0
0.09538 0.0
0.09563 0.0
0.09587 0.0
0.09612 0.0
0.09636 0.0
0.0966 0.0
0.09685 0.0
0.09709 0.0
0.09734 0.0
0.09758 0.0
0.09782 0.0
0.09807 0.0
0.09831 0.0
0.09856 0.0
0.0988 0.0
0.09904 0.0
0.09929 0.0
0.09953 0.0
0.09978 0.0
0.10002 0.0
0.10027 0.0
0.10051 0.0
0.10075 0.0
0.101 0.0
0.10124 0.0
0.10149 0.0
0.10173 0.0
0.10197 0.0
0.10222 0.0
0.10246 0.0
0.10271 0.0
0.10295 0.0
0.1032 0.0
0.10344 0.0
0.10368 0.0
0.10393 0.0
0.10417 0.0
0.10442 0.0
0.10466 0.0
0.1049 0.0
0.10515 0.0
0.10539 0.0
0.10564 0.0
0.10588 0.0
0.10612 0.0
0.10637 0.0
0.10661 0.0
0.10686 0.0
0.1071 0.0
0.10735 0.0
0.10759 0.0
0.10783 0.0
0.10808 0.0
0.10832 0.0
0.10857 0.0
0.10881 0.0
0.10905 0.0
0.1093 0.0
0.10954 0.0
0.10979 0.0
0.11003 0.0
0.11028 0.0
0.11052 0.0
0.11076 0.0
0.11101 0.0
0.11125 0.0
0.1115 0.0
0.11174 0.0
0.11198 0.0
0.11223 0.0
0.11247 0.0
0.11272 0.0
0.11296 0.0
0.1132 0.0
0.11345 0.0
0.11369 0.0
0.11394 0.0
0.11418 0.0
0.11443 0.0
0.11467 0.0
0.11491 0.0
0.11516 0.0
0.1154 0.0
0.11565 0.0
0.11589 0.0
0.11613 0.0
0.11638 0.0
0.11662 0.0
0.11687 0.0
0.11711 0.0
0.11736 0.0
0.1176 0.0
0.11784 0.0
0.11809 0.0
0.11833 0.0
0.11858 0.0
0.11882 0.0
0.11906 0.0
0.11931 0.0
0.11955 0.0
0.1198 0.0
0.12004 0.0
0.12029 0.0
0.12053 0.0
0.12077 0.0
0.12102 0.0
0.12126 0.0
0.12151 0.0
0.12175 0.0
0.12199 0.0
0.12224 0.0
0.12248 0.0
0.12273 0.0
0.12297 0.0
0.12321 0.0
0.12346 0.0
0.1237 0.0
0.12395 0.0
0.12419 0.0
0.12444 0.0
0.12468 0.0
0.12492 0.0
0.12517 0.0
0.12541 0.0
0.12566 0.0
0.1259 0.0
0.12614 0.0
0.12639 0.0
0.12663 0.0
0.12688 0.0
0.12712 0.0
0.12737 0.0
0.12761 0.0
0.12785 0.0
0.1281 0.0
0.12834 0.0
0.12859 0.0
0.12883 0.0
0.12907 0.0
0.12932 0.0
0.12956 0.0
0.12981 0.0
0.13005 0.0
0.13029 0.0
0.13054 0.0
0.13078 0.0
0.13103 0.0
0.13127 0.0
0.13152 0.0
0.13176 0.0
0.132 0.0
0.13225 0.0
0.13249 0.0
0.13274 0.0
0.13298 0.0
0.13322 0.0
0.13347 0.0
0.13371 0.0
0.13396 0.0
0.1342 0.0
0.13445 0.0
0.13469 0.0
0.13493 0.0
0.13518 0.0
0.13542 0.0
0.13567 0.0
0.13591 0.0
0.13615 0.0
0.1364 0.0
0.13664 0.0
0.13689 0.0
0.13713 0.0
0.13737 0.0
0.13762 0.0
0.13786 0.0
0.13811 0.0
0.13835 0.0
0.1386 0.0
0.13884 0.0
0.13908 0.0
0.13933 0.0
0.13957 0.0
0.13982 0.0
0.14006 0.0
0.1403 0.0
0.14055 0.0
0.14079 0.0
0.14104 0.0
0.14128 0.0
0.14153 0.0
0.14177 0.0
0.14201 0.0
0.14226 0.0
0.1425 0.0
0.14275 0.0
0.14299 0.0
0.14323 0.0
0.14348 0.0
0.14372 0.0
0.14397 0.0
0.14421 0.0
0.14445 0.0
0.1447 0.0
0.14494 0.0
0.14519 0.0
0.14543 0.0
0.14568 0.0
0.14592 0.0
0.14616 0.0
0.14641 0.0
0.14665 0.0
0.1469 0.0
0.14714 0.0
0.14738 0.0
0.14763 0.0
0.14787 0.0
0.14812 0.0
0.14836 0.0
0.14861 0.0
0.14885 0.0
0.14909 0.0
0.14934 0.0
0.14958 0.0
0.14983 0.0
0.15007 0.0
0.15031 0.0
0.15056 0.0
0.1508 0.0
0.15105 0.0
0.15129 0.0
0.15154 0.0
0.15178 0.0
0.15202 0.0
0.15227 0.0
0.15251 0.0
0.15276 0.0
0.153 0.0
0.15324 0.0
0.15349 0.0
0.15373 0.0
0.15398 0.0
0.15422 0.0
0.15446 0.0
0.15471 0.0
0.15495 0.0
0.1552 0.0
0.15544 0.0
0.15569 0.0
0.15593 0.0
0.15617 0.0
0.15642 0.0
0.15666 0.0
0.15691 0.0
0.15715 0.0
0.15739 0.0
0.15764 0.0
0.15788 0.0
0.15813 0.0
0.15837 0.0
0.15862 0.0
0.15886 0.0
0.1591 0.0
0.15935 0.0
0.15959 0.0
0.15984 0.0
0.16008 0.0
0.16032 0.0
0.16057 0.0
0.16081 0.0
0.16106 0.0
0.1613 0.0
0.16154 0.0
0.16179 0.0
0.16203 0.0
0.16228 0.0
0.16252 0.0
0.16277 0.0
0.16301 0.0
0.16325 0.0
0.1635 0.0
0.16374 0.0
0.16399 0.0
0.16423 0.0
0.16447 0.0
0.16472 0.0
0.16496 0.0
0.16521 0.0
0.16545 0.0
0.1657 0.0
0.16594 0.0
0.16618 0.0
0.16643 0.0
0.16667 0.0
0.16692 0.0
0.16716 0.0
0.1674 0.0
0.16765 0.0
0.16789 0.0
0.16814 0.0
0.16838 0.0
0.16862 0.0
0.16887 0.0
0.16911 0.0
0.16936 0.0
0.1696 0.0
0.16985 0.0
0.17009 0.0
0.17033 0.0
0.17058 0.0
0.17082 0.0
0.17107 0.0
0.17131 0.0
0.17155 0.0
0.1718 0.0
0.17204 0.0
0.17229 0.0
