t strain*1e23
-0.37885 1.4
-0.37861 1.1
-0.37836 0.8
-0.37812 0.5
-0.37788 0.3
-0.37763 0.0
-0.37739 -0.3
-0.37714 -0.6
-0.3769 -0.8
-0.37666 -1.1
-0.37641 -1.4
-0.37617 -1.7
-0.37592 -1.9
-0.37568 -2.2
-0.37543 -2.5
-0.37519 -2.7
-0.37495 -3.0
-0.3747 -3.3
-0.37446 -3.5
-0.37421 -3.8
-0.37397 -4.0
-0.37373 -4.2
-0.37348 -4.5
-0.37324 -4.7
-0.37299 -4.9
-0.37275 -5.2
-0.37251 -5.4
-0.37226 -5.6
-0.37202 -5.8
-0.37177 -6.0
-0.37153 -6.2
-0.37128 -6.3
-0.37104 -6.5
-0.3708 -6.7
-0.37055 -6.8
-0.37031 -7.0
-0.37006 -7.1
-0.36982 -7.3
-0.36958 -7.4
-0.36933 -7.5
-0.36909 -7.6
-0.36884 -7.7
-0.3686 -7.8
-0.36835 -7.9
-0.36811 -8.0
-0.36787 -8.0
-0.36762 -8.1
-0.36738 -8.1
-0.36713 -8.2
-0.36689 -8.2
-0.36665 -8.2
-0.3664 -8.2
-0.36616 -8.2
-0.36591 -8.2
-0.36567 -8.2
-0.36543 -8.1
-0.36518 -8.1
-0.36494 -8.0
-0.36469 -8.0
-0.36445 -7.9
-0.3642 -7.8
-0.36396 -7.7
-0.36372 -7.6
-0.36347 -7.5
-0.36323 -7.4
-0.36298 -7.3
-0.36274 -7.2
-0.3625 -7.0
-0.36225 -6.9
-0.36201 -6.7
-0.36176 -6.5
-0.36152 -6.4
-0.36127 -6.2
-0.36103 -6.0
-0.36079 -5.8
-0.36054 -5.6
-0.3603 -5.4
-0.36005 -5.2
-0.35981 -4.9
-0.35957 -4.7
-0.35932 -4.5
-0.35908 -4.2
-0.35883 -4.0
-0.35859 -3.7
-0.35835 -3.5
-0.3581 -3.2
-0.35786 -3.0
-0.35761 -2.7
-0.35737 -2.4
-0.35712 -2.2
-0.35688 -1.9
-0.35664 -1.6
-0.35639 -1.3
-0.35615 -1.0
-0.3559 -0.8
-0.35566 -0.5
-0.35542 -0.2
-0.35517 0.0
-0.35493 0.4
-0.35468 0.7
-0.35444 1.0
-0.35419 1.2
-0.35395 1.5
-0.35371 1.8
-0.35346 2.1
-0.35322 2.4
-0.35297 2.6
-0.35273 2.9
-0.35249 3.2
-0.35224 3.4
-0.352 3.7
-0.35175 3.9
-0.35151 4.2
-0.35126 4.4
-0.35102 4.7
-0.35078 4.9
-0.35053 5.2
-0.35029 5.4
-0.35004 5.6
-0.3498 5.8
-0.34956 6.0
-0.34931 6.2
-0.34907 6.4
-0.34882 6.6
-0.34858 6.7
-0.34834 6.9
-0.34809 7.1
-0.34785 7.2
-0.3476 7.4
-0.34736 7.5
-0.34711 7.6
-0.34687 7.7
-0.34663 7.8
-0.34638 7.9
-0.34614 8.0
-0.34589 8.1
-0.34565 8.1
-0.34541 8.2
-0.34516 8.2
-0.34492 8.3
-0.34467 8.3
-0.34443 8.3
-0.34418 8.3
-0.34394 8.3
-0.3437 8.3
-0.34345 8.3
-0.34321 8.2
-0.34296 8.2
-0.34272 8.1
-0.34248 8.1
-0.34223 8.0
-0.34199 7.9
-0.34174 7.8
-0.3415 7.7
-0.34126 7.6
-0.34101 7.5
-0.34077 7.3
-0.34052 7.2
-0.34028 7.0
-0.34003 6.9
-0.33979 6.7
-0.33955 6.5
-0.3393 6.3
-0.33906 6.1
-0.33881 5.9
-0.33857 5.7
-0.33833 5.5
-0.33808 5.3
-0.33784 5.1
-0.33759 4.8
-0.33735 4.6
-0.3371 4.3
-0.33686 4.1
-0.33662 3.8
-0.33637 3.6
-0.33613 3.3
-0.33588 3.0
-0.33564 2.8
-0.3354 2.5
-0.33515 2.2
-0.33491 1.9
-0.33466 1.6
-0.33442 1.3
-0.33418 1.0
-0.33393 0.7
-0.33369 0.4
-0.33344 0.1
-0.3332 -0.2
-0.33295 -0.4
-0.33271 -0.7
-0.33247 -1.0
-0.33222 -1.3
-0.33198 -1.6
-0.33173 -1.9
-0.33149 -2.2
-0.33125 -2.5
-0.331 -2.8
-0.33076 -3.0
-0.33051 -3.3
-0.33027 -3.6
-0.33002 -3.9
-0.32978 -4.1
-0.32954 -4.4
-0.32929 -4.6
-0.32905 -4.9
-0.3288 -5.1
-0.32856 -5.4
-0.32832 -5.6
-0.32807 -5.8
-0.32783 -6.0
-0.32758 -6.2
-0.32734 -6.4
-0.3271 -6.6
-0.32685 -6.8
-0.32661 -7.0
-0.32636 -7.1
-0.32612 -7.3
-0.32587 -7.4
-0.32563 -7.6
-0.32539 -7.7
-0.32514 -7.8
-0.3249 -7.9
-0.32465 -8.0
-0.32441 -8.1
-0.32417 -8.2
-0.32392 -8.3
-0.32368 -8.3
-0.32343 -8.4
-0.32319 -8.4
-0.32294 -8.4
-0.3227 -8.4
-0.32246 -8.4
-0.32221 -8.4
-0.32197 -8.4
-0.32172 -8.4
-0.32148 -8.3
-0.32124 -8.3
-0.32099 -8.2
-0.32075 -8.2
-0.3205 -8.1
-0.32026 -8.0
-0.32001 -7.9
-0.31977 -7.8
-0.31953 -7.6
-0.31928 -7.5
-0.31904 -7.4
-0.31879 -7.2
-0.31855 -7.1
-0.31831 -6.9
-0.31806 -6.7
-0.31782 -6.5
-0.31757 -6.3
-0.31733 -6.1
-0.31709 -5.9
-0.31684 -5.7
-0.3166 -5.5
-0.31635 -5.2
-0.31611 -5.0
-0.31586 -4.7
-0.31562 -4.5
-0.31538 -4.2
-0.31513 -3.9
-0.31489 -3.7
-0.31464 -3.4
-0.3144 -3.1
-0.31416 -2.8
-0.31391 -2.5
-0.31367 -2.2
-0.31342 -2.0
-0.31318 -1.7
-0.31293 -1.3
-0.31269 -1.0
-0.31245 -0.7
-0.3122 -0.4
-0.31196 -0.1
-0.31171 0.2
-0.31147 0.5
-0.31123 0.8
-0.31098 1.1
-0.31074 1.4
-0.31049 1.7
-0.31025 2.0
-0.31001 2.3
-0.30976 2.6
-0.30952 2.9
-0.30927 3.2
-0.30903 3.5
-0.30878 3.7
-0.30854 4.0
-0.3083 4.3
-0.30805 4.6
-0.30781 4.8
-0.30756 5.1
-0.30732 5.3
-0.30708 5.6
-0.30683 5.8
-0.30659 6.0
-0.30634 6.2
-0.3061 6.4
-0.30585 6.6
-0.30561 6.8
-0.30537 7.0
-0.30512 7.2
-0.30488 7.4
-0.30463 7.5
-0.30439 7.7
-0.30415 7.8
-0.3039 7.9
-0.30366 8.0
-0.30341 8.1
-0.30317 8.2
-0.30293 8.3
-0.30268 8.4
-0.30244 8.4
-0.30219 8.5
-0.30195 8.5
-0.3017 8.5
-0.30146 8.6
-0.30122 8.6
-0.30097 8.6
-0.30073 8.5
-0.30048 8.5
-0.30024 8.5
-0.3 8.4
-0.29975 8.3
-0.29951 8.3
-0.29926 8.2
-0.29902 8.1
-0.29877 8.0
-0.29853 7.9
-0.29829 7.7
-0.29804 7.6
-0.2978 7.4
-0.29755 7.3
-0.29731 7.1
-0.29707 6.9
-0.29682 6.7
-0.29658 6.5
-0.29633 6.3
-0.29609 6.1
-0.29585 5.9
-0.2956 5.6
-0.29536 5.4
-0.29511 5.1
-0.29487 4.9
-0.29462 4.6
-0.29438 4.4
-0.29414 4.1
-0.29389 3.8
-0.29365 3.5
-0.2934 3.2
-0.29316 2.9
-0.29292 2.6
-0.29267 2.3
-0.29243 2.0
-0.29218 1.7
-0.29194 1.4
-0.29169 1.1
-0.29145 0.8
-0.29121 0.4
-0.29096 0.1
-0.29072 -0.2
-0.29047 -0.5
-0.29023 -0.8
-0.28999 -1.2
-0.28974 -1.5
-0.2895 -1.8
-0.28925 -2.1
-0.28901 -2.4
-0.28876 -2.7
-0.28852 -3.0
-0.28828 -3.3
-0.28803 -3.6
-0.28779 -3.9
-0.28754 -4.2
-0.2873 -4.5
-0.28706 -4.7
-0.28681 -5.0
-0.28657 -5.3
-0.28632 -5.5
-0.28608 -5.8
-0.28584 -6.0
-0.28559 -6.2
-0.28535 -6.5
-0.2851 -6.7
-0.28486 -6.9
-0.28461 -7.1
-0.28437 -7.2
-0.28413 -7.4
-0.28388 -7.6
-0.28364 -7.7
-0.28339 -7.9
-0.28315 -8.0
-0.28291 -8.1
-0.28266 -8.2
-0.28242 -8.3
-0.28217 -8.4
-0.28193 -8.5
-0.28168 -8.6
-0.28144 -8.6
-0.2812 -8.7
-0.28095 -8.7
-0.28071 -8.7
-0.28046 -8.7
-0.28022 -8.7
-0.27998 -8.7
-0.27973 -8.6
-0.27949 -8.6
-0.27924 -8.5
-0.279 -8.5
-0.27876 -8.4
-0.27851 -8.3
-0.27827 -8.2
-0.27802 -8.1
-0.27778 -7.9
-0.27753 -7.8
-0.27729 -7.6
-0.27705 -7.5
-0.2768 -7.3
-0.27656 -7.1
-0.27631 -6.9
-0.27607 -6.7
-0.27583 -6.5
-0.27558 -6.3
-0.27534 -6.1
-0.27509 -5.8
-0.27485 -5.6
-0.2746 -5.3
-0.27436 -5.0
-0.27412 -4.8
-0.27387 -4.5
-0.27363 -4.2
-0.27338 -3.9
-0.27314 -3.6
-0.2729 -3.3
-0.27265 -3.0
-0.27241 -2.7
-0.27216 -2.4
-0.27192 -2.1
-0.27168 -1.7
-0.27143 -1.4
-0.27119 -1.1
-0.27094 -0.7
-0.2707 -0.4
-0.27045 0.0
-0.27021 0.2
-0.26997 0.6
-0.26972 0.9
-0.26948 1.2
-0.26923 1.6
-0.26899 1.9
-0.26875 2.2
-0.2685 2.5
-0.26826 2.9
-0.26801 3.2
-0.26777 3.5
-0.26752 3.8
-0.26728 4.1
-0.26704 4.4
-0.26679 4.7
-0.26655 5.0
-0.2663 5.2
-0.26606 5.5
-0.26582 5.8
-0.26557 6.0
-0.26533 6.3
-0.26508 6.5
-0.26484 6.7
-0.2646 6.9
-0.26435 7.1
-0.26411 7.3
-0.26386 7.5
-0.26362 7.7
-0.26337 7.8
-0.26313 8.0
-0.26289 8.1
-0.26264 8.3
-0.2624 8.4
-0.26215 8.5
-0.26191 8.6
-0.26167 8.7
-0.26142 8.7
-0.26118 8.8
-0.26093 8.8
-0.26069 8.8
-0.26044 8.8
-0.2602 8.8
-0.25996 8.8
-0.25971 8.8
-0.25947 8.8
-0.25922 8.7
-0.25898 8.7
-0.25874 8.6
-0.25849 8.5
-0.25825 8.4
-0.258 8.3
-0.25776 8.1
-0.25751 8.0
-0.25727 7.9
-0.25703 7.7
-0.25678 7.5
-0.25654 7.3
-0.25629 7.1
-0.25605 6.9
-0.25581 6.7
-0.25556 6.5
-0.25532 6.2
-0.25507 6.0
-0.25483 5.7
-0.25459 5.5
-0.25434 5.2
-0.2541 4.9
-0.25385 4.6
-0.25361 4.3
-0.25336 4.0
-0.25312 3.7
-0.25288 3.4
-0.25263 3.1
-0.25239 2.7
-0.25214 2.4
-0.2519 2.1
-0.25166 1.7
-0.25141 1.4
-0.25117 1.1
-0.25092 0.7
-0.25068 0.4
-0.25043 0.0
-0.25019 -0.3
-0.24995 -0.7
-0.2497 -1.0
-0.24946 -1.4
-0.24921 -1.7
-0.24897 -2.1
-0.24873 -2.4
-0.24848 -2.7
-0.24824 -3.1
-0.24799 -3.4
-0.24775 -3.7
-0.24751 -4.0
-0.24726 -4.3
-0.24702 -4.6
-0.24677 -4.9
-0.24653 -5.2
-0.24628 -5.5
-0.24604 -5.8
-0.2458 -6.0
-0.24555 -6.3
-0.24531 -6.6
-0.24506 -6.8
-0.24482 -7.0
-0.24458 -7.2
-0.24433 -7.4
-0.24409 -7.6
-0.24384 -7.8
-0.2436 -8.0
-0.24335 -8.1
-0.24311 -8.3
-0.24287 -8.4
-0.24262 -8.5
-0.24238 -8.6
-0.24213 -8.7
-0.24189 -8.8
-0.24165 -8.9
-0.2414 -8.9
-0.24116 -9.0
-0.24091 -9.0
-0.24067 -9.0
-0.24043 -9.0
-0.24018 -9.0
-0.23994 -9.0
-0.23969 -8.9
-0.23945 -8.9
-0.2392 -8.8
-0.23896 -8.7
-0.23872 -8.6
-0.23847 -8.5
-0.23823 -8.3
-0.23798 -8.2
-0.23774 -8.1
-0.2375 -7.9
-0.23725 -7.7
-0.23701 -7.5
-0.23676 -7.3
-0.23652 -7.1
-0.23627 -6.9
-0.23603 -6.6
-0.23579 -6.4
-0.23554 -6.1
-0.2353 -5.9
-0.23505 -5.6
-0.23481 -5.3
-0.23457 -5.0
-0.23432 -4.7
-0.23408 -4.4
-0.23383 -4.1
-0.23359 -3.7
-0.23335 -3.4
-0.2331 -3.1
-0.23286 -2.7
-0.23261 -2.4
-0.23237 -2.0
-0.23212 -1.7
-0.23188 -1.3
-0.23164 -1.0
-0.23139 -0.6
-0.23115 -0.2
-0.2309 0.1
-0.23066 0.5
-0.23042 0.8
-0.23017 1.2
-0.22993 1.6
-0.22968 1.9
-0.22944 2.3
-0.22919 2.6
-0.22895 3.0
-0.22871 3.3
-0.22846 3.7
-0.22822 4.0
-0.22797 4.3
-0.22773 4.6
-0.22749 5.0
-0.22724 5.3
-0.227 5.6
-0.22675 5.8
-0.22651 6.1
-0.22626 6.4
-0.22602 6.6
-0.22578 6.9
-0.22553 7.1
-0.22529 7.4
-0.22504 7.6
-0.2248 7.8
-0.22456 8.0
-0.22431 8.1
-0.22407 8.3
-0.22382 8.5
-0.22358 8.6
-0.22334 8.7
-0.22309 8.8
-0.22285 8.9
-0.2226 9.0
-0.22236 9.1
-0.22211 9.1
-0.22187 9.1
-0.22163 9.2
-0.22138 9.2
-0.22114 9.2
-0.22089 9.1
-0.22065 9.1
-0.22041 9.0
-0.22016 9.0
-0.21992 8.9
-0.21967 8.8
-0.21943 8.7
-0.21918 8.5
-0.21894 8.4
-0.2187 8.2
-0.21845 8.1
-0.21821 7.9
-0.21796 7.7
-0.21772 7.5
-0.21748 7.3
-0.21723 7.0
-0.21699 6.8
-0.21674 6.5
-0.2165 6.2
-0.21626 6.0
-0.21601 5.7
-0.21577 5.4
-0.21552 5.1
-0.21528 4.7
-0.21503 4.4
-0.21479 4.1
-0.21455 3.7
-0.2143 3.4
-0.21406 3.0
-0.21381 2.7
-0.21357 2.3
-0.21333 1.9
-0.21308 1.6
-0.21284 1.2
-0.21259 0.8
-0.21235 0.4
-0.2121 0.0
-0.21186 -0.3
-0.21162 -0.7
-0.21137 -1.1
-0.21113 -1.5
-0.21088 -1.8
-0.21064 -2.2
-0.2104 -2.6
-0.21015 -2.9
-0.20991 -3.3
-0.20966 -3.7
-0.20942 -4.0
-0.20918 -4.4
-0.20893 -4.7
-0.20869 -5.0
-0.20844 -5.3
-0.2082 -5.7
-0.20795 -6.0
-0.20771 -6.2
-0.20747 -6.5
-0.20722 -6.8
-0.20698 -7.1
-0.20673 -7.3
-0.20649 -7.5
-0.20625 -7.8
-0.206 -8.0
-0.20576 -8.2
-0.20551 -8.4
-0.20527 -8.5
-0.20502 -8.7
-0.20478 -8.8
-0.20454 -8.9
-0.20429 -9.0
-0.20405 -9.1
-0.2038 -9.2
-0.20356 -9.3
-0.20332 -9.3
-0.20307 -9.3
-0.20283 -9.4
-0.20258 -9.3
-0.20234 -9.3
-0.2021 -9.3
-0.20185 -9.2
-0.20161 -9.2
-0.20136 -9.1
-0.20112 -9.0
-0.20087 -8.9
-0.20063 -8.7
-0.20039 -8.6
-0.20014 -8.4
-0.1999 -8.2
-0.19965 -8.0
-0.19941 -7.8
-0.19917 -7.6
-0.19892 -7.4
-0.19868 -7.1
-0.19843 -6.9
-0.19819 -6.6
-0.19794 -6.3
-0.1977 -6.0
-0.19746 -5.7
-0.19721 -5.4
-0.19697 -5.1
-0.19672 -4.7
-0.19648 -4.4
-0.19624 -4.0
-0.19599 -3.7
-0.19575 -3.3
-0.1955 -2.9
-0.19526 -2.5
-0.19501 -2.1
-0.19477 -1.8
-0.19453 -1.4
-0.19428 -1.0
-0.19404 -0.6
-0.19379 -0.2
-0.19355 0.2
-0.19331 0.6
-0.19306 1.0
-0.19282 1.4
-0.19257 1.8
-0.19233 2.2
-0.19209 2.6
-0.19184 3.0
-0.1916 3.4
-0.19135 3.8
-0.19111 4.1
-0.19086 4.5
-0.19062 4.8
-0.19038 5.2
-0.19013 5.5
-0.18989 5.8
-0.18964 6.2
-0.1894 6.5
-0.18916 6.8
-0.18891 7.0
-0.18867 7.3
-0.18842 7.6
-0.18818 7.8
-0.18793 8.0
-0.18769 8.2
-0.18745 8.4
-0.1872 8.6
-0.18696 8.8
-0.18671 8.9
-0.18647 9.1
-0.18623 9.2
-0.18598 9.3
-0.18574 9.4
-0.18549 9.4
-0.18525 9.5
-0.18501 9.5
-0.18476 9.5
-0.18452 9.5
-0.18427 9.5
-0.18403 9.5
-0.18378 9.4
-0.18354 9.4
-0.1833 9.3
-0.18305 9.2
-0.18281 9.0
-0.18256 8.9
-0.18232 8.7
-0.18208 8.6
-0.18183 8.4
-0.18159 8.2
-0.18134 7.9
-0.1811 7.7
-0.18085 7.4
-0.18061 7.2
-0.18037 6.9
-0.18012 6.6
-0.17988 6.3
-0.17963 6.0
-0.17939 5.6
-0.17915 5.3
-0.1789 4.9
-0.17866 4.6
-0.17841 4.2
-0.17817 3.8
-0.17793 3.4
-0.17768 3.0
-0.17744 2.6
-0.17719 2.2
-0.17695 1.8
-0.1767 1.4
-0.17646 1.0
-0.17622 0.6
-0.17597 0.2
-0.17573 -0.3
-0.17548 -0.7
-0.17524 -1.1
-0.175 -1.5
-0.17475 -2.0
-0.17451 -2.4
-0.17426 -2.8
-0.17402 -3.2
-0.17377 -3.6
-0.17353 -4.0
-0.17329 -4.4
-0.17304 -4.7
-0.1728 -5.1
-0.17255 -5.5
-0.17231 -5.8
-0.17207 -6.2
-0.17182 -6.5
-0.17158 -6.8
-0.17133 -7.1
-0.17109 -7.4
-0.17085 -7.7
-0.1706 -7.9
-0.17036 -8.2
-0.17011 -8.4
-0.16987 -8.6
-0.16962 -8.8
-0.16938 -9.0
-0.16914 -9.1
-0.16889 -9.3
-0.16865 -9.4
-0.1684 -9.5
-0.16816 -9.6
-0.16792 -9.7
-0.16767 -9.7
-0.16743 -9.8
-0.16718 -9.8
-0.16694 -9.8
-0.16669 -9.7
-0.16645 -9.7
-0.16621 -9.6
-0.16596 -9.5
-0.16572 -9.4
-0.16547 -9.3
-0.16523 -9.2
-0.16499 -9.0
-0.16474 -8.8
-0.1645 -8.6
-0.16425 -8.4
-0.16401 -8.2
-0.16376 -7.9
-0.16352 -7.7
-0.16328 -7.4
-0.16303 -7.1
-0.16279 -6.8
-0.16254 -6.5
-0.1623 -6.1
-0.16206 -5.8
-0.16181 -5.4
-0.16157 -5.0
-0.16132 -4.7
-0.16108 -4.3
-0.16084 -3.9
-0.16059 -3.4
-0.16035 -3.0
-0.1601 -2.6
-0.15986 -2.2
-0.15961 -1.7
-0.15937 -1.3
-0.15913 -0.8
-0.15888 -0.4
-0.15864 0.0
-0.15839 0.5
-0.15815 0.9
-0.15791 1.4
-0.15766 1.8
-0.15742 2.3
-0.15717 2.7
-0.15693 3.1
-0.15668 3.6
-0.15644 4.0
-0.1562 4.4
-0.15595 4.8
-0.15571 5.2
-0.15546 5.6
-0.15522 6.0
-0.15498 6.3
-0.15473 6.7
-0.15449 7.0
-0.15424 7.3
-0.154 7.6
-0.15376 7.9
-0.15351 8.2
-0.15327 8.4
-0.15302 8.7
-0.15278 8.9
-0.15253 9.1
-0.15229 9.3
-0.15205 9.4
-0.1518 9.6
-0.15156 9.7
-0.15131 9.8
-0.15107 9.9
-0.15083 9.9
-0.15058 10.0
-0.15034 10.0
-0.15009 10.0
-0.14985 10.0
-0.1496 9.9
-0.14936 9.9
-0.14912 9.8
-0.14887 9.7
-0.14863 9.5
-0.14838 9.4
-0.14814 9.2
-0.1479 9.0
-0.14765 8.8
-0.14741 8.6
-0.14716 8.3
-0.14692 8.1
-0.14668 7.8
-0.14643 7.5
-0.14619 7.2
-0.14594 6.8
-0.1457 6.5
-0.14545 6.1
-0.14521 5.7
-0.14497 5.3
-0.14472 4.9
-0.14448 4.5
-0.14423 4.1
-0.14399 3.7
-0.14375 3.2
-0.1435 2.8
-0.14326 2.3
-0.14301 1.8
-0.14277 1.4
-0.14252 0.9
-0.14228 0.4
-0.14204 0.0
-0.14179 -0.5
-0.14155 -1.0
-0.1413 -1.5
-0.14106 -1.9
-0.14082 -2.4
-0.14057 -2.9
-0.14033 -3.3
-0.14008 -3.8
-0.13984 -4.2
-0.1396 -4.7
-0.13935 -5.1
-0.13911 -5.5
-0.13886 -5.9
-0.13862 -6.3
-0.13837 -6.7
-0.13813 -7.0
-0.13789 -7.4
-0.13764 -7.7
-0.1374 -8.0
-0.13715 -8.3
-0.13691 -8.6
-0.13667 -8.8
-0.13642 -9.1
-0.13618 -9.3
-0.13593 -9.5
-0.13569 -9.7
-0.13544 -9.8
-0.1352 -10.0
-0.13496 -10.1
-0.13471 -10.2
-0.13447 -10.2
-0.13422 -10.3
-0.13398 -10.3
-0.13374 -10.3
-0.13349 -10.2
-0.13325 -10.2
-0.133 -10.1
-0.13276 -10.0
-0.13251 -9.9
-0.13227 -9.7
-0.13203 -9.5
-0.13178 -9.3
-0.13154 -9.1
-0.13129 -8.9
-0.13105 -8.6
-0.13081 -8.3
-0.13056 -8.0
-0.13032 -7.7
-0.13007 -7.4
-0.12983 -7.0
-0.12959 -6.7
-0.12934 -6.3
-0.1291 -5.9
-0.12885 -5.4
-0.12861 -5.0
-0.12836 -4.6
-0.12812 -4.1
-0.12788 -3.6
-0.12763 -3.2
-0.12739 -2.7
-0.12714 -2.2
-0.1269 -1.7
-0.12666 -1.2
-0.12641 -0.7
-0.12617 -0.2
-0.12592 0.3
-0.12568 0.8
-0.12543 1.4
-0.12519 1.9
-0.12495 2.4
-0.1247 2.9
-0.12446 3.3
-0.12421 3.8
-0.12397 4.3
-0.12373 4.8
-0.12348 5.2
-0.12324 5.7
-0.12299 6.1
-0.12275 6.5
-0.12251 6.9
-0.12226 7.3
-0.12202 7.7
-0.12177 8.0
-0.12153 8.3
-0.12128 8.7
-0.12104 8.9
-0.1208 9.2
-0.12055 9.5
-0.12031 9.7
-0.12006 9.9
-0.11982 10.0
-0.11958 10.2
-0.11933 10.3
-0.11909 10.4
-0.11884 10.5
-0.1186 10.5
-0.11835 10.6
-0.11811 10.5
-0.11787 10.5
-0.11762 10.5
-0.11738 10.4
-0.11713 10.3
-0.11689 10.1
-0.11665 10.0
-0.1164 9.8
-0.11616 9.6
-0.11591 9.3
-0.11567 9.1
-0.11543 8.8
-0.11518 8.5
-0.11494 8.1
-0.11469 7.8
-0.11445 7.4
-0.1142 7.0
-0.11396 6.6
-0.11372 6.2
-0.11347 5.7
-0.11323 5.3
-0.11298 4.8
-0.11274 4.3
-0.1125 3.8
-0.11225 3.3
-0.11201 2.8
-0.11176 2.2
-0.11152 1.7
-0.11127 1.2
-0.11103 0.6
-0.11079 0.0
-0.11054 -0.5
-0.1103 -1.0
-0.11005 -1.6
-0.10981 -2.1
-0.10957 -2.7
-0.10932 -3.2
-0.10908 -3.7
-0.10883 -4.2
-0.10859 -4.7
-0.10835 -5.2
-0.1081 -5.7
-0.10786 -6.2
-0.10761 -6.6
-0.10737 -7.1
-0.10712 -7.5
-0.10688 -7.9
-0.10664 -8.3
-0.10639 -8.6
-0.10615 -8.9
-0.1059 -9.3
-0.10566 -9.5
-0.10542 -9.8
-0.10517 -10.0
-0.10493 -10.2
-0.10468 -10.4
-0.10444 -10.6
-0.10419 -10.7
-0.10395 -10.8
-0.10371 -10.8
-0.10346 -10.9
-0.10322 -10.9
-0.10297 -10.9
-0.10273 -10.8
-0.10249 -10.7
-0.10224 -10.6
-0.102 -10.5
-0.10175 -10.3
-0.10151 -10.1
-0.10126 -9.8
-0.10102 -9.6
-0.10078 -9.3
-0.10053 -9.0
-0.10029 -8.7
-0.10004 -8.3
-0.0998 -7.9
-0.09956 -7.5
-0.09931 -7.1
-0.09907 -6.6
-0.09882 -6.1
-0.09858 -5.6
-0.09834 -5.1
-0.09809 -4.6
-0.09785 -4.1
-0.0976 -3.5
-0.09736 -3.0
-0.09711 -2.4
-0.09687 -1.8
-0.09663 -1.2
-0.09638 -0.6
-0.09614 0.0
-0.09589 0.5
-0.09565 1.1
-0.09541 1.7
-0.09516 2.3
-0.09492 2.9
-0.09467 3.5
-0.09443 4.0
-0.09418 4.6
-0.09394 5.1
-0.0937 5.7
-0.09345 6.2
-0.09321 6.7
-0.09296 7.2
-0.09272 7.6
-0.09248 8.1
-0.09223 8.5
-0.09199 8.9
-0.09174 9.2
-0.0915 9.6
-0.09126 9.9
-0.09101 10.1
-0.09077 10.4
-0.09052 10.6
-0.09028 10.8
-0.09003 11.0
-0.08979 11.1
-0.08955 11.2
-0.0893 11.2
-0.08906 11.3
-0.08881 11.2
-0.08857 11.2
-0.08833 11.1
-0.08808 11.0
-0.08784 10.9
-0.08759 10.7
-0.08735 10.5
-0.0871 10.2
-0.08686 9.9
-0.08662 9.6
-0.08637 9.3
-0.08613 8.9
-0.08588 8.5
-0.08564 8.1
-0.0854 7.6
-0.08515 7.2
-0.08491 6.7
-0.08466 6.1
-0.08442 5.6
-0.08418 5.0
-0.08393 4.4
-0.08369 3.8
-0.08344 3.2
-0.0832 2.6
-0.08295 2.0
-0.08271 1.3
-0.08247 0.7
-0.08222 0.0
-0.08198 -0.6
-0.08173 -1.2
-0.08149 -1.9
-0.08125 -2.5
-0.081 -3.2
-0.08076 -3.8
-0.08051 -4.4
-0.08027 -5.0
-0.08002 -5.6
-0.07978 -6.2
-0.07954 -6.7
-0.07929 -7.3
-0.07905 -7.8
-0.0788 -8.3
-0.07856 -8.7
-0.07832 -9.1
-0.07807 -9.5
-0.07783 -9.9
-0.07758 -10.3
-0.07734 -10.6
-0.0771 -10.8
-0.07685 -11.1
-0.07661 -11.3
-0.07636 -11.4
-0.07612 -11.6
-0.07587 -11.6
-0.07563 -11.7
-0.07539 -11.7
-0.07514 -11.7
-0.0749 -11.6
-0.07465 -11.5
-0.07441 -11.3
-0.07417 -11.1
-0.07392 -10.9
-0.07368 -10.6
-0.07343 -10.3
-0.07319 -10.0
-0.07294 -9.6
-0.0727 -9.2
-0.07246 -8.7
-0.07221 -8.3
-0.07197 -7.7
-0.07172 -7.2
-0.07148 -6.6
-0.07124 -6.1
-0.07099 -5.4
-0.07075 -4.8
-0.0705 -4.2
-0.07026 -3.5
-0.07001 -2.8
-0.06977 -2.1
-0.06953 -1.4
-0.06928 -0.7
-0.06904 0.0
-0.06879 0.7
-0.06855 1.5
-0.06831 2.2
-0.06806 2.9
-0.06782 3.6
-0.06757 4.3
-0.06733 5.0
-0.06709 5.6
-0.06684 6.3
-0.0666 6.9
-0.06635 7.5
-0.06611 8.0
-0.06586 8.6
-0.06562 9.1
-0.06538 9.6
-0.06513 10.0
-0.06489 10.4
-0.06464 10.8
-0.0644 11.1
-0.06416 11.4
-0.06391 11.7
-0.06367 11.9
-0.06342 12.0
-0.06318 12.1
-0.06293 12.2
-0.06269 12.2
-0.06245 12.2
-0.0622 12.1
-0.06196 12.0
-0.06171 11.8
-0.06147 11.6
-0.06123 11.3
-0.06098 11.0
-0.06074 10.7
-0.06049 10.3
-0.06025 9.8
-0.06001 9.3
-0.05976 8.8
-0.05952 8.3
-0.05927 7.7
-0.05903 7.1
-0.05878 6.4
-0.05854 5.7
-0.0583 5.0
-0.05805 4.3
-0.05781 3.5
-0.05756 2.8
-0.05732 2.0
-0.05708 1.2
-0.05683 0.4
-0.05659 -0.4
-0.05634 -1.2
-0.0561 -2.0
-0.05585 -2.8
-0.05561 -3.6
-0.05537 -4.4
-0.05512 -5.2
-0.05488 -5.9
-0.05463 -6.6
-0.05439 -7.3
-0.05415 -8.0
-0.0539 -8.6
-0.05366 -9.2
-0.05341 -9.8
-0.05317 -10.3
-0.05293 -10.8
-0.05268 -11.2
-0.05244 -11.6
-0.05219 -11.9
-0.05195 -12.2
-0.0517 -12.4
-0.05146 -12.6
-0.05122 -12.7
-0.05097 -12.8
-0.05073 -12.8
-0.05048 -12.8
-0.05024 -12.7
-0.05 -12.5
-0.04975 -12.3
-0.04951 -12.0
-0.04926 -11.7
-0.04902 -11.3
-0.04877 -10.8
-0.04853 -10.3
-0.04829 -9.8
-0.04804 -9.2
-0.0478 -8.6
-0.04755 -7.9
-0.04731 -7.2
-0.04707 -6.4
-0.04682 -5.6
-0.04658 -4.8
-0.04633 -3.9
-0.04609 -3.1
-0.04585 -2.2
-0.0456 -1.3
-0.04536 -0.4
-0.04511 0.6
-0.04487 1.5
-0.04462 2.4
-0.04438 3.3
-0.04414 4.2
-0.04389 5.1
-0.04365 5.9
-0.0434 6.8
-0.04316 7.6
-0.04292 8.4
-0.04267 9.1
-0.04243 9.8
-0.04218 10.4
-0.04194 11.0
-0.04169 11.6
-0.04145 12.0
-0.04121 12.5
-0.04096 12.8
-0.04072 13.1
-0.04047 13.3
-0.04023 13.5
-0.03999 13.6
-0.03974 13.6
-0.0395 13.5
-0.03925 13.4
-0.03901 13.2
-0.03876 12.9
-0.03852 12.6
-0.03828 12.1
-0.03803 11.7
-0.03779 11.1
-0.03754 10.5
-0.0373 9.8
-0.03706 9.1
-0.03681 8.3
-0.03657 7.4
-0.03632 6.5
-0.03608 5.6
-0.03584 4.6
-0.03559 3.6
-0.03535 2.6
-0.0351 1.5
-0.03486 0.5
-0.03461 -0.6
-0.03437 -1.7
-0.03413 -2.8
-0.03388 -3.8
-0.03364 -4.9
-0.03339 -5.9
-0.03315 -6.9
-0.03291 -7.9
-0.03266 -8.8
-0.03242 -9.7
-0.03217 -10.5
-0.03193 -11.2
-0.03168 -11.9
-0.03144 -12.5
-0.0312 -13.1
-0.03095 -13.6
-0.03071 -13.9
-0.03046 -14.2
-0.03022 -14.4
-0.02998 -14.5
-0.02973 -14.6
-0.02949 -14.5
-0.02924 -14.3
-0.029 -14.0
-0.02876 -13.7
-0.02851 -13.2
-0.02827 -12.6
-0.02802 -12.0
-0.02778 -11.2
-0.02753 -10.4
-0.02729 -9.5
-0.02705 -8.6
-0.0268 -7.5
-0.02656 -6.4
-0.02631 -5.3
-0.02607 -4.1
-0.02583 -2.8
-0.02558 -1.5
-0.02534 -0.3
-0.02509 1.1
-0.02485 2.4
-0.0246 3.7
-0.02436 5.0
-0.02412 6.2
-0.02387 7.4
-0.02363 8.6
-0.02338 9.7
-0.02314 10.8
-0.0229 11.7
-0.02265 12.6
-0.02241 13.4
-0.02216 14.1
-0.02192 14.7
-0.02168 15.2
-0.02143 15.5
-0.02119 15.7
-0.02094 15.8
-0.0207 15.8
-0.02045 15.6
-0.02021 15.3
-0.01997 14.8
-0.01972 14.2
-0.01948 13.5
-0.01923 12.7
-0.01899 11.7
-0.01875 10.6
-0.0185 9.4
-0.01826 8.1
-0.01801 6.7
-0.01777 5.2
-0.01752 3.7
-0.01728 2.1
-0.01704 0.4
-0.01679 -1.2
-0.01655 -2.9
-0.0163 -4.5
-0.01606 -6.2
-0.01582 -7.7
-0.01557 -9.3
-0.01533 -10.7
-0.01508 -12.1
-0.01484 -13.3
-0.0146 -14.4
-0.01435 -15.4
-0.01411 -16.2
-0.01386 -16.8
-0.01362 -17.3
-0.01337 -17.5
-0.01313 -17.6
-0.01289 -17.4
-0.01264 -17.0
-0.0124 -16.4
-0.01215 -15.6
-0.01191 -14.6
-0.01167 -13.4
-0.01142 -12.0
-0.01118 -10.4
-0.01093 -8.7
-0.01069 -6.8
-0.01044 -4.7
-0.0102 -2.6
-0.00996 -0.4
-0.00971 1.8
-0.00947 4.1
-0.00922 6.3
-0.00898 8.5
-0.00874 10.6
-0.00849 12.6
-0.00825 14.4
-0.008 16.0
-0.00776 17.4
-0.00751 18.5
-0.00727 19.3
-0.00703 19.8
-0.00678 19.9
-0.00654 19.7
-0.00629 19.1
-0.00605 18.1
-0.00581 16.7
-0.00556 15.0
-0.00532 12.9
-0.00507 10.5
-0.00483 7.8
-0.00459 4.9
-0.00434 1.8
-0.0041 -1.5
-0.00385 -4.8
-0.00361 -8.1
-0.00336 -11.2
-0.00312 -14.2
-0.00288 -16.9
-0.00263 -19.1
-0.00239 -20.9
-0.00214 -22.1
-0.0019 -22.7
-0.00166 -22.5
-0.00141 -21.6
-0.00117 -19.8
-0.00092 -17.3
-0.00068 -14.0
-0.00043 -10.0
-0.00019 -5.5
5e-05 -0.6
0.0003 4.5
0.00054 9.4
0.00079 13.9
0.00103 17.7
0.00127 20.5
0.00152 22.2
0.00176 22.4
0.00201 21.3
0.00225 18.8
0.00249 15.1
0.00274 10.4
0.00298 5.1
0.00323 -0.4
0.00347 -5.6
0.00372 -10.3
0.00396 -13.9
0.0042 -16.2
0.00445 -17.1
0.00469 -16.5
0.00494 -14.6
0.00518 -11.6
0.00542 -7.9
0.00567 -3.7
0.00591 0.5
0.00616 4.3
0.0064 7.4
0.00665 9.6
0.00689 10.7
0.00713 10.8
0.00738 9.8
0.00762 8.0
0.00787 5.6
0.00811 2.9
0.00835 0.2
0.0086 -2.2
0.00884 -4.3
0.00909 -5.7
0.00933 -6.4
0.00957 -6.4
0.00982 -5.8
0.01006 -4.7
0.01031 -3.2
0.01055 -1.6
0.0108 0.0
0.01104 1.5
0.01128 2.7
0.01153 3.5
0.01177 3.8
0.01202 3.7
0.01226 3.3
0.0125 2.5
0.01275 1.6
0.01299 0.6
0.01324 -0.3
0.01348 -1.1
0.01373 -1.8
0.01397 -2.1
0.01421 -2.3
0.01446 -2.1
0.0147 -1.8
0.01495 -1.3
0.01519 -0.8
0.01543 -0.2
0.01568 0.4
0.01592 0.8
0.01617 1.2
0.01641 1.3
0.01665 1.3
0.0169 1.2
0.01714 1.0
0.01739 0.7
0.01763 0.3
0.01788 0.0
0.01812 -0.3
0.01836 -0.6
0.01861 -0.7
0.01885 -0.8
0.0191 -0.8
0.01934 -0.7
0.01958 -0.5
0.01983 -0.3
0.02007 -0.1
0.02032 0.0
0.02056 0.3
0.02081 0.4
0.02105 0.5
0.02129 0.5
0.02154 0.5
0.02178 0.4
0.02203 0.3
0.02227 0.1
0.02251 0.0
0.02276 -0.1
0.023 -0.2
0.02325 -0.3
0.02349 -0.3
0.02374 -0.3
0.02398 -0.3
0.02422 -0.2
0.02447 -0.1
0.02471 0.0
0.02496 0.0
0.0252 0.0
0.02544 0.1
0.02569 0.2
0.02593 0.2
0.02618 0.2
0.02642 0.1
0.02666 0.1
0.02691 0.0
0.02715 0.0
0.0274 0.0
0.02764 0.0
0.02789 0.0
0.02813 -0.1
0.02837 -0.1
0.02862 0.0
0.02886 0.0
0.02911 0.0
0.02935 0.0
0.02959 0.0
0.02984 0.0
0.03008 0.0
0.03033 0.0
0.03057 0.0
0.03082 0.0
0.03106 0.0
0.0313 0.0
0.03155 0.0
0.03179 0.0
0.03204 0.0
0.03228 0.0
0.03252 0.0
0.03277 0.0
0.03301 0.0
0.03326 0.0
0.0335 0.0
0.03374 0.0
0.03399 0.0
0.03423 0.0
0.03448 0.0
0.03472 0.0
0.03497 0.0
0.03521 0.0
0.03545 0.0
0.0357 0.0
0.03594 0.0
0.03619 0.0
0.03643 0.0
0.03667 0.0
0.03692 0.0
0.03716 0.0
0.03741 0.0
0.03765 0.0
0.0379 0.0
0.03814 0.0
0.03838 0.0
0.03863 0.0
0.03887 0.0
0.03912 0.0
0.03936 0.0
0.0396 0.0
0.03985 0.0
0.04009 0.0
0.04034 0.0
0.04058 0.0
0.04082 0.0
0.04107 0.0
0.04131 0.0
0.04156 0.0
0.0418 0.0
0.04205 0.0
0.04229 0.0
0.04253 0.0
0.04278 0.0
0.04302 0.0
0.04327 0.0
0.04351 0.0
0.04375 0.0
0.044 0.0
0.04424 0.0
0.04449 0.0
0.04473 0.0
0.04498 0.0
0.04522 0.0
0.04546 0.0
0.04571 0.0
0.04595 0.0
0.0462 0.0
0.04644 0.0
0.04668 0.0
0.04693 0.0
0.04717 0.0
0.04742 0.0
0.04766 0.0
0.0479 0.0
0.04815 0.0
0.04839 0.0
0.04864 0.0
0.04888 0.0
0.04913 0.0
0.04937 0.0
0.04961 0.0
0.04986 0.0
0.0501 0.0
0.05035 0.0
0.05059 0.0
0.05083 0.0
0.05108 0.0
0.05132 0.0
0.05157 0.0
0.05181 0.0
0.05206 0.0
0.0523 0.0
0.05254 0.0
0.05279 0.0
0.05303 0.0
0.05328 0.0
0.05352 0.0
0.05376 0.0
0.05401 0.0
0.05425 0.0
0.0545 0.0
0.05474 0.0
0.05499 0.0
0.05523 0.0
0.05547 0.0
0.05572 0.0
0.05596 0.0
0.05621 0.0
0.05645 0.0
0.05669 0.0
0.05694 0.0
0.05718 0.0
0.05743 0.0
0.05767 0.0
0.05791 0.0
0.05816 0.0
0.0584 0.0
0.05865 0.0
0.05889 0.0
0.05914 0.0
0.05938 0.0
0.05962 0.0
0.05987 0.0
0.06011 0.0
0.06036 0.0
0.0606 0.0
0.06084 0.0
0.06109 0.0
0.06133 0.0
0.06158 0.0
0.06182 0.0
0.06207 0.0
0.06231 0.0
0.06255 0.0
0.0628 0.0
0.06304 0.0
0.06329 0.0
0.06353 0.0
0.06377 0.0
0.06402 0.0
0.06426 0.0
0.06451 0.0
0.06475 0.0
0.06499 0.0
0.06524 0.0
0.06548 0.0
0.06573 0.0
0.06597 0.0
0.06622 0.0
0.06646 0.0
0.0667 0.0
0.06695 0.0
0.06719 0.0
0.06744 0.0
0.06768 0.0
0.06792 0.0
0.06817 0.0
0.06841 0.0
0.06866 0.0
0.0689 0.0
0.06915 0.0
0.06939 0.0
0.06963 0.0
0.06988 0.0
0.07012 0.0
0.07037 0.0
0.07061 0.0
0.07085 0.0
0.0711 0.0
0.07134 0.0
0.07159 0.0
0.07183 0.0
0.07207 0.0
0.07232 0.0
0.07256 0.0
0.07281 0.0
0.07305 0.0
0.0733 0.0
0.07354 0.0
0.07378 0.0
0.07403 0.0
0.07427 0.0
0.07452 0.0
0.07476 0.0
0.075 0.0
0.07525 0.0
0.07549 0.0
0.07574 0.0
0.07598 0.0
0.07623 0.0
0.07647 0.0
0.07671 0.0
0.07696 0.0
0.0772 0.0
0.07745 0.0
0.07769 0.0
0.07793 0.0
0.07818 0.0
0.07842 0.0
0.07867 0.0
0.07891 0.0
0.07915 0.0
0.0794 0.0
0.07964 0.0
0.07989 0.0
0.08013 0.0
0.08038 0.0
0.08062 0.0
0.08086 0.0
0.08111 0.0
0.08135 0.0
0.0816 0.0
0.08184 0.0
0.08208 0.0
0.08233 0.0
0.08257 0.0
0.08282 0.0
0.08306 0.0
0.08331 0.0
0.08355 0.0
0.08379 0.0
0.08404 0.0
0.08428 0.0
0.08453 0.0
0.08477 0.0
0.08501 0.0
0.08526 0.0
0.0855 0.0
0.08575 0.0
0.08599 0.0
0.08624 0.0
0.08648 0.0
0.08672 0.0
0.08697 0.0
0.08721 0.0
0.08746 0.0
0.0877 0.0
0.08794 0.0
0.08819 0.0
0.08843 0.0
0.08868 0.0
0.08892 0.0
0.08916 0.0
0.08941 0.0
0.08965 0.0
0.0899 0.0
0.09014 0.0
0.09039 0.0
0.09063 0.0
0.09087 0.0
0.09112 0.0
0.09136 0.0
0.09161 0.0
0.09185 0.0
0.09209 0.0
0.09234 0.0
0.09258 0.0
0.09283 0.0
0.09307 0.0
0.09332 0.0
0.09356 0.0
0.0938 0.0
0.09405 0.0
0.09429 0.0
0.09454 0.0
0.09478 0.0
0.09502 0.0
0.09527 0.0
0.09551 0.0
0.09576 0.0
0.096 0.0
0.09624 0.0
0.09649 0.0
0.09673 0.0
0.09698 0.0
0.09722 0.0
0.09747 0.0
0.09771 0.0
0.09795 0.0
0.0982 0.0
0.09844 0.0
0.09869 0.0
0.09893 0.0
0.09917 0.0
0.09942 0.0
0.09966 0.0
0.09991 0.0
0.10015 0.0
0.1004 0.0
0.10064 0.0
0.10088 0.0
0.10113 0.0
0.10137 0.0
0.10162 0.0
0.10186 0.0
0.1021 0.0
0.10235 0.0
0.10259 0.0
0.10284 0.0
0.10308 0.0
0.10332 0.0
0.10357 0.0
0.10381 0.0
0.10406 0.0
0.1043 0.0
0.10455 0.0
0.10479 0.0
0.10503 0.0
0.10528 0.0
0.10552 0.0
0.10577 0.0
0.10601 0.0
0.10625 0.0
0.1065 0.0
0.10674 0.0
0.10699 0.0
0.10723 0.0
0.10748 0.0
0.10772 0.0
0.10796 0.0
0.10821 0.0
0.10845 0.0
0.1087 0.0
0.10894 0.0
0.10918 0.0
0.10943 0.0
0.10967 0.0
0.10992 0.0
0.11016 0.0
0.1104 0.0
0.11065 0.0
0.11089 0.0
0.11114 0.0
0.11138 0.0
0.11163 0.0
0.11187 0.0
0.11211 0.0
0.11236 0.0
0.1126 0.0
0.11285 0.0
0.11309 0.0
0.11333 0.0
0.11358 0.0
0.11382 0.0
0.11407 0.0
0.11431 0.0
0.11456 0.0
0.1148 0.0
0.11504 0.0
0.11529 0.0
0.11553 0.0
0.11578 0.0
0.11602 0.0
0.11626 0.0
0.11651 0.0
0.11675 0.0
0.117 0.0
0.11724 0.0
0.11749 0.0
0.11773 0.0
0.11797 0.0
0.11822 0.0
0.11846 0.0
0.11871 0.0
0.11895 0.0
0.11919 0.0
0.11944 0.0
0.11968 0.0
0.11993 0.0
0.12017 0.0
0.12041 0.0
0.12066 0.0
0.1209 0.0
0.12115 0.0
0.12139 0.0
0.12164 0.0
0.12188 0.0
0.12212 0.0
0.12237 0.0
0.12261 0.0
0.12286 0.0
0.1231 0.0
0.12334 0.0
0.12359 0.0
0.12383 0.0
0.12408 0.0
0.12432 0.0
0.12457 0.0
0.12481 0.0
0.12505 0.0
0.1253 0.0
0.12554 0.0
0.12579 0.0
0.12603 0.0
0.12627 0.0
0.12652 0.0
0.12676 0.0
0.12701 0.0
0.12725 0.0
0.12749 0.0
0.12774 0.0
0.12798 0.0
0.12823 0.0
0.12847 0.0
0.12872 0.0
0.12896 0.0
0.1292 0.0
0.12945 0.0
0.12969 0.0
0.12994 0.0
0.13018 0.0
0.13042 0.0
0.13067 0.0
0.13091 0.0
0.13116 0.0
0.1314 0.0
0.13165 0.0
0.13189 0.0
0.13213 0.0
0.13238 0.0
0.13262 0.0
0.13287 0.0
0.13311 0.0
0.13335 0.0
0.1336 0.0
0.13384 0.0
0.13409 0.0
0.13433 0.0
0.13457 0.0
0.13482 0.0
0.13506 0.0
0.13531 0.0
0.13555 0.0
0.1358 0.0
0.13604 0.0
0.13628 0.0
0.13653 0.0
0.13677 0.0
0.13702 0.0
0.13726 0.0
0.1375 0.0
0.13775 0.0
0.13799 0.0
0.13824 0.0
0.13848 0.0
0.13873 0.0
0.13897 0.0
0.13921 0.0
0.13946 0.0
0.1397 0.0
0.13995 0.0
0.14019 0.0
0.14043 0.0
0.14068 0.0
0.14092 0.0
0.14117 0.0
0.14141 0.0
0.14165 0.0
0.1419 0.0
0.14214 0.0
0.14239 0.0
0.14263 0.0
0.14288 0.0
0.14312 0.0
0.14336 0.0
0.14361 0.0
0.14385 0.0
0.1441 0.0
0.14434 0.0
0.14458 0.0
0.14483 0.0
0.14507 0.0
0.14532 0.0
0.14556 0.0
0.14581 0.0
0.14605 0.0
0.14629 0.0
0.14654 0.0
0.14678 0.0
0.14703 0.0
0.14727 0.0
0.14751 0.0
0.14776 0.0
0.148 0.0
0.14825 0.0
0.14849 0.0
0.14874 0.0
0.14898 0.0
0.14922 0.0
0.14947 0.0
0.14971 0.0
0.14996 0.0
0.1502 0.0
0.15044 0.0
0.15069 0.0
0.15093 0.0
0.15118 0.0
0.15142 0.0
0.15166 0.0
0.15191 0.0
0.15215 0.0
0.1524 0.0
0.15264 0.0
0.15289 0.0
0.15313 0.0
0.15337 0.0
0.15362 0.0
0.15386 0.0
0.15411 0.0
0.15435 0.0
0.15459 0.0
0.15484 0.0
0.15508 0.0
0.15533 0.0
0.15557 0.0
0.15582 0.0
0.15606 0.0
0.1563 0.0
0.15655 0.0
0.15679 0.0
0.15704 0.0
0.15728 0.0
0.15752 0.0
0.15777 0.0
0.15801 0.0
0.15826 0.0
0.1585 0.0
0.15874 0.0
0.15899 0.0
0.15923 0.0
0.15948 0.0
0.15972 0.0
0.15997 0.0
0.16021 0.0
0.16045 0.0
0.1607 0.0
0.16094 0.0
0.16119 0.0
0.16143 0.0
0.16167 0.0
0.16192 0.0
0.16216 0.0
0.16241 0.0
0.16265 0.0
0.1629 0.0
0.16314 0.0
0.16338 0.0
0.16363 0.0
0.16387 0.0
0.16412 0.0
0.16436 0.0
0.1646 0.0
0.16485 0.0
0.16509 0.0
0.16534 0.0
0.16558 0.0
0.16582 0.0
0.16607 0.0
0.16631 0.0
0.16656 0.0
0.1668 0.0
0.16705 0.0
0.16729 0.0
0.16753 0.0
0.16778 0.0
0.16802 0.0
0.16827 0.0
0.16851 0.0
0.16875 0.0
0.169 0.0
0.16924 0.0
0.16949 0.0
0.16973 0.0
0.16998 0.0
0.17022 0.0
0.17046 0.0
0.17071 0.0
0.17095 0.0
0.1712 0.0
0.17144 0.0
0.17168 0.0
0.17193 0.0
0.17217 0.0
0.17242 0.0
0.17266 0.0
0.1729 0.0
0.17315 0.0
0.17339 0.0
0.17364 0.0
0.17388 0.0
0.17413 0.0
0.17437 0.0
0.17461 0.0
0.17486 0.0
0.1751 0.0
0.17535 0.0
0.17559 0.0
0.17583 0.0
0.17608 0.0
0.17632 0.0
0.17657 0.0
0.17681 0.0
0.17706 0.0
0.1773 0.0
0.17754 0.0
0.17779 0.0
0.17803 0.0
0.17828 0.0
0.17852 0.0
0.17876 0.0
0.17901 0.0
0.17925 0.0
0.1795 0.0
0.17974 0.0
0.17999 0.0
0.18023 0.0
0.18047 0.0
0.18072 0.0
0.18096 0.0
0.18121 0.0
0.18145 0.0
0.18169 0.0
0.18194 0.0
0.18218 0.0
0.18243 0.0
0.18267 0.0
0.18291 0.0
0.18316 0.0
0.1834 0.0
0.18365 0.0
0.18389 0.0
0.18414 0.0
0.18438 0.0
0.18462 0.0
0.18487 0.0
0.18511 0.0
0.18536 0.0
0.1856 0.0
