t strain*1e23
-0.39448 -7.2
-0.39424 -7.1
-0.39399 -7.0
-0.39375 -6.9
-0.39351 -6.8
-0.39326 -6.7
-0.39302 -6.5
-0.39277 -6.4
-0.39253 -6.3
-0.39228 -6.1
-0.39204 -5.9
-0.3918 -5.8
-0.39155 -5.6
-0.39131 -5.4
-0.39106 -5.2
-0.39082 -5.0
-0.39058 -4.8
-0.39033 -4.6
-0.39009 -4.3
-0.38984 -4.1
-0.3896 -3.9
-0.38935 -3.6
-0.38911 -3.4
-0.38887 -3.1
-0.38862 -2.8
-0.38838 -2.6
-0.38813 -2.3
-0.38789 -2.0
-0.38765 -1.8
-0.3874 -1.5
-0.38716 -1.2
-0.38691 -0.9
-0.38667 -0.6
-0.38643 -0.3
-0.38618 0.0
-0.38594 0.2
-0.38569 0.5
-0.38545 0.8
-0.3852 1.1
-0.38496 1.4
-0.38472 1.7
-0.38447 1.9
-0.38423 2.2
-0.38398 2.5
-0.38374 2.8
-0.3835 3.0
-0.38325 3.3
-0.38301 3.5
-0.38276 3.8
-0.38252 4.0
-0.38227 4.3
-0.38203 4.5
-0.38179 4.7
-0.38154 5.0
-0.3813 5.2
-0.38105 5.4
-0.38081 5.6
-0.38057 5.8
-0.38032 5.9
-0.38008 6.1
-0.37983 6.3
-0.37959 6.4
-0.37934 6.6
-0.3791 6.7
-0.37886 6.8
-0.37861 6.9
-0.37837 7.0
-0.37812 7.1
-0.37788 7.2
-0.37764 7.3
-0.37739 7.3
-0.37715 7.4
-0.3769 7.4
-0.37666 7.5
-0.37642 7.5
-0.37617 7.5
-0.37593 7.5
-0.37568 7.4
-0.37544 7.4
-0.37519 7.4
-0.37495 7.3
-0.37471 7.3
-0.37446 7.2
-0.37422 7.1
-0.37397 7.0
-0.37373 6.9
-0.37349 6.8
-0.37324 6.6
-0.373 6.5
-0.37275 6.3
-0.37251 6.2
-0.37226 6.0
-0.37202 5.8
-0.37178 5.6
-0.37153 5.4
-0.37129 5.2
-0.37104 5.0
-0.3708 4.8
-0.37056 4.6
-0.37031 4.3
-0.37007 4.1
-0.36982 3.9
-0.36958 3.6
-0.36934 3.3
-0.36909 3.1
-0.36885 2.8
-0.3686 2.5
-0.36836 2.2
-0.36811 2.0
-0.36787 1.7
-0.36763 1.4
-0.36738 1.1
-0.36714 0.8
-0.36689 0.5
-0.36665 0.2
-0.36641 0.0
-0.36616 -0.4
-0.36592 -0.7
-0.36567 -1.0
-0.36543 -1.3
-0.36518 -1.5
-0.36494 -1.8
-0.3647 -2.1
-0.36445 -2.4
-0.36421 -2.7
-0.36396 -3.0
-0.36372 -3.2
-0.36348 -3.5
-0.36323 -3.8
-0.36299 -4.0
-0.36274 -4.3
-0.3625 -4.5
-0.36226 -4.7
-0.36201 -5.0
-0.36177 -5.2
-0.36152 -5.4
-0.36128 -5.6
-0.36103 -5.8
-0.36079 -6.0
-0.36055 -6.2
-0.3603 -6.3
-0.36006 -6.5
-0.35981 -6.6
-0.35957 -6.8
-0.35933 -6.9
-0.35908 -7.0
-0.35884 -7.1
-0.35859 -7.2
-0.35835 -7.3
-0.3581 -7.4
-0.35786 -7.4
-0.35762 -7.5
-0.35737 -7.5
-0.35713 -7.5
-0.35688 -7.6
-0.35664 -7.6
-0.3564 -7.5
-0.35615 -7.5
-0.35591 -7.5
-0.35566 -7.4
-0.35542 -7.4
-0.35518 -7.3
-0.35493 -7.2
-0.35469 -7.1
-0.35444 -7.0
-0.3542 -6.9
-0.35395 -6.8
-0.35371 -6.7
-0.35347 -6.5
-0.35322 -6.4
-0.35298 -6.2
-0.35273 -6.0
-0.35249 -5.8
-0.35225 -5.6
-0.352 -5.4
-0.35176 -5.2
-0.35151 -5.0
-0.35127 -4.7
-0.35102 -4.5
-0.35078 -4.3
-0.35054 -4.0
-0.35029 -3.7
-0.35005 -3.5
-0.3498 -3.2
-0.34956 -2.9
-0.34932 -2.6
-0.34907 -2.4
-0.34883 -2.1
-0.34858 -1.8
-0.34834 -1.5
-0.34809 -1.2
-0.34785 -0.9
-0.34761 -0.6
-0.34736 -0.3
-0.34712 0.0
-0.34687 0.3
-0.34663 0.6
-0.34639 0.9
-0.34614 1.2
-0.3459 1.5
-0.34565 1.8
-0.34541 2.1
-0.34517 2.4
-0.34492 2.7
-0.34468 3.0
-0.34443 3.3
-0.34419 3.6
-0.34394 3.8
-0.3437 4.1
-0.34346 4.3
-0.34321 4.6
-0.34297 4.8
-0.34272 5.1
-0.34248 5.3
-0.34224 5.5
-0.34199 5.7
-0.34175 5.9
-0.3415 6.1
-0.34126 6.3
-0.34101 6.5
-0.34077 6.6
-0.34053 6.8
-0.34028 6.9
-0.34004 7.0
-0.33979 7.1
-0.33955 7.3
-0.33931 7.3
-0.33906 7.4
-0.33882 7.5
-0.33857 7.5
-0.33833 7.6
-0.33809 7.6
-0.33784 7.6
-0.3376 7.7
-0.33735 7.6
-0.33711 7.6
-0.33686 7.6
-0.33662 7.6
-0.33638 7.5
-0.33613 7.4
-0.33589 7.4
-0.33564 7.3
-0.3354 7.2
-0.33516 7.0
-0.33491 6.9
-0.33467 6.8
-0.33442 6.6
-0.33418 6.5
-0.33393 6.3
-0.33369 6.1
-0.33345 5.9
-0.3332 5.7
-0.33296 5.5
-0.33271 5.3
-0.33247 5.0
-0.33223 4.8
-0.33198 4.6
-0.33174 4.3
-0.33149 4.0
-0.33125 3.8
-0.33101 3.5
-0.33076 3.2
-0.33052 2.9
-0.33027 2.6
-0.33003 2.4
-0.32978 2.1
-0.32954 1.7
-0.3293 1.4
-0.32905 1.1
-0.32881 0.8
-0.32856 0.5
-0.32832 0.2
-0.32808 -0.1
-0.32783 -0.4
-0.32759 -0.7
-0.32734 -1.1
-0.3271 -1.4
-0.32685 -1.7
-0.32661 -2.0
-0.32637 -2.3
-0.32612 -2.6
-0.32588 -2.9
-0.32563 -3.2
-0.32539 -3.5
-0.32515 -3.7
-0.3249 -4.0
-0.32466 -4.3
-0.32441 -4.5
-0.32417 -4.8
-0.32393 -5.0
-0.32368 -5.3
-0.32344 -5.5
-0.32319 -5.7
-0.32295 -5.9
-0.3227 -6.1
-0.32246 -6.3
-0.32222 -6.5
-0.32197 -6.7
-0.32173 -6.8
-0.32148 -7.0
-0.32124 -7.1
-0.321 -7.2
-0.32075 -7.3
-0.32051 -7.4
-0.32026 -7.5
-0.32002 -7.6
-0.31977 -7.6
-0.31953 -7.7
-0.31929 -7.7
-0.31904 -7.7
-0.3188 -7.8
-0.31855 -7.7
-0.31831 -7.7
-0.31807 -7.7
-0.31782 -7.6
-0.31758 -7.6
-0.31733 -7.5
-0.31709 -7.4
-0.31684 -7.3
-0.3166 -7.2
-0.31636 -7.1
-0.31611 -7.0
-0.31587 -6.8
-0.31562 -6.7
-0.31538 -6.5
-0.31514 -6.3
-0.31489 -6.1
-0.31465 -5.9
-0.3144 -5.7
-0.31416 -5.5
-0.31392 -5.2
-0.31367 -5.0
-0.31343 -4.8
-0.31318 -4.5
-0.31294 -4.2
-0.31269 -4.0
-0.31245 -3.7
-0.31221 -3.4
-0.31196 -3.1
-0.31172 -2.8
-0.31147 -2.5
-0.31123 -2.2
-0.31099 -1.9
-0.31074 -1.5
-0.3105 -1.2
-0.31025 -0.9
-0.31001 -0.6
-0.30976 -0.3
-0.30952 0.0
-0.30928 0.4
-0.30903 0.7
-0.30879 1.0
-0.30854 1.4
-0.3083 1.7
-0.30806 2.0
-0.30781 2.3
-0.30757 2.6
-0.30732 2.9
-0.30708 3.2
-0.30684 3.5
-0.30659 3.8
-0.30635 4.1
-0.3061 4.4
-0.30586 4.6
-0.30561 4.9
-0.30537 5.2
-0.30513 5.4
-0.30488 5.6
-0.30464 5.9
-0.30439 6.1
-0.30415 6.3
-0.30391 6.5
-0.30366 6.6
-0.30342 6.8
-0.30317 7.0
-0.30293 7.1
-0.30268 7.3
-0.30244 7.4
-0.3022 7.5
-0.30195 7.6
-0.30171 7.7
-0.30146 7.7
-0.30122 7.8
-0.30098 7.8
-0.30073 7.8
-0.30049 7.9
-0.30024 7.9
-0.3 7.8
-0.29976 7.8
-0.29951 7.8
-0.29927 7.7
-0.29902 7.6
-0.29878 7.6
-0.29853 7.5
-0.29829 7.4
-0.29805 7.2
-0.2978 7.1
-0.29756 6.9
-0.29731 6.8
-0.29707 6.6
-0.29683 6.4
-0.29658 6.2
-0.29634 6.0
-0.29609 5.8
-0.29585 5.6
-0.2956 5.3
-0.29536 5.1
-0.29512 4.8
-0.29487 4.5
-0.29463 4.3
-0.29438 4.0
-0.29414 3.7
-0.2939 3.4
-0.29365 3.1
-0.29341 2.8
-0.29316 2.5
-0.29292 2.1
-0.29268 1.8
-0.29243 1.5
-0.29219 1.2
-0.29194 0.8
-0.2917 0.5
-0.29145 0.1
-0.29121 -0.2
-0.29097 -0.5
-0.29072 -0.9
-0.29048 -1.2
-0.29023 -1.5
-0.28999 -1.9
-0.28975 -2.2
-0.2895 -2.5
-0.28926 -2.8
-0.28901 -3.1
-0.28877 -3.5
-0.28852 -3.8
-0.28828 -4.0
-0.28804 -4.3
-0.28779 -4.6
-0.28755 -4.9
-0.2873 -5.2
-0.28706 -5.4
-0.28682 -5.7
-0.28657 -5.9
-0.28633 -6.1
-0.28608 -6.3
-0.28584 -6.5
-0.28559 -6.7
-0.28535 -6.9
-0.28511 -7.1
-0.28486 -7.2
-0.28462 -7.3
-0.28437 -7.5
-0.28413 -7.6
-0.28389 -7.7
-0.28364 -7.8
-0.2834 -7.8
-0.28315 -7.9
-0.28291 -7.9
-0.28267 -8.0
-0.28242 -8.0
-0.28218 -8.0
-0.28193 -7.9
-0.28169 -7.9
-0.28144 -7.9
-0.2812 -7.8
-0.28096 -7.7
-0.28071 -7.6
-0.28047 -7.5
-0.28022 -7.4
-0.27998 -7.3
-0.27974 -7.1
-0.27949 -7.0
-0.27925 -6.8
-0.279 -6.6
-0.27876 -6.4
-0.27851 -6.2
-0.27827 -6.0
-0.27803 -5.7
-0.27778 -5.5
-0.27754 -5.2
-0.27729 -5.0
-0.27705 -4.7
-0.27681 -4.4
-0.27656 -4.1
-0.27632 -3.8
-0.27607 -3.5
-0.27583 -3.2
-0.27559 -2.9
-0.27534 -2.6
-0.2751 -2.2
-0.27485 -1.9
-0.27461 -1.6
-0.27436 -1.2
-0.27412 -0.9
-0.27388 -0.5
-0.27363 -0.2
-0.27339 0.2
-0.27314 0.5
-0.2729 0.9
-0.27266 1.2
-0.27241 1.6
-0.27217 1.9
-0.27192 2.2
-0.27168 2.6
-0.27143 2.9
-0.27119 3.2
-0.27095 3.6
-0.2707 3.9
-0.27046 4.2
-0.27021 4.5
-0.26997 4.8
-0.26973 5.0
-0.26948 5.3
-0.26924 5.6
-0.26899 5.8
-0.26875 6.1
-0.26851 6.3
-0.26826 6.5
-0.26802 6.7
-0.26777 6.9
-0.26753 7.1
-0.26728 7.2
-0.26704 7.4
-0.2668 7.5
-0.26655 7.6
-0.26631 7.8
-0.26606 7.8
-0.26582 7.9
-0.26558 8.0
-0.26533 8.0
-0.26509 8.1
-0.26484 8.1
-0.2646 8.1
-0.26435 8.1
-0.26411 8.0
-0.26387 8.0
-0.26362 7.9
-0.26338 7.9
-0.26313 7.8
-0.26289 7.7
-0.26265 7.5
-0.2624 7.4
-0.26216 7.2
-0.26191 7.1
-0.26167 6.9
-0.26143 6.7
-0.26118 6.5
-0.26094 6.3
-0.26069 6.0
-0.26045 5.8
-0.2602 5.6
-0.25996 5.3
-0.25972 5.0
-0.25947 4.7
-0.25923 4.4
-0.25898 4.1
-0.25874 3.8
-0.2585 3.5
-0.25825 3.2
-0.25801 2.8
-0.25776 2.5
-0.25752 2.1
-0.25727 1.8
-0.25703 1.4
-0.25679 1.1
-0.25654 0.7
-0.2563 0.4
-0.25605 0.0
-0.25581 -0.4
-0.25557 -0.7
-0.25532 -1.1
-0.25508 -1.4
-0.25483 -1.8
-0.25459 -2.1
-0.25434 -2.5
-0.2541 -2.8
-0.25386 -3.2
-0.25361 -3.5
-0.25337 -3.8
-0.25312 -4.2
-0.25288 -4.5
-0.25264 -4.8
-0.25239 -5.1
-0.25215 -5.3
-0.2519 -5.6
-0.25166 -5.9
-0.25142 -6.1
-0.25117 -6.4
-0.25093 -6.6
-0.25068 -6.8
-0.25044 -7.0
-0.25019 -7.2
-0.24995 -7.3
-0.24971 -7.5
-0.24946 -7.6
-0.24922 -7.8
-0.24897 -7.9
-0.24873 -8.0
-0.24849 -8.1
-0.24824 -8.1
-0.248 -8.2
-0.24775 -8.2
-0.24751 -8.2
-0.24726 -8.2
-0.24702 -8.2
-0.24678 -8.1
-0.24653 -8.1
-0.24629 -8.0
-0.24604 -7.9
-0.2458 -7.8
-0.24556 -7.7
-0.24531 -7.6
-0.24507 -7.4
-0.24482 -7.3
-0.24458 -7.1
-0.24434 -6.9
-0.24409 -6.7
-0.24385 -6.5
-0.2436 -6.2
-0.24336 -6.0
-0.24311 -5.7
-0.24287 -5.4
-0.24263 -5.2
-0.24238 -4.9
-0.24214 -4.6
-0.24189 -4.2
-0.24165 -3.9
-0.24141 -3.6
-0.24116 -3.3
-0.24092 -2.9
-0.24067 -2.6
-0.24043 -2.2
-0.24018 -1.8
-0.23994 -1.5
-0.2397 -1.1
-0.23945 -0.7
-0.23921 -0.3
-0.23896 0.0
-0.23872 0.4
-0.23848 0.8
-0.23823 1.2
-0.23799 1.5
-0.23774 1.9
-0.2375 2.3
-0.23726 2.6
-0.23701 3.0
-0.23677 3.3
-0.23652 3.7
-0.23628 4.0
-0.23603 4.3
-0.23579 4.7
-0.23555 5.0
-0.2353 5.3
-0.23506 5.6
-0.23481 5.8
-0.23457 6.1
-0.23433 6.3
-0.23408 6.6
-0.23384 6.8
-0.23359 7.0
-0.23335 7.2
-0.2331 7.4
-0.23286 7.6
-0.23262 7.7
-0.23237 7.9
-0.23213 8.0
-0.23188 8.1
-0.23164 8.2
-0.2314 8.2
-0.23115 8.3
-0.23091 8.3
-0.23066 8.3
-0.23042 8.3
-0.23018 8.3
-0.22993 8.3
-0.22969 8.2
-0.22944 8.1
-0.2292 8.1
-0.22895 7.9
-0.22871 7.8
-0.22847 7.7
-0.22822 7.5
-0.22798 7.4
-0.22773 7.2
-0.22749 7.0
-0.22725 6.7
-0.227 6.5
-0.22676 6.3
-0.22651 6.0
-0.22627 5.7
-0.22602 5.4
-0.22578 5.1
-0.22554 4.8
-0.22529 4.5
-0.22505 4.2
-0.2248 3.8
-0.22456 3.5
-0.22432 3.1
-0.22407 2.8
-0.22383 2.4
-0.22358 2.0
-0.22334 1.6
-0.22309 1.2
-0.22285 0.9
-0.22261 0.5
-0.22236 0.0
-0.22212 -0.3
-0.22187 -0.7
-0.22163 -1.1
-0.22139 -1.5
-0.22114 -1.9
-0.2209 -2.2
-0.22065 -2.6
-0.22041 -3.0
-0.22017 -3.4
-0.21992 -3.7
-0.21968 -4.1
-0.21943 -4.4
-0.21919 -4.7
-0.21894 -5.1
-0.2187 -5.4
-0.21846 -5.7
-0.21821 -6.0
-0.21797 -6.2
-0.21772 -6.5
-0.21748 -6.7
-0.21724 -7.0
-0.21699 -7.2
-0.21675 -7.4
-0.2165 -7.6
-0.21626 -7.8
-0.21601 -7.9
-0.21577 -8.0
-0.21553 -8.2
-0.21528 -8.3
-0.21504 -8.3
-0.21479 -8.4
-0.21455 -8.4
-0.21431 -8.5
-0.21406 -8.5
-0.21382 -8.5
-0.21357 -8.4
-0.21333 -8.4
-0.21309 -8.3
-0.21284 -8.2
-0.2126 -8.1
-0.21235 -8.0
-0.21211 -7.8
-0.21186 -7.7
-0.21162 -7.5
-0.21138 -7.3
-0.21113 -7.1
-0.21089 -6.9
-0.21064 -6.6
-0.2104 -6.4
-0.21016 -6.1
-0.20991 -5.8
-0.20967 -5.5
-0.20942 -5.2
-0.20918 -4.9
-0.20893 -4.5
-0.20869 -4.2
-0.20845 -3.8
-0.2082 -3.5
-0.20796 -3.1
-0.20771 -2.7
-0.20747 -2.3
-0.20723 -1.9
-0.20698 -1.5
-0.20674 -1.1
-0.20649 -0.7
-0.20625 -0.3
-0.20601 0.0
-0.20576 0.5
-0.20552 0.9
-0.20527 1.3
-0.20503 1.7
-0.20478 2.1
-0.20454 2.5
-0.2043 2.9
-0.20405 3.3
-0.20381 3.7
-0.20356 4.0
-0.20332 4.4
-0.20308 4.7
-0.20283 5.1
-0.20259 5.4
-0.20234 5.7
-0.2021 6.0
-0.20185 6.3
-0.20161 6.6
-0.20137 6.9
-0.20112 7.1
-0.20088 7.3
-0.20063 7.5
-0.20039 7.7
-0.20015 7.9
-0.1999 8.1
-0.19966 8.2
-0.19941 8.3
-0.19917 8.4
-0.19893 8.5
-0.19868 8.6
-0.19844 8.6
-0.19819 8.6
-0.19795 8.6
-0.1977 8.6
-0.19746 8.6
-0.19722 8.5
-0.19697 8.4
-0.19673 8.3
-0.19648 8.2
-0.19624 8.1
-0.196 7.9
-0.19575 7.7
-0.19551 7.5
-0.19526 7.3
-0.19502 7.1
-0.19477 6.8
-0.19453 6.6
-0.19429 6.3
-0.19404 6.0
-0.1938 5.7
-0.19355 5.4
-0.19331 5.0
-0.19307 4.7
-0.19282 4.3
-0.19258 3.9
-0.19233 3.5
-0.19209 3.2
-0.19184 2.8
-0.1916 2.3
-0.19136 1.9
-0.19111 1.5
-0.19087 1.1
-0.19062 0.7
-0.19038 0.2
-0.19014 -0.2
-0.18989 -0.6
-0.18965 -1.0
-0.1894 -1.5
-0.18916 -1.9
-0.18892 -2.3
-0.18867 -2.7
-0.18843 -3.1
-0.18818 -3.5
-0.18794 -3.9
-0.18769 -4.3
-0.18745 -4.7
-0.18721 -5.0
-0.18696 -5.4
-0.18672 -5.7
-0.18647 -6.0
-0.18623 -6.3
-0.18599 -6.6
-0.18574 -6.9
-0.1855 -7.2
-0.18525 -7.4
-0.18501 -7.6
-0.18476 -7.8
-0.18452 -8.0
-0.18428 -8.2
-0.18403 -8.3
-0.18379 -8.5
-0.18354 -8.6
-0.1833 -8.7
-0.18306 -8.7
-0.18281 -8.8
-0.18257 -8.8
-0.18232 -8.8
-0.18208 -8.8
-0.18184 -8.7
-0.18159 -8.6
-0.18135 -8.6
-0.1811 -8.5
-0.18086 -8.3
-0.18061 -8.2
-0.18037 -8.0
-0.18013 -7.8
-0.17988 -7.6
-0.17964 -7.4
-0.17939 -7.1
-0.17915 -6.8
-0.17891 -6.5
-0.17866 -6.2
-0.17842 -5.9
-0.17817 -5.6
-0.17793 -5.2
-0.17768 -4.9
-0.17744 -4.5
-0.1772 -4.1
-0.17695 -3.7
-0.17671 -3.3
-0.17646 -2.9
-0.17622 -2.5
-0.17598 -2.0
-0.17573 -1.6
-0.17549 -1.2
-0.17524 -0.7
-0.175 -0.3
-0.17476 0.2
-0.17451 0.6
-0.17427 1.1
-0.17402 1.5
-0.17378 2.0
-0.17353 2.4
-0.17329 2.8
-0.17305 3.3
-0.1728 3.7
-0.17256 4.1
-0.17231 4.5
-0.17207 4.9
-0.17183 5.2
-0.17158 5.6
-0.17134 5.9
-0.17109 6.3
-0.17085 6.6
-0.1706 6.9
-0.17036 7.2
-0.17012 7.4
-0.16987 7.7
-0.16963 7.9
-0.16938 8.1
-0.16914 8.3
-0.1689 8.5
-0.16865 8.6
-0.16841 8.7
-0.16816 8.8
-0.16792 8.9
-0.16768 8.9
-0.16743 9.0
-0.16719 9.0
-0.16694 8.9
-0.1667 8.9
-0.16645 8.8
-0.16621 8.7
-0.16597 8.6
-0.16572 8.5
-0.16548 8.3
-0.16523 8.1
-0.16499 7.9
-0.16475 7.7
-0.1645 7.4
-0.16426 7.2
-0.16401 6.9
-0.16377 6.6
-0.16352 6.3
-0.16328 5.9
-0.16304 5.6
-0.16279 5.2
-0.16255 4.8
-0.1623 4.4
-0.16206 4.0
-0.16182 3.6
-0.16157 3.1
-0.16133 2.7
-0.16108 2.2
-0.16084 1.8
-0.16059 1.3
-0.16035 0.9
-0.16011 0.4
-0.15986 0.0
-0.15962 -0.6
-0.15937 -1.0
-0.15913 -1.5
-0.15889 -2.0
-0.15864 -2.4
-0.1584 -2.9
-0.15815 -3.3
-0.15791 -3.8
-0.15767 -4.2
-0.15742 -4.6
-0.15718 -5.0
-0.15693 -5.4
-0.15669 -5.8
-0.15644 -6.1
-0.1562 -6.5
-0.15596 -6.8
-0.15571 -7.1
-0.15547 -7.4
-0.15522 -7.7
-0.15498 -7.9
-0.15474 -8.2
-0.15449 -8.4
-0.15425 -8.5
-0.154 -8.7
-0.15376 -8.8
-0.15351 -9.0
-0.15327 -9.0
-0.15303 -9.1
-0.15278 -9.1
-0.15254 -9.1
-0.15229 -9.1
-0.15205 -9.1
-0.15181 -9.0
-0.15156 -8.9
-0.15132 -8.8
-0.15107 -8.7
-0.15083 -8.5
-0.15059 -8.3
-0.15034 -8.1
-0.1501 -7.9
-0.14985 -7.6
-0.14961 -7.3
-0.14936 -7.0
-0.14912 -6.7
-0.14888 -6.3
-0.14863 -6.0
-0.14839 -5.6
-0.14814 -5.2
-0.1479 -4.8
-0.14766 -4.4
-0.14741 -3.9
-0.14717 -3.5
-0.14692 -3.0
-0.14668 -2.5
-0.14643 -2.1
-0.14619 -1.6
-0.14595 -1.1
-0.1457 -0.6
-0.14546 0.0
-0.14521 0.4
-0.14497 0.9
-0.14473 1.4
-0.14448 1.9
-0.14424 2.4
-0.14399 2.9
-0.14375 3.3
-0.14351 3.8
-0.14326 4.2
-0.14302 4.7
-0.14277 5.1
-0.14253 5.5
-0.14228 5.9
-0.14204 6.3
-0.1418 6.7
-0.14155 7.0
-0.14131 7.3
-0.14106 7.6
-0.14082 7.9
-0.14058 8.2
-0.14033 8.4
-0.14009 8.6
-0.13984 8.8
-0.1396 9.0
-0.13935 9.1
-0.13911 9.2
-0.13887 9.3
-0.13862 9.3
-0.13838 9.3
-0.13813 9.3
-0.13789 9.3
-0.13765 9.2
-0.1374 9.2
-0.13716 9.0
-0.13691 8.9
-0.13667 8.7
-0.13643 8.5
-0.13618 8.3
-0.13594 8.0
-0.13569 7.8
-0.13545 7.5
-0.1352 7.2
-0.13496 6.8
-0.13472 6.4
-0.13447 6.1
-0.13423 5.7
-0.13398 5.2
-0.13374 4.8
-0.1335 4.3
-0.13325 3.9
-0.13301 3.4
-0.13276 2.9
-0.13252 2.4
-0.13227 1.9
-0.13203 1.4
-0.13179 0.8
-0.13154 0.3
-0.1313 -0.2
-0.13105 -0.7
-0.13081 -1.3
-0.13057 -1.8
-0.13032 -2.3
-0.13008 -2.8
-0.12983 -3.3
-0.12959 -3.8
-0.12934 -4.3
-0.1291 -4.8
-0.12886 -5.2
-0.12861 -5.6
-0.12837 -6.1
-0.12812 -6.5
-0.12788 -6.9
-0.12764 -7.2
-0.12739 -7.6
-0.12715 -7.9
-0.1269 -8.2
-0.12666 -8.4
-0.12642 -8.7
-0.12617 -8.9
-0.12593 -9.1
-0.12568 -9.2
-0.12544 -9.4
-0.12519 -9.5
-0.12495 -9.5
-0.12471 -9.6
-0.12446 -9.6
-0.12422 -9.5
-0.12397 -9.5
-0.12373 -9.4
-0.12349 -9.3
-0.12324 -9.1
-0.123 -9.0
-0.12275 -8.8
-0.12251 -8.5
-0.12226 -8.3
-0.12202 -8.0
-0.12178 -7.7
-0.12153 -7.3
-0.12129 -7.0
-0.12104 -6.6
-0.1208 -6.1
-0.12056 -5.7
-0.12031 -5.3
-0.12007 -4.8
-0.11982 -4.3
-0.11958 -3.8
-0.11934 -3.3
-0.11909 -2.8
-0.11885 -2.2
-0.1186 -1.7
-0.11836 -1.1
-0.11811 -0.6
-0.11787 0.0
-0.11763 0.5
-0.11738 1.1
-0.11714 1.7
-0.11689 2.2
-0.11665 2.8
-0.11641 3.3
-0.11616 3.8
-0.11592 4.3
-0.11567 4.8
-0.11543 5.3
-0.11518 5.8
-0.11494 6.2
-0.1147 6.7
-0.11445 7.1
-0.11421 7.5
-0.11396 7.8
-0.11372 8.2
-0.11348 8.5
-0.11323 8.7
-0.11299 9.0
-0.11274 9.2
-0.1125 9.4
-0.11226 9.5
-0.11201 9.7
-0.11177 9.7
-0.11152 9.8
-0.11128 9.8
-0.11103 9.8
-0.11079 9.8
-0.11055 9.7
-0.1103 9.6
-0.11006 9.4
-0.10981 9.2
-0.10957 9.0
-0.10933 8.8
-0.10908 8.5
-0.10884 8.2
-0.10859 7.8
-0.10835 7.5
-0.1081 7.1
-0.10786 6.7
-0.10762 6.2
-0.10737 5.7
-0.10713 5.3
-0.10688 4.7
-0.10664 4.2
-0.1064 3.7
-0.10615 3.1
-0.10591 2.6
-0.10566 2.0
-0.10542 1.4
-0.10518 0.8
-0.10493 0.2
-0.10469 -0.4
-0.10444 -1.0
-0.1042 -1.6
-0.10395 -2.2
-0.10371 -2.8
-0.10347 -3.3
-0.10322 -3.9
-0.10298 -4.5
-0.10273 -5.0
-0.10249 -5.5
-0.10225 -6.0
-0.102 -6.5
-0.10176 -7.0
-0.10151 -7.4
-0.10127 -7.8
-0.10102 -8.2
-0.10078 -8.5
-0.10054 -8.8
-0.10029 -9.1
-0.10005 -9.4
-0.0998 -9.6
-0.09956 -9.7
-0.09932 -9.9
-0.09907 -10.0
-0.09883 -10.1
-0.09858 -10.1
-0.09834 -10.1
-0.09809 -10.0
-0.09785 -10.0
-0.09761 -9.8
-0.09736 -9.7
-0.09712 -9.5
-0.09687 -9.3
-0.09663 -9.0
-0.09639 -8.7
-0.09614 -8.3
-0.0959 -8.0
-0.09565 -7.6
-0.09541 -7.1
-0.09517 -6.7
-0.09492 -6.2
-0.09468 -5.7
-0.09443 -5.2
-0.09419 -4.6
-0.09394 -4.0
-0.0937 -3.4
-0.09346 -2.8
-0.09321 -2.2
-0.09297 -1.6
-0.09272 -0.9
-0.09248 -0.3
-0.09224 0.3
-0.09199 1.0
-0.09175 1.6
-0.0915 2.3
-0.09126 2.9
-0.09101 3.5
-0.09077 4.1
-0.09053 4.7
-0.09028 5.3
-0.09004 5.8
-0.08979 6.4
-0.08955 6.9
-0.08931 7.3
-0.08906 7.8
-0.08882 8.2
-0.08857 8.6
-0.08833 9.0
-0.08809 9.3
-0.08784 9.6
-0.0876 9.8
-0.08735 10.0
-0.08711 10.2
-0.08686 10.3
-0.08662 10.4
-0.08638 10.4
-0.08613 10.4
-0.08589 10.4
-0.08564 10.3
-0.0854 10.1
-0.08516 9.9
-0.08491 9.7
-0.08467 9.5
-0.08442 9.2
-0.08418 8.8
-0.08393 8.4
-0.08369 8.0
-0.08345 7.6
-0.0832 7.1
-0.08296 6.6
-0.08271 6.0
-0.08247 5.5
-0.08223 4.9
-0.08198 4.3
-0.08174 3.6
-0.08149 3.0
-0.08125 2.3
-0.08101 1.6
-0.08076 0.9
-0.08052 0.2
-0.08027 -0.5
-0.08003 -1.2
-0.07978 -1.8
-0.07954 -2.5
-0.0793 -3.2
-0.07905 -3.9
-0.07881 -4.5
-0.07856 -5.2
-0.07832 -5.8
-0.07808 -6.3
-0.07783 -6.9
-0.07759 -7.4
-0.07734 -7.9
-0.0771 -8.4
-0.07685 -8.8
-0.07661 -9.2
-0.07637 -9.6
-0.07612 -9.9
-0.07588 -10.1
-0.07563 -10.4
-0.07539 -10.5
-0.07515 -10.7
-0.0749 -10.7
-0.07466 -10.8
-0.07441 -10.7
-0.07417 -10.7
-0.07393 -10.5
-0.07368 -10.4
-0.07344 -10.2
-0.07319 -9.9
-0.07295 -9.6
-0.0727 -9.2
-0.07246 -8.8
-0.07222 -8.4
-0.07197 -7.9
-0.07173 -7.4
-0.07148 -6.8
-0.07124 -6.2
-0.071 -5.6
-0.07075 -5.0
-0.07051 -4.3
-0.07026 -3.6
-0.07002 -2.9
-0.06977 -2.2
-0.06953 -1.4
-0.06929 -0.7
-0.06904 0.1
-0.0688 0.9
-0.06855 1.6
-0.06831 2.4
-0.06807 3.1
-0.06782 3.8
-0.06758 4.6
-0.06733 5.3
-0.06709 5.9
-0.06684 6.6
-0.0666 7.2
-0.06636 7.8
-0.06611 8.3
-0.06587 8.8
-0.06562 9.3
-0.06538 9.7
-0.06514 10.0
-0.06489 10.4
-0.06465 10.6
-0.0644 10.8
-0.06416 11.0
-0.06392 11.1
-0.06367 11.2
-0.06343 11.2
-0.06318 11.1
-0.06294 11.0
-0.06269 10.8
-0.06245 10.6
-0.06221 10.3
-0.06196 9.9
-0.06172 9.5
-0.06147 9.1
-0.06123 8.6
-0.06099 8.0
-0.06074 7.5
-0.0605 6.8
-0.06025 6.2
-0.06001 5.5
-0.05976 4.7
-0.05952 4.0
-0.05928 3.2
-0.05903 2.4
-0.05879 1.6
-0.05854 0.7
-0.0583 -0.1
-0.05806 -0.9
-0.05781 -1.8
-0.05757 -2.6
-0.05732 -3.4
-0.05708 -4.2
-0.05684 -5.0
-0.05659 -5.8
-0.05635 -6.5
-0.0561 -7.2
-0.05586 -7.8
-0.05561 -8.5
-0.05537 -9.0
-0.05513 -9.6
-0.05488 -10.0
-0.05464 -10.4
-0.05439 -10.8
-0.05415 -11.1
-0.05391 -11.3
-0.05366 -11.5
-0.05342 -11.6
-0.05317 -11.6
-0.05293 -11.6
-0.05268 -11.5
-0.05244 -11.4
-0.0522 -11.1
-0.05195 -10.8
-0.05171 -10.5
-0.05146 -10.0
-0.05122 -9.6
-0.05098 -9.0
-0.05073 -8.4
-0.05049 -7.8
-0.05024 -7.1
-0.05 -6.3
-0.04976 -5.5
-0.04951 -4.7
-0.04927 -3.8
-0.04902 -3.0
-0.04878 -2.1
-0.04853 -1.1
-0.04829 -0.2
-0.04805 0.7
-0.0478 1.7
-0.04756 2.6
-0.04731 3.5
-0.04707 4.4
-0.04683 5.3
-0.04658 6.1
-0.04634 7.0
-0.04609 7.7
-0.04585 8.5
-0.0456 9.1
-0.04536 9.7
-0.04512 10.3
-0.04487 10.8
-0.04463 11.2
-0.04438 11.6
-0.04414 11.8
-0.0439 12.0
-0.04365 12.2
-0.04341 12.2
-0.04316 12.2
-0.04292 12.1
-0.04268 11.9
-0.04243 11.6
-0.04219 11.2
-0.04194 10.8
-0.0417 10.2
-0.04145 9.7
-0.04121 9.0
-0.04097 8.3
-0.04072 7.5
-0.04048 6.6
-0.04023 5.8
-0.03999 4.8
-0.03975 3.8
-0.0395 2.8
-0.03926 1.8
-0.03901 0.7
-0.03877 -0.3
-0.03852 -1.4
-0.03828 -2.5
-0.03804 -3.5
-0.03779 -4.5
-0.03755 -5.5
-0.0373 -6.5
-0.03706 -7.4
-0.03682 -8.3
-0.03657 -9.1
-0.03633 -9.9
-0.03608 -10.6
-0.03584 -11.2
-0.03559 -11.7
-0.03535 -12.1
-0.03511 -12.5
-0.03486 -12.7
-0.03462 -12.9
-0.03437 -12.9
-0.03413 -12.9
-0.03389 -12.7
-0.03364 -12.5
-0.0334 -12.1
-0.03315 -11.6
-0.03291 -11.1
-0.03267 -10.4
-0.03242 -9.7
-0.03218 -8.9
-0.03193 -8.0
-0.03169 -7.0
-0.03144 -6.0
-0.0312 -4.9
-0.03096 -3.7
-0.03071 -2.6
-0.03047 -1.3
-0.03022 -0.1
-0.02998 1.1
-0.02974 2.4
-0.02949 3.6
-0.02925 4.8
-0.029 6.0
-0.02876 7.1
-0.02851 8.2
-0.02827 9.2
-0.02803 10.1
-0.02778 11.0
-0.02754 11.7
-0.02729 12.3
-0.02705 12.9
-0.02681 13.3
-0.02656 13.6
-0.02632 13.8
-0.02607 13.8
-0.02583 13.7
-0.02559 13.5
-0.02534 13.1
-0.0251 12.6
-0.02485 12.0
-0.02461 11.2
-0.02436 10.4
-0.02412 9.4
-0.02388 8.3
-0.02363 7.1
-0.02339 5.8
-0.02314 4.5
-0.0229 3.1
-0.02266 1.7
-0.02241 0.2
-0.02217 -1.3
-0.02192 -2.8
-0.02168 -4.3
-0.02143 -5.7
-0.02119 -7.1
-0.02095 -8.4
-0.0207 -9.7
-0.02046 -10.8
-0.02021 -11.8
-0.01997 -12.7
-0.01973 -13.5
-0.01948 -14.1
-0.01924 -14.6
-0.01899 -14.8
-0.01875 -14.9
-0.01851 -14.9
-0.01826 -14.6
-0.01802 -14.1
-0.01777 -13.5
-0.01753 -12.7
-0.01728 -11.7
-0.01704 -10.5
-0.0168 -9.2
-0.01655 -7.7
-0.01631 -6.2
-0.01606 -4.5
-0.01582 -2.7
-0.01558 -0.9
-0.01533 1.0
-0.01509 2.8
-0.01484 4.7
-0.0146 6.5
-0.01435 8.2
-0.01411 9.9
-0.01387 11.4
-0.01362 12.7
-0.01338 13.9
-0.01313 14.9
-0.01289 15.7
-0.01265 16.2
-0.0124 16.4
-0.01216 16.4
-0.01191 16.1
-0.01167 15.6
-0.01143 14.7
-0.01118 13.6
-0.01094 12.2
-0.01069 10.5
-0.01045 8.7
-0.0102 6.6
-0.00996 4.4
-0.00972 2.0
-0.00947 -0.4
-0.00923 -2.9
-0.00898 -5.4
-0.00874 -7.8
-0.0085 -10.1
-0.00825 -12.2
-0.00801 -14.1
-0.00776 -15.8
-0.00752 -17.0
-0.00727 -18.0
-0.00703 -18.5
-0.00679 -18.5
-0.00654 -18.1
-0.0063 -17.2
-0.00605 -15.8
-0.00581 -14.0
-0.00557 -11.7
-0.00532 -9.0
-0.00508 -6.0
-0.00483 -2.7
-0.00459 0.8
-0.00434 4.3
-0.0041 7.8
-0.00386 11.2
-0.00361 14.3
-0.00337 17.0
-0.00312 19.1
-0.00288 20.5
-0.00264 21.2
-0.00239 21.0
-0.00215 19.9
-0.0019 17.8
-0.00166 14.8
-0.00142 10.9
-0.00117 6.3
-0.00093 1.1
-0.00068 -4.4
-0.00044 -9.9
-0.00019 -14.8
5e-05 -18.9
0.00029 -21.7
0.00054 -22.7
0.00078 -21.8
0.00103 -18.8
0.00127 -14.1
0.00151 -8.0
0.00176 -1.1
0.002 5.8
0.00225 11.8
0.00249 16.2
0.00274 18.5
0.00298 18.3
0.00322 15.9
0.00347 11.5
0.00371 5.9
0.00396 0.0
0.0042 -5.4
0.00444 -9.6
0.00469 -12.1
0.00493 -12.5
0.00518 -11.1
0.00542 -8.2
0.00566 -4.4
0.00591 -0.4
0.00615 3.3
0.0064 6.0
0.00664 7.5
0.00689 7.6
0.00713 6.5
0.00737 4.6
0.00762 2.1
0.00786 -0.4
0.00811 -2.5
0.00835 -3.9
0.00859 -4.6
0.00884 -4.4
0.00908 -3.5
0.00933 -2.2
0.00957 -0.7
0.00982 0.8
0.01006 1.9
0.0103 2.6
0.01055 2.8
0.01079 2.5
0.01104 1.8
0.01128 0.9
0.01152 0.0
0.01177 -0.8
0.01201 -1.4
0.01226 -1.7
0.0125 -1.6
0.01274 -1.3
0.01299 -0.8
0.01323 -0.3
0.01348 0.3
0.01372 0.7
0.01397 1.0
0.01421 1.0
0.01445 0.9
0.0147 0.7
0.01494 0.3
0.01519 0.0
0.01543 -0.3
0.01567 -0.5
0.01592 -0.6
0.01616 -0.6
0.01641 -0.5
0.01665 -0.3
0.0169 0.0
0.01714 0.1
0.01738 0.3
0.01763 0.4
0.01787 0.4
0.01812 0.3
0.01836 0.2
0.0186 0.1
0.01885 0.0
0.01909 -0.1
0.01934 -0.2
0.01958 -0.2
0.01982 -0.2
0.02007 -0.2
0.02031 -0.1
0.02056 0.0
0.0208 0.0
0.02105 0.0
0.02129 0.1
0.02153 0.1
0.02178 0.1
0.02202 0.0
0.02227 0.0
0.02251 0.0
0.02275 0.0
0.023 0.0
0.02324 0.0
0.02349 0.0
0.02373 0.0
0.02398 0.0
0.02422 0.0
0.02446 0.0
0.02471 0.0
0.02495 0.0
0.0252 0.0
0.02544 0.0
0.02568 0.0
0.02593 0.0
0.02617 0.0
0.02642 0.0
0.02666 0.0
0.02691 0.0
0.02715 0.0
0.02739 0.0
0.02764 0.0
0.02788 0.0
0.02813 0.0
0.02837 0.0
0.02861 0.0
0.02886 0.0
0.0291 0.0
0.02935 0.0
0.02959 0.0
0.02983 0.0
0.03008 0.0
0.03032 0.0
0.03057 0.0
0.03081 0.0
0.03106 0.0
0.0313 0.0
0.03154 0.0
0.03179 0.0
0.03203 0.0
0.03228 0.0
0.03252 0.0
0.03276 0.0
0.03301 0.0
0.03325 0.0
0.0335 0.0
0.03374 0.0
0.03399 0.0
0.03423 0.0
0.03447 0.0
0.03472 0.0
0.03496 0.0
0.03521 0.0
0.03545 0.0
0.03569 0.0
0.03594 0.0
0.03618 0.0
0.03643 0.0
0.03667 0.0
0.03691 0.0
0.03716 0.0
0.0374 0.0
0.03765 0.0
0.03789 0.0
0.03814 0.0
0.03838 0.0
0.03862 0.0
0.03887 0.0
0.03911 0.0
0.03936 0.0
0.0396 0.0
0.03984 0.0
0.04009 0.0
0.04033 0.0
0.04058 0.0
0.04082 0.0
0.04107 0.0
0.04131 0.0
0.04155 0.0
0.0418 0.0
0.04204 0.0
0.04229 0.0
0.04253 0.0
0.04277 0.0
0.04302 0.0
0.04326 0.0
0.04351 0.0
0.04375 0.0
0.04399 0.0
0.04424 0.0
0.04448 0.0
0.04473 0.0
0.04497 0.0
0.04522 0.0
0.04546 0.0
0.0457 0.0
0.04595 0.0
0.04619 0.0
0.04644 0.0
0.04668 0.0
0.04692 0.0
0.04717 0.0
0.04741 0.0
0.04766 0.0
0.0479 0.0
0.04815 0.0
0.04839 0.0
0.04863 0.0
0.04888 0.0
0.04912 0.0
0.04937 0.0
0.04961 0.0
0.04985 0.0
0.0501 0.0
0.05034 0.0
0.05059 0.0
0.05083 0.0
0.05107 0.0
0.05132 0.0
0.05156 0.0
0.05181 0.0
0.05205 0.0
0.0523 0.0
0.05254 0.0
0.05278 0.0
0.05303 0.0
0.05327 0.0
0.05352 0.0
0.05376 0.0
0.054 0.0
0.05425 0.0
0.05449 0.0
0.05474 0.0
0.05498 0.0
0.05523 0.0
0.05547 0.0
0.05571 0.0
0.05596 0.0
0.0562 0.0
0.05645 0.0
0.05669 0.0
0.05693 0.0
0.05718 0.0
0.05742 0.0
0.05767 0.0
0.05791 0.0
0.05816 0.0
0.0584 0.0
0.05864 0.0
0.05889 0.0
0.05913 0.0
0.05938 0.0
0.05962 0.0
0.05986 0.0
0.06011 0.0
0.06035 0.0
0.0606 0.0
0.06084 0.0
0.06108 0.0
0.06133 0.0
0.06157 0.0
0.06182 0.0
0.06206 0.0
0.06231 0.0
0.06255 0.0
0.06279 0.0
0.06304 0.0
0.06328 0.0
0.06353 0.0
0.06377 0.0
0.06401 0.0
0.06426 0.0
0.0645 0.0
0.06475 0.0
0.06499 0.0
0.06524 0.0
0.06548 0.0
0.06572 0.0
0.06597 0.0
0.06621 0.0
0.06646 0.0
0.0667 0.0
0.06694 0.0
0.06719 0.0
0.06743 0.0
0.06768 0.0
0.06792 0.0
0.06816 0.0
0.06841 0.0
0.06865 0.0
0.0689 0.0
0.06914 0.0
0.06939 0.0
0.06963 0.0
0.06987 0.0
0.07012 0.0
0.07036 0.0
0.07061 0.0
0.07085 0.0
0.07109 0.0
0.07134 0.0
0.07158 0.0
0.07183 0.0
0.07207 0.0
0.07232 0.0
0.07256 0.0
0.0728 0.0
0.07305 0.0
0.07329 0.0
0.07354 0.0
0.07378 0.0
0.07402 0.0
0.07427 0.0
0.07451 0.0
0.07476 0.0
0.075 0.0
0.07524 0.0
0.07549 0.0
0.07573 0.0
0.07598 0.0
0.07622 0.0
0.07647 0.0
0.07671 0.0
0.07695 0.0
0.0772 0.0
0.07744 0.0
0.07769 0.0
0.07793 0.0
0.07817 0.0
0.07842 0.0
0.07866 0.0
0.07891 0.0
0.07915 0.0
0.0794 0.0
0.07964 0.0
0.07988 0.0
0.08013 0.0
0.08037 0.0
0.08062 0.0
0.08086 0.0
0.0811 0.0
0.08135 0.0
0.08159 0.0
0.08184 0.0
0.08208 0.0
0.08232 0.0
0.08257 0.0
0.08281 0.0
0.08306 0.0
0.0833 0.0
0.08355 0.0
0.08379 0.0
0.08403 0.0
0.08428 0.0
0.08452 0.0
0.08477 0.0
0.08501 0.0
0.08525 0.0
0.0855 0.0
0.08574 0.0
0.08599 0.0
0.08623 0.0
0.08648 0.0
0.08672 0.0
0.08696 0.0
0.08721 0.0
0.08745 0.0
0.0877 0.0
0.08794 0.0
0.08818 0.0
0.08843 0.0
0.08867 0.0
0.08892 0.0
0.08916 0.0
0.08941 0.0
0.08965 0.0
0.08989 0.0
0.09014 0.0
0.09038 0.0
0.09063 0.0
0.09087 0.0
0.09111 0.0
0.09136 0.0
0.0916 0.0
0.09185 0.0
0.09209 0.0
0.09233 0.0
0.09258 0.0
0.09282 0.0
0.09307 0.0
0.09331 0.0
0.09356 0.0
0.0938 0.0
0.09404 0.0
0.09429 0.0
0.09453 0.0
0.09478 0.0
0.09502 0.0
0.09526 0.0
0.09551 0.0
0.09575 0.0
0.096 0.0
0.09624 0.0
0.09649 0.0
0.09673 0.0
0.09697 0.0
0.09722 0.0
0.09746 0.0
0.09771 0.0
0.09795 0.0
0.09819 0.0
0.09844 0.0
0.09868 0.0
0.09893 0.0
0.09917 0.0
0.09941 0.0
0.09966 0.0
0.0999 0.0
0.10015 0.0
0.10039 0.0
0.10064 0.0
0.10088 0.0
0.10112 0.0
0.10137 0.0
0.10161 0.0
0.10186 0.0
0.1021 0.0
0.10234 0.0
0.10259 0.0
0.10283 0.0
0.10308 0.0
0.10332 0.0
0.10357 0.0
0.10381 0.0
0.10405 0.0
0.1043 0.0
0.10454 0.0
0.10479 0.0
0.10503 0.0
0.10527 0.0
0.10552 0.0
0.10576 0.0
0.10601 0.0
0.10625 0.0
0.10649 0.0
0.10674 0.0
0.10698 0.0
0.10723 0.0
0.10747 0.0
0.10772 0.0
0.10796 0.0
0.1082 0.0
0.10845 0.0
0.10869 0.0
0.10894 0.0
0.10918 0.0
0.10942 0.0
0.10967 0.0
0.10991 0.0
0.11016 0.0
0.1104 0.0
0.11065 0.0
0.11089 0.0
0.11113 0.0
0.11138 0.0
0.11162 0.0
0.11187 0.0
0.11211 0.0
0.11235 0.0
0.1126 0.0
0.11284 0.0
0.11309 0.0
0.11333 0.0
0.11357 0.0
0.11382 0.0
0.11406 0.0
0.11431 0.0
0.11455 0.0
0.1148 0.0
0.11504 0.0
0.11528 0.0
0.11553 0.0
0.11577 0.0
0.11602 0.0
0.11626 0.0
0.1165 0.0
0.11675 0.0
0.11699 0.0
0.11724 0.0
0.11748 0.0
0.11773 0.0
0.11797 0.0
0.11821 0.0
0.11846 0.0
0.1187 0.0
0.11895 0.0
0.11919 0.0
0.11943 0.0
0.11968 0.0
0.11992 0.0
0.12017 0.0
0.12041 0.0
0.12066 0.0
0.1209 0.0
0.12114 0.0
0.12139 0.0
0.12163 0.0
0.12188 0.0
0.12212 0.0
0.12236 0.0
0.12261 0.0
0.12285 0.0
0.1231 0.0
0.12334 0.0
0.12358 0.0
0.12383 0.0
0.12407 0.0
0.12432 0.0
0.12456 0.0
0.12481 0.0
0.12505 0.0
0.12529 0.0
0.12554 0.0
0.12578 0.0
0.12603 0.0
0.12627 0.0
0.12651 0.0
0.12676 0.0
0.127 0.0
0.12725 0.0
0.12749 0.0
0.12774 0.0
0.12798 0.0
0.12822 0.0
0.12847 0.0
0.12871 0.0
0.12896 0.0
0.1292 0.0
0.12944 0.0
0.12969 0.0
0.12993 0.0
0.13018 0.0
0.13042 0.0
0.13066 0.0
0.13091 0.0
0.13115 0.0
0.1314 0.0
0.13164 0.0
0.13189 0.0
0.13213 0.0
0.13237 0.0
0.13262 0.0
0.13286 0.0
0.13311 0.0
0.13335 0.0
0.13359 0.0
0.13384 0.0
0.13408 0.0
0.13433 0.0
0.13457 0.0
0.13482 0.0
0.13506 0.0
0.1353 0.0
0.13555 0.0
0.13579 0.0
0.13604 0.0
0.13628 0.0
0.13652 0.0
0.13677 0.0
0.13701 0.0
0.13726 0.0
0.1375 0.0
0.13774 0.0
0.13799 0.0
0.13823 0.0
0.13848 0.0
0.13872 0.0
0.13897 0.0
0.13921 0.0
0.13945 0.0
0.1397 0.0
0.13994 0.0
0.14019 0.0
0.14043 0.0
0.14067 0.0
0.14092 0.0
0.14116 0.0
0.14141 0.0
0.14165 0.0
0.1419 0.0
0.14214 0.0
0.14238 0.0
0.14263 0.0
0.14287 0.0
0.14312 0.0
0.14336 0.0
0.1436 0.0
0.14385 0.0
0.14409 0.0
0.14434 0.0
0.14458 0.0
0.14482 0.0
0.14507 0.0
0.14531 0.0
0.14556 0.0
0.1458 0.0
0.14605 0.0
0.14629 0.0
0.14653 0.0
0.14678 0.0
0.14702 0.0
0.14727 0.0
0.14751 0.0
0.14775 0.0
0.148 0.0
0.14824 0.0
0.14849 0.0
0.14873 0.0
