X1:UNI-EPICS_TEST_EPICS_STRING 1 1.000000000000000e+00 1
X1:FEC-11_DACDT_ENABLE 1 OFF 1
X1:UNI-EPICS_TEST_EPICS_BIN_IN 1 OFF 1
X1:UNI-EPICS_TEST_EPICS_IN_WITH_CONTROL_MASK 1 OFF 1
X1:UNI-EX_EPICS_BIN_IN 1 OFF 1
X1:UNI-LogicalOperator_Test_AND_INPUT_1 1 OFF 1
X1:UNI-LogicalOperator_Test_AND_INPUT_2 1 OFF 1
X1:UNI-LogicalOperator_Test_NANDM_INPUT_1 1 OFF 1
X1:UNI-LogicalOperator_Test_NANDM_INPUT_2 1 OFF 1
X1:UNI-LogicalOperator_Test_NANDM_INPUT_3 1 OFF 1
X1:UNI-LogicalOperator_Test_NANDM_INPUT_4 1 OFF 1
X1:UNI-LogicalOperator_Test_NANDM_INPUT_5 1 OFF 1
X1:UNI-LogicalOperator_Test_NAND_INPUT_1 1 OFF 1
X1:UNI-LogicalOperator_Test_NAND_INPUT_2 1 OFF 1
X1:UNI-LogicalOperator_Test_NOR_INPUT_1 1 OFF 1
X1:UNI-LogicalOperator_Test_NOR_INPUT_2 1 OFF 1
X1:UNI-LogicalOperator_Test_NOT_INPUT_1 1 OFF 1
X1:UNI-LogicalOperator_Test_OR_INPUT_1 1 OFF 1
X1:UNI-LogicalOperator_Test_OR_INPUT_2 1 OFF 1
X1:UNI-LogicalOperator_Test_XOR_INPUT_1 1 OFF 1
X1:UNI-LogicalOperator_Test_XOR_INPUT_2 1 OFF 1
X1:UNI-FM0_TRAMP 1 1.000000000000000e+00 1
X1:UNI-FM0_OFFSET 1 1.000000000000000e+00 1
X1:UNI-FM0_GAIN 1 0.000000000000000e+00 1
X1:UNI-FM0_LIMIT 1 1.000000000000000e+00 1
X1:UNI-FM0_SW1S 1 0.000000000000000e+00 0xffffffff
X1:UNI-FM0_SW2S 1 0.5120000000000000e+03 0xffffffff
X1:UNI-FM1_TRAMP 1 1.000000000000000e+00 1
X1:UNI-FM1_OFFSET 1 1.000000000000000e+00 1
X1:UNI-FM1_GAIN 1 0.000000000000000e+00 1
X1:UNI-FM1_LIMIT 1 1.000000000000000e+00 1
X1:UNI-FM1_SW1S 1 0.000000000000000e+00 0xffffffff
X1:UNI-FM1_SW2S 1 0.5120000000000000e+03 0xffffffff
X1:UNI-FM10_TRAMP 1 1.000000000000000e+00 1
X1:UNI-FM10_OFFSET 1 1.000000000000000e+00 1
X1:UNI-FM10_GAIN 1 0.000000000000000e+00 1
X1:UNI-FM10_LIMIT 1 1.000000000000000e+00 1
X1:UNI-FM10_SW1S 1 0.000000000000000e+00 0xffffffff
X1:UNI-FM10_SW2S 1 0.5120000000000000e+03 0xffffffff
X1:UNI-FM11_TRAMP 1 1.000000000000000e+00 1
X1:UNI-FM11_OFFSET 1 1.000000000000000e+00 1
X1:UNI-FM11_GAIN 1 0.000000000000000e+00 1
X1:UNI-FM11_LIMIT 1 1.000000000000000e+00 1
X1:UNI-FM11_SW1S 1 0.000000000000000e+00 0xffffffff
X1:UNI-FM11_SW2S 1 0.5120000000000000e+03 0xffffffff
X1:UNI-FM12_TRAMP 1 1.000000000000000e+00 1
X1:UNI-FM12_OFFSET 1 1.000000000000000e+00 1
X1:UNI-FM12_GAIN 1 0.000000000000000e+00 1
X1:UNI-FM12_LIMIT 1 1.000000000000000e+00 1
X1:UNI-FM12_SW1S 1 0.000000000000000e+00 0xffffffff
X1:UNI-FM12_SW2S 1 0.5120000000000000e+03 0xffffffff
X1:UNI-FM13_TRAMP 1 1.000000000000000e+00 1
X1:UNI-FM13_OFFSET 1 1.000000000000000e+00 1
X1:UNI-FM13_GAIN 1 0.000000000000000e+00 1
X1:UNI-FM13_LIMIT 1 1.000000000000000e+00 1
X1:UNI-FM13_SW1S 1 0.000000000000000e+00 0xffffffff
X1:UNI-FM13_SW2S 1 0.5120000000000000e+03 0xffffffff
X1:UNI-FM14_TRAMP 1 1.000000000000000e+00 1
X1:UNI-FM14_OFFSET 1 1.000000000000000e+00 1
X1:UNI-FM14_GAIN 1 0.000000000000000e+00 1
X1:UNI-FM14_LIMIT 1 1.000000000000000e+00 1
X1:UNI-FM14_SW1S 1 0.000000000000000e+00 0xffffffff
X1:UNI-FM14_SW2S 1 0.5120000000000000e+03 0xffffffff
X1:UNI-FM15_TRAMP 1 1.000000000000000e+00 1
X1:UNI-FM15_OFFSET 1 1.000000000000000e+00 1
X1:UNI-FM15_GAIN 1 0.000000000000000e+00 1
X1:UNI-FM15_LIMIT 1 1.000000000000000e+00 1
X1:UNI-FM15_SW1S 1 0.000000000000000e+00 0xffffffff
X1:UNI-FM15_SW2S 1 0.5120000000000000e+03 0xffffffff
X1:UNI-FM16_TRAMP 1 1.000000000000000e+00 1
X1:UNI-FM16_OFFSET 1 1.000000000000000e+00 1
X1:UNI-FM16_GAIN 1 0.000000000000000e+00 1
X1:UNI-FM16_LIMIT 1 1.000000000000000e+00 1
X1:UNI-FM16_SW1S 1 0.000000000000000e+00 0xffffffff
X1:UNI-FM16_SW2S 1 0.5120000000000000e+03 0xffffffff
X1:UNI-FM17_TRAMP 1 1.000000000000000e+00 1
X1:UNI-FM17_OFFSET 1 1.000000000000000e+00 1
X1:UNI-FM17_GAIN 1 0.000000000000000e+00 1
X1:UNI-FM17_LIMIT 1 1.000000000000000e+00 1
X1:UNI-FM17_SW1S 1 0.000000000000000e+00 0xffffffff
X1:UNI-FM17_SW2S 1 0.5120000000000000e+03 0xffffffff
X1:UNI-FM18_TRAMP 1 1.000000000000000e+00 1
X1:UNI-FM18_OFFSET 1 1.000000000000000e+00 1
X1:UNI-FM18_GAIN 1 0.000000000000000e+00 1
X1:UNI-FM18_LIMIT 1 1.000000000000000e+00 1
X1:UNI-FM18_SW1S 1 0.000000000000000e+00 0xffffffff
X1:UNI-FM18_SW2S 1 0.5120000000000000e+03 0xffffffff
X1:UNI-FM19_TRAMP 1 1.000000000000000e+00 1
X1:UNI-FM19_OFFSET 1 1.000000000000000e+00 1
X1:UNI-FM19_GAIN 1 0.000000000000000e+00 1
X1:UNI-FM19_LIMIT 1 1.000000000000000e+00 1
X1:UNI-FM19_SW1S 1 0.000000000000000e+00 0xffffffff
X1:UNI-FM19_SW2S 1 0.5120000000000000e+03 0xffffffff
X1:UNI-FM2_TRAMP 1 1.000000000000000e+00 1
X1:UNI-FM2_OFFSET 1 1.000000000000000e+00 1
X1:UNI-FM2_GAIN 1 0.000000000000000e+00 1
X1:UNI-FM2_LIMIT 1 1.000000000000000e+00 1
X1:UNI-FM2_SW1S 1 0.000000000000000e+00 0xffffffff
X1:UNI-FM2_SW2S 1 0.5120000000000000e+03 0xffffffff
X1:UNI-FM20_TRAMP 1 1.000000000000000e+00 1
X1:UNI-FM20_OFFSET 1 1.000000000000000e+00 1
X1:UNI-FM20_GAIN 1 0.000000000000000e+00 1
X1:UNI-FM20_LIMIT 1 1.000000000000000e+00 1
X1:UNI-FM20_SW1S 1 0.000000000000000e+00 0xffffffff
X1:UNI-FM20_SW2S 1 0.5120000000000000e+03 0xffffffff
X1:UNI-FM21_TRAMP 1 1.000000000000000e+00 1
X1:UNI-FM21_OFFSET 1 1.000000000000000e+00 1
X1:UNI-FM21_GAIN 1 0.000000000000000e+00 1
X1:UNI-FM21_LIMIT 1 1.000000000000000e+00 1
X1:UNI-FM21_SW1S 1 0.000000000000000e+00 0xffffffff
X1:UNI-FM21_SW2S 1 0.5120000000000000e+03 0xffffffff
X1:UNI-FM22_TRAMP 1 1.000000000000000e+00 1
X1:UNI-FM22_OFFSET 1 1.000000000000000e+00 1
X1:UNI-FM22_GAIN 1 0.000000000000000e+00 1
X1:UNI-FM22_LIMIT 1 1.000000000000000e+00 1
X1:UNI-FM22_SW1S 1 0.000000000000000e+00 0xffffffff
X1:UNI-FM22_SW2S 1 0.5120000000000000e+03 0xffffffff
X1:UNI-FM23_TRAMP 1 1.000000000000000e+00 1
X1:UNI-FM23_OFFSET 1 1.000000000000000e+00 1
X1:UNI-FM23_GAIN 1 0.000000000000000e+00 1
X1:UNI-FM23_LIMIT 1 1.000000000000000e+00 1
X1:UNI-FM23_SW1S 1 0.000000000000000e+00 0xffffffff
X1:UNI-FM23_SW2S 1 0.5120000000000000e+03 0xffffffff
X1:UNI-FM24_TRAMP 1 1.000000000000000e+00 1
X1:UNI-FM24_OFFSET 1 1.000000000000000e+00 1
X1:UNI-FM24_GAIN 1 0.000000000000000e+00 1
X1:UNI-FM24_LIMIT 1 1.000000000000000e+00 1
X1:UNI-FM24_SW1S 1 0.000000000000000e+00 0xffffffff
X1:UNI-FM24_SW2S 1 0.5120000000000000e+03 0xffffffff
X1:UNI-FM25_TRAMP 1 1.000000000000000e+00 1
X1:UNI-FM25_OFFSET 1 1.000000000000000e+00 1
X1:UNI-FM25_GAIN 1 0.000000000000000e+00 1
X1:UNI-FM25_LIMIT 1 1.000000000000000e+00 1
X1:UNI-FM25_SW1S 1 0.000000000000000e+00 0xffffffff
X1:UNI-FM25_SW2S 1 0.5120000000000000e+03 0xffffffff
X1:UNI-FM26_TRAMP 1 1.000000000000000e+00 1
X1:UNI-FM26_OFFSET 1 1.000000000000000e+00 1
X1:UNI-FM26_GAIN 1 0.000000000000000e+00 1
X1:UNI-FM26_LIMIT 1 1.000000000000000e+00 1
X1:UNI-FM26_SW1S 1 0.000000000000000e+00 0xffffffff
X1:UNI-FM26_SW2S 1 0.5120000000000000e+03 0xffffffff
X1:UNI-FM27_TRAMP 1 1.000000000000000e+00 1
X1:UNI-FM27_OFFSET 1 1.000000000000000e+00 1
X1:UNI-FM27_GAIN 1 0.000000000000000e+00 1
X1:UNI-FM27_LIMIT 1 1.000000000000000e+00 1
X1:UNI-FM27_SW1S 1 0.000000000000000e+00 0xffffffff
X1:UNI-FM27_SW2S 1 0.5120000000000000e+03 0xffffffff
X1:UNI-FM28_TRAMP 1 1.000000000000000e+00 1
X1:UNI-FM28_OFFSET 1 1.000000000000000e+00 1
X1:UNI-FM28_GAIN 1 0.000000000000000e+00 1
X1:UNI-FM28_LIMIT 1 1.000000000000000e+00 1
X1:UNI-FM28_SW1S 1 0.000000000000000e+00 0xffffffff
X1:UNI-FM28_SW2S 1 0.5120000000000000e+03 0xffffffff
X1:UNI-FM29_TRAMP 1 1.000000000000000e+00 1
X1:UNI-FM29_OFFSET 1 1.000000000000000e+00 1
X1:UNI-FM29_GAIN 1 0.000000000000000e+00 1
X1:UNI-FM29_LIMIT 1 1.000000000000000e+00 1
X1:UNI-FM29_SW1S 1 0.000000000000000e+00 0xffffffff
X1:UNI-FM29_SW2S 1 0.5120000000000000e+03 0xffffffff
X1:UNI-FM3_TRAMP 1 1.000000000000000e+00 1
X1:UNI-FM3_OFFSET 1 1.000000000000000e+00 1
X1:UNI-FM3_GAIN 1 0.000000000000000e+00 1
X1:UNI-FM3_LIMIT 1 1.000000000000000e+00 1
X1:UNI-FM3_SW1S 1 0.000000000000000e+00 0xffffffff
X1:UNI-FM3_SW2S 1 0.5120000000000000e+03 0xffffffff
X1:UNI-FM31_TRAMP 1 1.000000000000000e+00 1
X1:UNI-FM31_OFFSET 1 1.000000000000000e+00 1
X1:UNI-FM31_GAIN 1 0.000000000000000e+00 1
X1:UNI-FM31_LIMIT 1 1.000000000000000e+00 1
X1:UNI-FM31_SW1S 1 0.000000000000000e+00 0xffffffff
X1:UNI-FM31_SW2S 1 0.5120000000000000e+03 0xffffffff
X1:UNI-FM4_TRAMP 1 1.000000000000000e+00 1
X1:UNI-FM4_OFFSET 1 1.000000000000000e+00 1
X1:UNI-FM4_GAIN 1 0.000000000000000e+00 1
X1:UNI-FM4_LIMIT 1 1.000000000000000e+00 1
X1:UNI-FM4_SW1S 1 0.000000000000000e+00 0xffffffff
X1:UNI-FM4_SW2S 1 0.5120000000000000e+03 0xffffffff
X1:UNI-FM5_TRAMP 1 1.000000000000000e+00 1
X1:UNI-FM5_OFFSET 1 1.000000000000000e+00 1
X1:UNI-FM5_GAIN 1 0.000000000000000e+00 1
X1:UNI-FM5_LIMIT 1 1.000000000000000e+00 1
X1:UNI-FM5_SW1S 1 0.000000000000000e+00 0xffffffff
X1:UNI-FM5_SW2S 1 0.5120000000000000e+03 0xffffffff
X1:UNI-FM6_TRAMP 1 1.000000000000000e+00 1
X1:UNI-FM6_OFFSET 1 1.000000000000000e+00 1
X1:UNI-FM6_GAIN 1 0.000000000000000e+00 1
X1:UNI-FM6_LIMIT 1 1.000000000000000e+00 1
X1:UNI-FM6_SW1S 1 0.000000000000000e+00 0xffffffff
X1:UNI-FM6_SW2S 1 0.5120000000000000e+03 0xffffffff
X1:UNI-FM7_TRAMP 1 1.000000000000000e+00 1
X1:UNI-FM7_OFFSET 1 1.000000000000000e+00 1
X1:UNI-FM7_GAIN 1 0.000000000000000e+00 1
X1:UNI-FM7_LIMIT 1 1.000000000000000e+00 1
X1:UNI-FM7_SW1S 1 0.000000000000000e+00 0xffffffff
X1:UNI-FM7_SW2S 1 0.5120000000000000e+03 0xffffffff
X1:UNI-FM8_TRAMP 1 1.000000000000000e+00 1
X1:UNI-FM8_OFFSET 1 1.000000000000000e+00 1
X1:UNI-FM8_GAIN 1 0.000000000000000e+00 1
X1:UNI-FM8_LIMIT 1 1.000000000000000e+00 1
X1:UNI-FM8_SW1S 1 0.000000000000000e+00 0xffffffff
X1:UNI-FM8_SW2S 1 0.5120000000000000e+03 0xffffffff
X1:UNI-FM9_TRAMP 1 1.000000000000000e+00 1
X1:UNI-FM9_OFFSET 1 1.000000000000000e+00 1
X1:UNI-FM9_GAIN 1 0.000000000000000e+00 1
X1:UNI-FM9_LIMIT 1 1.000000000000000e+00 1
X1:UNI-FM9_SW1S 1 0.000000000000000e+00 0xffffffff
X1:UNI-FM9_SW2S 1 0.5120000000000000e+03 0xffffffff
X1:UNI-MATRIX_TEST_FILTMUXMATRIX_1_1_TRAMP 1 1.000000000000000e+00 1
X1:UNI-MATRIX_TEST_FILTMUXMATRIX_1_1_OFFSET 1 1.000000000000000e+00 1
X1:UNI-MATRIX_TEST_FILTMUXMATRIX_1_1_GAIN 1 0.000000000000000e+00 1
X1:UNI-MATRIX_TEST_FILTMUXMATRIX_1_1_LIMIT 1 1.000000000000000e+00 1
X1:UNI-MATRIX_TEST_FILTMUXMATRIX_1_1_SW1S 1 0.000000000000000e+00 0xffffffff
X1:UNI-MATRIX_TEST_FILTMUXMATRIX_1_1_SW2S 1 0.5120000000000000e+03 0xffffffff
X1:UNI-MATRIX_TEST_FILTMUXMATRIX_2_1_TRAMP 1 1.000000000000000e+00 1
X1:UNI-MATRIX_TEST_FILTMUXMATRIX_2_1_OFFSET 1 1.000000000000000e+00 1
X1:UNI-MATRIX_TEST_FILTMUXMATRIX_2_1_GAIN 1 0.000000000000000e+00 1
X1:UNI-MATRIX_TEST_FILTMUXMATRIX_2_1_LIMIT 1 1.000000000000000e+00 1
X1:UNI-MATRIX_TEST_FILTMUXMATRIX_2_1_SW1S 1 0.000000000000000e+00 0xffffffff
X1:UNI-MATRIX_TEST_FILTMUXMATRIX_2_1_SW2S 1 0.5120000000000000e+03 0xffffffff
X1:UNI-MATRIX_TEST_FILTMUXMATRIX_1_2_TRAMP 1 1.000000000000000e+00 1
X1:UNI-MATRIX_TEST_FILTMUXMATRIX_1_2_OFFSET 1 1.000000000000000e+00 1
X1:UNI-MATRIX_TEST_FILTMUXMATRIX_1_2_GAIN 1 0.000000000000000e+00 1
X1:UNI-MATRIX_TEST_FILTMUXMATRIX_1_2_LIMIT 1 1.000000000000000e+00 1
X1:UNI-MATRIX_TEST_FILTMUXMATRIX_1_2_SW1S 1 0.000000000000000e+00 0xffffffff
X1:UNI-MATRIX_TEST_FILTMUXMATRIX_1_2_SW2S 1 0.5120000000000000e+03 0xffffffff
X1:UNI-MATRIX_TEST_FILTMUXMATRIX_2_2_TRAMP 1 1.000000000000000e+00 1
X1:UNI-MATRIX_TEST_FILTMUXMATRIX_2_2_OFFSET 1 1.000000000000000e+00 1
X1:UNI-MATRIX_TEST_FILTMUXMATRIX_2_2_GAIN 1 0.000000000000000e+00 1
X1:UNI-MATRIX_TEST_FILTMUXMATRIX_2_2_LIMIT 1 1.000000000000000e+00 1
X1:UNI-MATRIX_TEST_FILTMUXMATRIX_2_2_SW1S 1 0.000000000000000e+00 0xffffffff
X1:UNI-MATRIX_TEST_FILTMUXMATRIX_2_2_SW2S 1 0.5120000000000000e+03 0xffffffff
X1:UNI-MATRIX_TEST_MUXMATRIX_1_1 1 1.000000000000000e+00 1
X1:UNI-MATRIX_TEST_MUXMATRIX_1_2 1 1.000000000000000e+00 1
X1:UNI-MATRIX_TEST_MUXMATRIX_2_1 1 1.000000000000000e+00 1
X1:UNI-MATRIX_TEST_MUXMATRIX_2_2 1 1.000000000000000e+00 1
X1:UNI-MATRIX_TEST_RAMPMUXMATRIX_1_1 1 1.000000000000000e+00 1
X1:UNI-MATRIX_TEST_RAMPMUXMATRIX_1_2 1 1.000000000000000e+00 1
X1:UNI-MATRIX_TEST_RAMPMUXMATRIX_2_1 1 1.000000000000000e+00 1
X1:UNI-MATRIX_TEST_RAMPMUXMATRIX_2_2 1 1.000000000000000e+00 1
X1:UNI-MATRIX_TEST_RAMPMUXMATRIX_SETTING_1_1 1 1.000000000000000e+00 1
X1:UNI-MATRIX_TEST_RAMPMUXMATRIX_SETTING_1_2 1 1.000000000000000e+00 1
X1:UNI-MATRIX_TEST_RAMPMUXMATRIX_SETTING_2_1 1 1.000000000000000e+00 1
X1:UNI-MATRIX_TEST_RAMPMUXMATRIX_SETTING_2_2 1 1.000000000000000e+00 1
X1:UNI-MATRIX_TEST_RAMPMUXMATRIX1_1_1 1 1.000000000000000e+00 1
X1:UNI-MATRIX_TEST_RAMPMUXMATRIX1_1_2 1 1.000000000000000e+00 1
X1:UNI-MATRIX_TEST_RAMPMUXMATRIX1_1_3 1 1.000000000000000e+00 1
X1:UNI-MATRIX_TEST_RAMPMUXMATRIX1_2_1 1 1.000000000000000e+00 1
X1:UNI-MATRIX_TEST_RAMPMUXMATRIX1_2_2 1 1.000000000000000e+00 1
X1:UNI-MATRIX_TEST_RAMPMUXMATRIX1_2_3 1 1.000000000000000e+00 1
X1:UNI-MATRIX_TEST_RAMPMUXMATRIX1_3_1 1 1.000000000000000e+00 1
X1:UNI-MATRIX_TEST_RAMPMUXMATRIX1_3_2 1 1.000000000000000e+00 1
X1:UNI-MATRIX_TEST_RAMPMUXMATRIX1_3_3 1 1.000000000000000e+00 1
X1:UNI-MATRIX_TEST_RAMPMUXMATRIX1_4_1 1 1.000000000000000e+00 1
X1:UNI-MATRIX_TEST_RAMPMUXMATRIX1_4_2 1 1.000000000000000e+00 1
X1:UNI-MATRIX_TEST_RAMPMUXMATRIX1_4_3 1 1.000000000000000e+00 1
X1:UNI-MATRIX_TEST_RAMPMUXMATRIX1_SETTING_1_1 1 1.000000000000000e+00 1
X1:UNI-MATRIX_TEST_RAMPMUXMATRIX1_SETTING_1_2 1 1.000000000000000e+00 1
X1:UNI-MATRIX_TEST_RAMPMUXMATRIX1_SETTING_1_3 1 1.000000000000000e+00 1
X1:UNI-MATRIX_TEST_RAMPMUXMATRIX1_SETTING_2_1 1 1.000000000000000e+00 1
X1:UNI-MATRIX_TEST_RAMPMUXMATRIX1_SETTING_2_2 1 1.000000000000000e+00 1
X1:UNI-MATRIX_TEST_RAMPMUXMATRIX1_SETTING_2_3 1 1.000000000000000e+00 1
X1:UNI-MATRIX_TEST_RAMPMUXMATRIX1_SETTING_3_1 1 1.000000000000000e+00 1
X1:UNI-MATRIX_TEST_RAMPMUXMATRIX1_SETTING_3_2 1 1.000000000000000e+00 1
X1:UNI-MATRIX_TEST_RAMPMUXMATRIX1_SETTING_3_3 1 1.000000000000000e+00 1
X1:UNI-MATRIX_TEST_RAMPMUXMATRIX1_SETTING_4_1 1 1.000000000000000e+00 1
X1:UNI-MATRIX_TEST_RAMPMUXMATRIX1_SETTING_4_2 1 1.000000000000000e+00 1
X1:UNI-MATRIX_TEST_RAMPMUXMATRIX1_SETTING_4_3 1 1.000000000000000e+00 1
X1:FEC-11_BURT_RESTORE 1 1.000000000000000e+00 1
X1:UNI-TTEST_REMOTE_IPC_PAUSE 1 1.000000000000000e+00 1
X1:UNI-DAC_15_EPICS_INPUT 1 1.000000000000000e+00 1
X1:UNI-EPICS_TEST_EPICS_BIN_OUT 1 1.000000000000000e+00 1
X1:UNI-EPICS_TEST_EPICS_IN 1 1.000000000000000e+00 1
X1:UNI-EPICS_TEST_EPICS_IN_WITH_CONTROL 1 1.000000000000000e+00 1
X1:UNI-EPICS_TEST_EPICS_IN_WITH_CONTROL_VAL 1 1.000000000000000e+00 1
X1:UNI-EPICS_TEST_EPICS_MOMENTARY_OUT 1 1.000000000000000e+00 1
X1:UNI-MATRIX_TEST_FILTMUXMATRIX_IN_1 1 1.000000000000000e+00 1
X1:UNI-MATRIX_TEST_FILTMUXMATRIX_IN_2 1 1.000000000000000e+00 1
X1:UNI-MATRIX_TEST_MUXMATRIX_IN_1 1 1.000000000000000e+00 1
X1:UNI-MATRIX_TEST_MUXMATRIX_IN_2 1 1.000000000000000e+00 1
X1:UNI-MATRIX_TEST_RAMPMUXMATRIX_TRAMP 1 1.000000000000000e+00 1
X1:UNI-MATRIX_TEST_RAMPMUXMATRIX1_TRAMP 1 1.000000000000000e+00 1
X1:UNI-MATRIX_TEST_RAMPMUXMATRIX1_IN_1 1 1.000000000000000e+00 1
X1:UNI-MATRIX_TEST_RAMPMUXMATRIX1_IN_2 1 1.000000000000000e+00 1
X1:UNI-MATRIX_TEST_RAMPMUXMATRIX1_IN_3 1 1.000000000000000e+00 1
X1:UNI-MATRIX_TEST_RAMPMUXMATRIX_IN_1 1 1.000000000000000e+00 1
X1:UNI-MATRIX_TEST_RAMPMUXMATRIX_IN_2 1 1.000000000000000e+00 1
X1:UNI-MathFunction_Test_LOG10_INPUT_1 1 1.000000000000000e+00 1
X1:UNI-MathFunction_Test_MOD_INPUT_1 1 1.000000000000000e+00 1
X1:UNI-MathFunction_Test_MOD_INPUT_2 1 1.000000000000000e+00 1
X1:UNI-MathFunction_Test_RECIPROCAL_INPUT_1 1 1.000000000000000e+00 1
X1:UNI-MathFunction_Test_SQUARE_INPUT_1 1 1.000000000000000e+00 1
X1:UNI-OSC_FIXED_PHASE_FREQ 1 1.000000000000000e+00 1
X1:UNI-OSC_FIXED_PHASE_CLKGAIN 1 1.000000000000000e+00 1
X1:UNI-OSC_FIXED_PHASE_SINGAIN 1 1.000000000000000e+00 1
X1:UNI-OSC_FIXED_PHASE_COSGAIN 1 1.000000000000000e+00 1
X1:UNI-OSC_FIXED_PHASE_TRAMP 1 1.000000000000000e+00 1
X1:UNI-OSC_REGULAR_FREQ 1 1.000000000000000e+00 1
X1:UNI-OSC_REGULAR_CLKGAIN 1 1.000000000000000e+00 1
X1:UNI-OSC_REGULAR_SINGAIN 1 1.000000000000000e+00 1
X1:UNI-OSC_REGULAR_COSGAIN 1 1.000000000000000e+00 1
X1:UNI-OSC_REGULAR_TRAMP 1 1.000000000000000e+00 1
X1:UNI-Product_Divide_Sum_Abs_Test_ABS_INPUT_1 1 1.000000000000000e+00 1
X1:UNI-Product_Divide_Sum_Abs_Test_ADD_INPUT_1 1 1.000000000000000e+00 1
X1:UNI-Product_Divide_Sum_Abs_Test_ADD_INPUT_2 1 1.000000000000000e+00 1
X1:UNI-Product_Divide_Sum_Abs_Test_ADD_INPUT_3 1 1.000000000000000e+00 1
X1:UNI-Product_Divide_Sum_Abs_Test_ADD_INPUT_4 1 1.000000000000000e+00 1
X1:UNI-Product_Divide_Sum_Abs_Test_DIVIDE_INPUT_1 1 1.000000000000000e+00 1
X1:UNI-Product_Divide_Sum_Abs_Test_DIVIDE_INPUT_2 1 1.000000000000000e+00 1
X1:UNI-Product_Divide_Sum_Abs_Test_DIVIDE_INPUT_3 1 1.000000000000000e+00 1
X1:UNI-Product_Divide_Sum_Abs_Test_PRODUCT_INPUT_1 1 1.000000000000000e+00 1
X1:UNI-Product_Divide_Sum_Abs_Test_PRODUCT_INPUT_2 1 1.000000000000000e+00 1
X1:UNI-Product_Divide_Sum_Abs_Test_PRODUCT_INPUT_3 1 1.000000000000000e+00 1
X1:UNI-UnitDelay_Test_UNITE_INPUT_1 1 1.000000000000000e+00 1
