{
    "state_space_configs":[
        {
            "part_name": "STATESPACE_TEST_1IN_1OUT", 
            "state_vec_len":2, 
            "input_vec_len":1, 
            "output_vec_len":1, 
            "state_vector":[1,0], 
            "state_matrix":[
                -0.2516, -0.1684, 2.784, 0.3549
            ], 
                 
            "input_matrix":[
                0, 
                3
            ], 
                 
            "output_matrix":[
                0,
                1
            ], 
                 
            "feedthrough_matrix":[0]
        },
        {
            "part_name": "STATESPACE_TEST_4IN_2OUT", 
            "state_vec_len":10, 
            "input_vec_len":4, 
            "output_vec_len":2, 
            "state_vector":[10,0,0,0,0,0,0,0,0,0], 
            "state_matrix":[
                -0.089899144313870444, 
                -0.43317532123681823, 
                -0.14747523702755796, 
                0.087337398984908068, 
                0.158382966982755, 
                0.47990205686681636, 
                -0.05910462941923432, 
                -0.039989150465032638, 
                0.12124537064225713, 
                0.062415269616876788, 
                -0.40933252590566171, 
                -0.028979110497171241, 
                0.11224829771433202, 
                -0.41405632967813227, 
                0.25188089065502767, 
                0.13128904588150209, 
                -0.10270512266815095, 
                -0.24484564155069166, 
                -0.25343930682828275, 
                -0.077835208557405069, 
                -0.16757571153726877, 
                0.13309081643149229, 
                -0.12855156188575784, 
                0.20030477211577605, 
                -0.060621951855011624, 
                0.17825996740927588, 
                0.21878379472981985, 
                -0.41469728444524051, 
                0.0379565089275374, 
                0.30193883742148914, 
                0.061655823001786993, 
                -0.41724589383530331, 
                0.22544362319543326, 
                -0.0096110654576838112, 
                0.03523269275216067, 
                -0.063167278628638551, 
                0.028853593713710692, 
                0.22832356231860179, 
                -0.05386409639902285, 
                0.42844820310096232, 
                0.18344321360047389, 
                0.23143319356537165, 
                -0.065290458358025188, 
                0.060609765468082617, 
                0.23958155755820129, 
                0.13329914661360132, 
                -0.26874473220170025, 
                0.11229472362537875, 
                0.45494510620823819, 
                0.14014846801959269, 
                0.487852303021243, 
                0.10558511992066225, 
                0.1929796321726221, 
                -0.034417497477476543, 
                0.1131009067772256, 
                0.16878198803192559, 
                0.030609791072089561, 
                -0.16780758840986282, 
                -0.27711312471961064, 
                -0.1180781725761436, 
                -0.087657128636472237, 
                -0.057052535543094862, 
                0.20525632616026399, 
                -0.024139371063707182, 
                -0.24524781293686951, 
                0.0150511279416185, 
                0.16176805025609334, 
                -0.28450737151258138, 
                0.35234576817319935, 
                -0.013067679728187427, 
                -0.032589213997701122, 
                -0.26168028042785829, 
                -0.40697373891516236, 
                0.24744643039095832, 
                0.1009467026044642, 
                -0.16544344044424222, 
                -0.27851626320988238, 
                -0.37515476799493719, 
                0.043822536742983621, 
                -0.15813102566473519, 
                0.11873837027245793, 
                -0.22651728780502509, 
                0.017451649987754246, 
                -0.0831977423064067, 
                0.48109179091302251, 
                -0.27083882154994665, 
                0.32490603783972227, 
                0.050408039083336936, 
                0.3382594352474077, 
                -0.2213916301456571, 
                0.046532581095341204, 
                -0.076579544843631664, 
                0.31476433846154, 
                0.42497099852193432, 
                0.12784717710768428, 
                -0.13478194445663838, 
                0.015839731283484208, 
                -0.16895557414437815, 
                -0.20358977062258984, 
                -0.39059817175595513
            ], 
                 
            "input_matrix":[
                1.1274922783415902, 
                -0.53355710931598743, 
                1.3513857684266568, 
                -0.86546803055480381, 
                0.35017941060331165, 
                -2.0026357358830604, 
                -0.2247710560525841, 
                -0.17653411423145093, 
                -0.2990660303329824, 
                0.96422942263162748, 
                -0.58902903072080126, 
                0.791416061628634, 
                0.022889792751629775, 
                0, 
                -0.29375359773541609, 
                -1.3320044213152473, 
                -0.26199543496609196, 
                -0.020027851642538078, 
                -0.8479262436379339, 
                -0, 
                -1.7502123684467896, 
                -0.034771086028482959, 
                -1.1201283012437278, 
                -1.4490972928387393, 
                -0, 
                -0, 
                2.5259996921183094, 
                0, 
                -0.83136651156762431, 
                0, 
                1.6554975928873457, 
                0.39135360443290096, 
                -0.97920630516730212, 
                -0.13321747950773469, 
                0.30753515923825192, 
                0.45167941892823754, 
                -1.1564016556640022, 
                -0.71453016378715839, 
                -1.2571183593520534, 
                -0.13028465314572063
            ], 
                 
            "output_matrix":[
                0.18368909586194213, 
                0, 
                0.45502955644433435, 
                -0.3348869389640477, 
                1.039090653504956, 
                1.2606587091208963, 
                -0.067865553542687335, 
                -0, 
                0.023045624425105282, 
                0.82606279021159545, 
                -0.47615301661907383, 
                -1.3616944708707543, 
                -0.848709379933659, 
                0.55278334594455014, 
                -1.1176386832652081, 
                0, 
                -0, 
                -0, 
                0.0512903558487747, 
                1.5269766867333727
            ], 
                 
            "feedthrough_matrix":[
                0.46691443568470004, 
                0.62519035708762571, 
                -1.0297675435666211, 
                0, 
                -0, 
                0, 
                0, 
                0
            ]
        }
    ]
}