{
    "graceid": "E194539",
    "gpstime": 1238065339.32,
    "pipeline": "Fermi",
    "labels": [],
    "group": "External",
    "extra_attributes": {
        "GRB": {
            "author_ivorn": "ivo://nasa.gsfc.tan/gcn",
            "dec": -67.8274,
            "designation": null,
            "redshift": null,
            "how_description": "Fermi Satellite, GBM Instrument",
            "coord_system": "UTC-FK5-GEO",
            "trigger_id": "123456789",
            "error_radius": 8.8374,
            "how_reference_url": "http://gcn.gsfc.nasa.gov/fermi.html",
            "ra": 345.99,
            "ivorn": "fake_ivorn",
            "trigger_duration": null,
            "author_shortname": "Fermi (via VO-GCN)",
            "T90": null,
            "observatory_location_id": "GEOLUN"
        }
    },
    "links": {
        "neighbors": "https://gracedb-test.ligo.org/api/events/E194539/neighbors/",
        "files": "https://gracedb-test.ligo.org/api/events/E194539/files/",
        "log": "https://gracedb-test.ligo.org/api/events/E194539/log/",
        "tags": "https://gracedb-test.ligo.org/api/events/E194539/tag/",
        "self": "https://gracedb-test.ligo.org/api/events/E194539",
        "labels": "https://gracedb-test.ligo.org/api/events/E194539/labels/",
        "emobservations": "https://gracedb-test.ligo.org/api/events/E194539/emobservation/"
    },
    "created": "2022-03-16 18:25:37 UTC",
    "far": null,
    "instruments": "",
    "warnings": [],
    "search": null,
    "nevents": null,
    "superevent": null,
    "submitter": "enrico.fermi@LIGO.ORG",
    "superevent_neighbours": {},
    "offline": false,
    "likelihood": null,
    "far_is_upper_limit": false
}
