0,69772
1,96498
2,10869
3,90055
4,50682
5,57746
6,4017
7,85039
8,36370
9,41043
10,37429
11,87811
12,15681
13,23599
14,91422
15,78053
16,71384
17,79306
18,93171
19,50920
20,37486
21,63805
22,71519
23,48441
24,43950
25,40024
26,12942
27,13834
28,9283
29,37812
30,91752
31,76443
32,13627
33,16787
34,28948
35,9728
36,19701
37,61616
38,34961
39,5465
40,17433
41,52044
42,525
43,23536
44,6111
45,60550
46,39552
47,63329
48,88078
49,20888
50,29483
51,72104
52,58305
53,64261
54,78068
55,95517
56,7981
57,20589
58,41378
59,47067
60,19329
61,89321
62,23702
63,43297
64,68432
65,18036
66,3763
67,70269
68,70271
69,68816
70,98957
71,27261
72,1322
73,79782
74,75510
75,69921
76,63719
77,87239
78,9257
79,62257
80,70489
81,63686
82,83179
83,34567
84,86790
85,4125
86,92285
87,39495
88,36126
89,25396
90,24510
91,18711
92,10102
93,4719
94,46300
95,73941
96,37078
97,26697
98,74168
99,51905
