0,95631
1,78100
2,64161
3,51010
4,79770
5,6727
6,38913
7,65215
8,26693
9,86100
10,89145
11,92947
12,33667
13,66611
14,22116
15,78742
16,69298
17,92367
18,50048
19,26253
20,37941
21,66755
22,40122
23,62394
24,70916
25,20211
26,28071
27,22855
28,49199
29,53841
30,47664
31,17825
32,20084
33,27456
34,77703
35,85256
36,68549
37,36234
38,44486
39,54435
40,68524
41,42340
42,40698
43,6664
44,97918
45,70158
46,94798
47,31859
48,81896
49,24406
50,56759
51,4191
52,97446
53,73883
54,993
55,81558
56,95651
57,92105
58,32190
59,24179
60,76802
61,1918
62,99272
63,37529
64,91961
65,93823
66,42794
67,48013
68,2271
69,20775
70,49554
71,70870
72,8249
73,99159
74,86235
75,44193
76,49900
77,13932
78,7370
79,81147
80,58603
81,52739
82,4957
83,33117
84,77678
85,13534
86,61157
87,85294
88,7873
89,58258
90,5635
91,43893
92,99773
93,13690
94,35897
95,24324
96,42964
97,4160
98,28671
99,11531
