0,40723
1,39912
2,85375
3,87906
4,6224
5,68670
6,12450
7,78486
8,27652
9,4170
10,1153
11,37490
12,57223
13,48789
14,93561
15,33290
16,373
17,42701
18,64354
19,23543
20,21958
21,26413
22,37090
23,59633
24,89586
25,40394
26,52362
27,38880
28,92996
29,74441
30,8608
31,93111
32,574
33,59712
34,29184
35,76081
36,8011
37,16068
38,28628
39,61227
40,83529
41,23183
42,82474
43,15932
44,18442
45,33265
46,31946
47,49219
48,47030
49,24635
50,50088
51,99136
52,40718
53,23088
54,17992
55,20447
56,69467
57,75850
58,84513
59,40596
60,97633
61,49351
62,35660
63,21224
64,22416
65,39475
66,20936
67,59123
68,53624
69,89900
70,21185
71,5736
72,1615
73,4381
74,27238
75,38539
76,1951
77,71112
78,14894
79,1850
80,39011
81,63741
82,98324
83,72795
84,1154
85,35475
86,56069
87,22008
88,62655
89,37398
90,49349
91,71361
92,64875
93,85618
94,93418
95,24711
96,42886
97,34082
98,89363
99,56237
