{
    "graceid": "G194537",
    "gpstime": 1216336200.66,
    "pipeline": "oLIB",
    "labels": [],
    "group": "Burst",
    "extra_attributes": {
        "LalInferenceBurst": {
            "omicron_snr_H1": 4.98,
            "omicron_snr_L1": 4.99,
            "hrss_mean": 8.12e-23,
            "frequency_median": 718.03,
            "hrss_median": 2.19e-23,
            "omicron_snr_network": 6.91,
            "quality_mean": 15.2,
            "bsn": 7.19,
            "frequency_mean": 721.23,
            "quality_median": 15.1,
            "omicron_snr_V1": null,
            "bci": 1.111
        }
    },
    "links": {
        "neighbors": "https://gracedb-test.ligo.org/api/events/G194537/neighbors/",
        "files": "https://gracedb-test.ligo.org/api/events/G194537/files/",
        "log": "https://gracedb-test.ligo.org/api/events/G194537/log/",
        "tags": "https://gracedb-test.ligo.org/api/events/G194537/tag/",
        "self": "https://gracedb-test.ligo.org/api/events/G194537",
        "labels": "https://gracedb-test.ligo.org/api/events/G194537/labels/",
        "emobservations": "https://gracedb-test.ligo.org/api/events/G194537/emobservation/"
    },
    "created": "2022-03-16 18:21:37 UTC",
    "far": 7.22e-06,
    "instruments": "H1,L1",
    "warnings": [],
    "search": "AllSky",
    "nevents": 1,
    "superevent": null,
    "submitter": "albert.einstein@LIGO.ORG",
    "superevent_neighbours": {},
    "offline": false,
    "likelihood": null,
    "far_is_upper_limit": false
}
