{
    "FAR" : {
        "cWB" : 3.1e-4,
        "GstLAL" : 1.0e-5,
        "PyCBC" : 1.8e-5,
        "PyCBC BBH" : 5.7e-5
    },
    "SNR" : {
        "cWB" : 14.0,
        "GstLAL" : 12.0,
        "PyCBC" : 13.0,
        "PyCBC BBH" : 13.0
    },
    "Pastro" : {
        "GstLAL" : 1.00,
        "PyCBC" : 1.00,
        "PyCBC BBH" : 1.00
    },
    "DQ" : "GW"
}
