{
    "FAR" : {
        "cWB" : 1.0e-4,
        "GstLAL" : 1.0e-5,
        "PyCBC" : 1.8e-5,
        "PyCBC BBH" : 5.7e-5
    },
    "SNR" : {
        "cWB" : 24.7,
        "GstLAL" : 24.4,
        "PyCBC" : 24.0,
        "PyCBC BBH" : 24.0
    },
    "Pastro" : {
        "GstLAL" : 1.00,
        "PyCBC" : 1.00,
        "PyCBC BBH" : 1.00
    },
    "DQ" : "GW"
}
