{
    "FAR" : {
        "cWB" : 9.6e-4,
        "GstLAL" : 1.0e-5,
        "PyCBC" : 1.5e-5,
        "PyCBC BBH" : 3.3e-5
    },
    "SNR" : {
        "cWB" : 16.6,
        "GstLAL" : 16.0,
        "PyCBC" : 15.3,
        "PyCBC BBH" : 15.3
    },
    "Pastro" : {
        "GstLAL" : 1.00,
        "PyCBC" : 1.00,
        "PyCBC BBH" : 1.00
    },
    "DQ" : "GW"
}
