{
    "FAR" : {
        "cWB" : 2.0e-4,
        "GstLAL" : 1.2e-3,
        "PyCBC" : 1.1e0
    },
    "SNR" : {
        "cWB" : 14.4,
        "GstLAL" : 14.7,
        "PyCBC" : 12.6
    },
    "Pastro" : {
        "GstLAL" : 1.00,
        "PyCBC" : 0.93
    },
    "DQ" : "GW"
}
