Comparison plots

32 jobs for padynamics in 45 minutes and 50 seconds (queued for 3 seconds)
Status Job ID Name Coverage
  .Pre
passed #909415
make-dist

00:05:51

 
  Lal
passed #909418
lal:conda:fftw

00:10:57

passed #909419
lal:conda:mkl

00:10:55

passed #909417
lal:deb

00:23:14

passed #909416
lal:rpm

00:14:05

 
  Lal Frame
passed #909422
lalframe:conda

00:09:50

passed #909421
lalframe:deb

00:06:42

failed #909420
lalframe:rpm

00:05:33

 
  Lal Meta Io
passed #909425
lalmetaio:conda

00:07:30

passed #909424
lalmetaio:deb

00:05:59

passed #909423
lalmetaio:rpm

00:04:50

 
  Lal Simulation
failed #909428
lalsimulation:conda

00:06:40

failed #909427
lalsimulation:deb

00:14:01

failed #909426
lalsimulation:rpm

00:08:44

 
  Lal Burst
skipped #909431
lalburst:conda
skipped #909430
lalburst:deb
skipped #909429
lalburst:rpm
 
  Lal Inspiral
skipped #909434
lalinspiral:conda
skipped #909433
lalinspiral:deb
skipped #909432
lalinspiral:rpm
 
  Lal Pulsar
failed #909437
lalpulsar:conda

00:09:22

passed #909436
lalpulsar:deb

00:16:40

passed #909435
lalpulsar:rpm

00:09:13

 
  Lal Inference
skipped #909440
lalinference:conda
skipped #909439
lalinference:deb
skipped #909438
lalinference:rpm
 
  Lal Apps
skipped #909443
lalapps:conda
skipped #909442
lalapps:deb
skipped #909441
lalapps:rpm
 
  Lint
passed #909444
lint:python

00:00:16

 
  Documentation
failed #909445
documentation

00:03:02

 
  Integration Tests
failed #909446
top-level

00:16:06

 
Name Stage Failure
failed
top-level Integration Tests
make[2]: Leaving directory `/builds/deyan.mihaylov/lalsuite/lalsuite-6.70.1/_build'
make[1]: *** [check] Error 2
make[1]: Leaving directory `/builds/deyan.mihaylov/lalsuite/lalsuite-6.70.1/_build'
make: *** [distcheck] Error 1
Uploading artifacts for failed job
Uploading artifacts...
*/_build/*/test/python/junit*.xml: found 18 matching files and directories

Uploading artifacts as "junit" to coordinator... ok
id=909446 responseStatus=201 Created token=Cv9eSUEq
ERROR: Job failed: exit code 1
failed
documentation Documentation
Makefile:938: recipe for target 'html-local' failed
make[2]: Leaving directory '/builds/deyan.mihaylov/lalsuite/lalsimulation/doxygen'
make[2]: *** [html-local] Error 1
make[1]: *** [install-html-recursive] Error 1
Makefile:602: recipe for target 'install-html-recursive' failed
make[1]: Leaving directory '/builds/deyan.mihaylov/lalsuite/lalsimulation'
make: *** [install-html-recursive] Error 1
Makefile:416: recipe for target 'install-html-recursive' failed
ERROR: Job failed: exit code 1
failed
lalpulsar:conda Lal Pulsar
conda/bld/lalpulsar_*/work/test/test-suite.log: found 1 matching files and directories 
conda/bld/lalpulsar_*/work/test/python/test-suite.log: found 1 matching files and directories

WARNING: conda/bld/lalpulsar_*/work/*/*/*/test-suite.log: no matching files
Uploading artifacts as "archive" to coordinator... ok
id=909437 responseStatus=201 Created token=ccFxs4ig
Uploading artifacts...
WARNING: conda/bld/lalpulsar_*/work/test/python/junit*.xml: no matching files
WARNING: conda/bld/lalpulsar_*/test_tmp/junit*.xml: no matching files
ERROR: No files to upload
ERROR: Job failed: exit code 1
failed
lalsimulation:conda Lal Simulation
conda/bld/lalsimulation_*/work/test/test-suite.log: found 1 matching files and directories 
WARNING: conda/bld/lalsimulation_*/work/test/python/test-suite.log: no matching files
WARNING: conda/bld/lalsimulation_*/work/*/*/*/test-suite.log: no matching files
Uploading artifacts as "archive" to coordinator... ok
id=909428 responseStatus=201 Created token=2wZYRn5K
Uploading artifacts...
WARNING: conda/bld/lalsimulation_*/work/test/python/junit*.xml: no matching files
WARNING: conda/bld/lalsimulation_*/test_tmp/junit*.xml: no matching files
ERROR: No files to upload
ERROR: Job failed: exit code 1
failed
lalsimulation:deb Lal Simulation
WARNING: lalsimulation*.deb: no matching files     
WARNING: python*-lalsimulation*.deb: no matching files
lalsimulation*.dsc: found 1 matching files and directories

lalsimulation*.orig.*: found 1 matching files and directories

Uploading artifacts as "archive" to coordinator... ok
id=909427 responseStatus=201 Created token=pzDtY23c
Uploading artifacts...
lalsimulation*/.pybuild/python*/build/test/python/junit*.xml: found 7 matching files and directories

Uploading artifacts as "junit" to coordinator... ok
id=909427 responseStatus=201 Created token=pzDtY23c
ERROR: Job failed: exit code 1
failed
lalsimulation:rpm Lal Simulation
WARNING: rpmbuild/BUILD/*/test/test-suite.log: no matching files 
rpmbuild/BUILD/*/test/python/test-suite.log: found 2 matching files and directories

WARNING: rpmbuild/RPMS/x86_64/lalsimulation-*.rpm: no matching files
WARNING: rpmbuild/RPMS/x86_64/python*-lalsimulation-*.rpm: no matching files
Uploading artifacts as "archive" to coordinator... ok
id=909426 responseStatus=201 Created token=b7DV95mF
Uploading artifacts...
rpmbuild/BUILD/*/test/python/junit*.xml: found 7 matching files and directories

Uploading artifacts as "junit" to coordinator... ok
id=909426 responseStatus=201 Created token=b7DV95mF
ERROR: Job failed: exit code 1
failed
lalframe:rpm Lal Frame
WARNING: rpmbuild/BUILD/*/test/test-suite.log: no matching files 
rpmbuild/BUILD/*/test/python/test-suite.log: found 1 matching files and directories

WARNING: rpmbuild/RPMS/x86_64/lalframe-*.rpm: no matching files
WARNING: rpmbuild/RPMS/x86_64/python*-lalframe-*.rpm: no matching files
Uploading artifacts as "archive" to coordinator... ok
id=909420 responseStatus=201 Created token=4sdfKpxA
Uploading artifacts...
WARNING: rpmbuild/BUILD/*/test/python/junit*.xml: no matching files
ERROR: No files to upload
ERROR: Job failed: exit code 1