lalinference: flesh out requires for bin package

- openmpi is needed for mpirun
- others are imported directly by scripts, rather than just the library
61 jobs for lalinferencemcmc_testjob in 90 minutes and 21 seconds (queued for 12 seconds)
latest
Status Job ID Name Coverage
  .Pre
passed #1197917
make-dist

00:06:51

passed #1197918
make-dist:lal

00:01:57

 
  Lal
failed #1197921
lal:conda:fftw

00:24:58

failed #1198053
lal:conda:mkl

00:26:05

passed #1197920
lal:deb

00:20:05

passed #1197919
lal:rpm

00:15:11

failed #1197922
lal:conda:mkl

00:24:46

 
  Lal Frame
skipped #1197925
lalframe:conda
passed #1197924
lalframe:deb

00:07:29

passed #1197923
lalframe:rpm

00:05:50

 
  Lal Meta Io
skipped #1197928
lalmetaio:conda
passed #1197927
lalmetaio:deb

00:06:59

passed #1197926
lalmetaio:rpm

00:05:02

 
  Lal Simulation
skipped #1197931
lalsimulation:conda
passed #1197930
lalsimulation:deb

00:13:01

passed #1197929
lalsimulation:rpm

00:09:24

 
  Lal Burst
skipped #1197934
lalburst:conda
passed #1197933
lalburst:deb

00:05:40

passed #1197932
lalburst:rpm

00:19:16

 
  Lal Inspiral
skipped #1197937
lalinspiral:conda
passed #1197936
lalinspiral:deb

00:10:33

passed #1197935
lalinspiral:rpm

00:08:15

 
  Lal Pulsar
skipped #1197940
lalpulsar:conda
passed #1197939
lalpulsar:deb

00:15:32

passed #1197938
lalpulsar:rpm

00:11:05

 
  Lal Inference
skipped #1197943
lalinference:conda
passed #1197942
lalinference:deb

00:11:27

passed #1197941
lalinference:rpm

00:11:34

 
  Lal Apps
skipped #1197946
lalapps:conda
passed #1197945
lalapps:deb

00:12:50

passed #1197944
lalapps:rpm

00:15:17

 
  Lint
passed #1197948
lint:coala

00:01:04

passed #1197947
lint:python

00:01:17

 
  Documentation
passed #1197949
documentation

00:06:49

 
  Integration Tests
passed #1197951
coverage

00:57:09

19.19%
skipped #1197953
lalinference_mcmc:conda
skipped #1197954
lalinference_mcmc:conda+condor
passed #1197952
lalinference_mcmc:rpm

00:10:29

skipped #1197956
lalinference_nest:conda
skipped #1197957
lalinference_nest:conda+condor
passed #1197955
lalinference_nest:rpm

00:20:10

passed #1197950
top-level

00:39:04

 
  Compiler Tests
passed #1197958
clang:10

00:24:28

passed #1197959
clang:11

00:34:10

passed #1197960
clang:dev

00:31:12

failed #1197965
cuda

00:07:32

passed #1197964
gcc:10

00:31:01

passed #1197961
gcc:7

00:29:24

passed #1197962
gcc:8

00:30:32

passed #1197963
gcc:9

00:28:29

 
  Platform Tests
failed #1197969
allowed to fail
platform:conda:linux

00:15:07

passed #1197966
platform:debian:stretch

00:35:44

passed #1197967
macos_highsierra
platform:macos:highsierra

00:22:47

passed #1197968
macos_sierra
platform:macos:sierra

00:25:04

 
  Upgrade Tests
skipped #1197972
upgrade:conda:linux
passed #1197971
upgrade:debian:buster

00:05:24

passed #1197970
upgrade:rpm:el7

00:09:15

 
  Wheels
passed #1197973
wheel:cp36-cp36m-manylinux2014

00:14:52

passed #1197974
wheel:cp37-cp37m-manylinux2014

00:13:58

passed #1197975
wheel:cp38-cp38-manylinux2014

00:13:58

passed #1197976
wheel:cp39-cp39-manylinux2014

00:15:18

 
Name Stage Failure
failed
lal:conda:mkl Lal
WARNING: conda/bld/lal-*/work/*/*/*/*/test-suite.log: no matching files 
lal/lal-feedstock/: found 143 matching files and directories

Uploading artifacts as "archive" to coordinator... ok
id=1198053 responseStatus=201 Created token=ELxAdWpq
Uploading artifacts...
WARNING: conda/bld/lal-*/work/_build*/test/python/junit*.xml: no matching files
WARNING: conda/bld/lal-*/test_tmp/junit*.xml: no matching files
ERROR: No files to upload
Cleaning up file based variables
ERROR: Job failed: exit code 1
failed
lal:conda:fftw Lal
WARNING: conda/bld/lal-*/work/*/*/*/*/test-suite.log: no matching files 
lal/lal-feedstock/: found 143 matching files and directories

Uploading artifacts as "archive" to coordinator... ok
id=1197921 responseStatus=201 Created token=_BgMYqDa
Uploading artifacts...
WARNING: conda/bld/lal-*/work/_build*/test/python/junit*.xml: no matching files
WARNING: conda/bld/lal-*/test_tmp/junit*.xml: no matching files
ERROR: No files to upload
Cleaning up file based variables
ERROR: Job failed: exit code 1
failed
platform:conda:linux Platform Tests
make[1]: *** [Makefile:416: check-recursive] Error 1
make[1]: Leaving directory '/builds/duncanmmacleod/lalsuite'
make: *** [Makefile:690: check] Error 2
Uploading artifacts for failed job
Uploading artifacts...
*/test/python/junit*.xml: found 5 matching files and directories

Uploading artifacts as "junit" to coordinator... ok
id=1197969 responseStatus=201 Created token=2nE5xxzZ
Cleaning up file based variables
ERROR: Job failed: exit code 1
failed
cuda Compiler Tests
make[1]: *** [all-recursive] Error 1
make[1]: Leaving directory `/builds/duncanmmacleod/lalsuite'
make: *** [all] Error 2
Uploading artifacts for failed job
Uploading artifacts...
WARNING: */test/python/junit*.xml: no matching files
ERROR: No files to upload
Cleaning up file based variables
ERROR: Job failed: exit code 1