ci: run macos platform builds on python3

[skip debian][skip conda][skip wheels]
30 jobs for ci-top-level-build-python3 in 88 minutes and 9 seconds (queued for 12 seconds)
latest
Status Job ID Name Coverage
  .Pre
passed #1201078
make-dist

00:05:59

passed #1201079
make-dist:lal

00:01:16

 
  Lal
passed #1201080
lal:rpm

00:14:28

 
  Lal Frame
passed #1201081
lalframe:rpm

00:07:57

 
  Lal Meta Io
passed #1201082
lalmetaio:rpm

00:05:25

 
  Lal Simulation
passed #1201083
lalsimulation:rpm

00:08:47

 
  Lal Burst
passed #1201084
lalburst:rpm

00:18:56

 
  Lal Inspiral
passed #1201085
lalinspiral:rpm

00:11:05

 
  Lal Pulsar
passed #1201086
lalpulsar:rpm

00:12:56

 
  Lal Inference
passed #1201087
lalinference:rpm

00:14:42

 
  Lal Apps
passed #1201088
lalapps:rpm

00:10:03

 
  Lint
passed #1201090
lint:coala

00:01:08

passed #1201089
lint:python

00:00:58

 
  Documentation
passed #1201091
documentation

00:06:06

 
  Integration Tests
passed #1201094
coverage

00:53:16

19.19%
passed #1201092
lalinference_testjob

00:18:45

passed #1201093
top-level

00:35:28

 
  Compiler Tests
passed #1201095
clang:10

00:30:33

passed #1201096
clang:11

00:29:56

passed #1201097
clang:dev

00:31:12

failed #1201102
cuda

00:05:52

passed #1201101
gcc:10

00:26:40

passed #1201098
gcc:7

00:29:21

passed #1201099
gcc:8

00:29:53

passed #1201100
gcc:9

00:32:18

 
  Platform Tests
failed #1201106
allowed to fail
platform:conda:linux

00:14:46

passed #1201103
platform:debian:stretch

00:42:09

failed #1201104
macos_highsierra
platform:macos:highsierra

00:15:19

failed #1201105
macos_sierra
platform:macos:sierra

00:13:21

 
  Upgrade Tests
passed #1201107
upgrade:rpm:el7

00:06:42

 
Name Stage Failure
failed
platform:macos:highsierra Platform Tests
make[1]: *** [check-recursive] Error 1
make: *** [check] Error 2
Uploading artifacts for failed job
Uploading artifacts...
Runtime platform
arch=amd64 os=darwin pid=97296 revision=775dd39d version=13.8.0
WARNING: */test/python/junit*.xml: no matching files
ERROR: No files to upload
Cleaning up file based variables
ERROR: Job failed: exit status 1
failed
platform:conda:linux Platform Tests
make[1]: Leaving directory '/builds/duncanmmacleod/lalsuite'
make[1]: *** [Makefile:416: check-recursive] Error 1
make: *** [Makefile:690: check] Error 2
Uploading artifacts for failed job
Uploading artifacts...
*/test/python/junit*.xml: found 5 matching files and directories

Uploading artifacts as "junit" to coordinator... ok
id=1201106 responseStatus=201 Created token=o-Ss42E6
Cleaning up file based variables
ERROR: Job failed: exit code 1
failed
platform:macos:sierra Platform Tests
make[1]: *** [check-recursive] Error 1
make: *** [check] Error 2
Uploading artifacts for failed job
Uploading artifacts...
Runtime platform
arch=amd64 os=darwin pid=18483 revision=775dd39d version=13.8.0
WARNING: */test/python/junit*.xml: no matching files
ERROR: No files to upload
Cleaning up file based variables
ERROR: Job failed: exit status 1
failed
cuda Compiler Tests
make[1]: *** [all-recursive] Error 1
make[1]: Leaving directory `/builds/duncanmmacleod/lalsuite'
make: *** [all] Error 2
Uploading artifacts for failed job
Uploading artifacts...
WARNING: */test/python/junit*.xml: no matching files
ERROR: No files to upload
Cleaning up file based variables
ERROR: Job failed: exit code 1