remove the user-env scripts

they encourage building lalsuite outside of a well-constructed environment which is not something we should encourage or support
38 jobs for no-user-env in 26 minutes and 19 seconds (queued for 6 seconds)
latest
Status Name Job ID Coverage
  Tarballs
passed tarball:lal #1573072

00:00:54

failed tarballs #1573071

00:00:55

 
  Lal
passed lal:conda:fftw #1573075

00:24:24

passed lal:conda:mkl #1573076

00:25:18

failed lal:deb #1573074

00:16:35

failed lal:rpm #1573073

00:10:14

 
  Lal Frame
skipped lalframe:conda #1573079
skipped lalframe:deb #1573078
skipped lalframe:rpm #1573077
 
  Lal Meta Io
skipped lalmetaio:conda #1573082
skipped lalmetaio:deb #1573081
skipped lalmetaio:rpm #1573080
 
  Lal Simulation
skipped lalsimulation:conda #1573085
skipped lalsimulation:deb #1573084
skipped lalsimulation:rpm #1573083
 
  Lal Burst
skipped lalburst:conda #1573088
skipped lalburst:deb #1573087
skipped lalburst:rpm #1573086
 
  Lal Inspiral
skipped lalinspiral:conda #1573091
skipped lalinspiral:deb #1573090
skipped lalinspiral:rpm #1573089
 
  Lal Pulsar
skipped lalpulsar:conda #1573094
skipped lalpulsar:deb #1573093
skipped lalpulsar:rpm #1573092
 
  Lal Inference
skipped lalinference:conda #1573097
skipped lalinference:deb #1573096
skipped lalinference:rpm #1573095
 
  Lal Apps
skipped lalapps:conda #1573100
skipped lalapps:deb #1573099
skipped lalapps:rpm #1573098
 
  Integration Tests
failed top-level #1573101

00:00:56

 
  Upgrade Tests
skipped upgrade:conda:linux #1573104
skipped upgrade:debian:buster #1573103
skipped upgrade:rpm:el7 #1573102
 
  Coverage
failed coverage #1573105

00:00:59

 
  Lint
passed lint:coala #1573107

00:00:29

passed lint:python #1573106

00:00:56

 
  Documentation
failed documentation #1573108

00:00:45

 
Name Stage Failure
failed
lal:deb Lal
lal*.dsc: found 1 matching files and directories   
lal*/**/config.log: found 1 matching files and directories

lal*/**/test-suite.log: found 17 matching files and directories

lal*.orig.*: found 1 matching files and directories

Uploading artifacts as "archive" to coordinator... ok
id=1573074 responseStatus=201 Created token=EjzPfUEU
Uploading artifacts...
lal-*/**/*junit*.xml: found 5 matching files and directories

Uploading artifacts as "junit" to coordinator... ok
id=1573074 responseStatus=201 Created token=EjzPfUEU
Cleaning up file based variables
ERROR: Job failed: exit code 1
failed
lal:rpm Lal
WARNING: rpmbuild/RPMS/x86_64/liblal-*.rpm: no matching files 
WARNING: rpmbuild/RPMS/x86_64/python*-lal-*.rpm: no matching files
rpmbuild/BUILD/**/config.log: found 1 matching files and directories

rpmbuild/BUILD/**/test-suite.log: found 17 matching files and directories

Uploading artifacts as "archive" to coordinator... ok
id=1573073 responseStatus=201 Created token=pcyFWVv5
Uploading artifacts...
rpmbuild/BUILD/**/*junit*.xml: found 5 matching files and directories

Uploading artifacts as "junit" to coordinator... ok
id=1573073 responseStatus=201 Created token=pcyFWVv5
Cleaning up file based variables
ERROR: Job failed: exit code 1
failed
coverage Coverage
Running after script...
$ gcovr -j ${CPU_COUNT} --exclude '(.+/)?swiglal_[a-z]+\.c$' --exclude-directories 'lal([a-z]+/)?test' --xml c-coverage.xml
$ python3 -m coverage combine
No data to combine
Uploading artifacts for failed job
Uploading artifacts...
WARNING: coverage.xml: no matching files
ERROR: No files to upload
Cleaning up file based variables
ERROR: Job failed: exit code 1
failed
top-level Integration Tests
aclocal: error: echo failed with exit status: 1
autoreconf: aclocal failed with exit status: 1
!!! ./00boot: autoreconf --verbose --warnings=error failed
Uploading artifacts for failed job
Uploading artifacts...
WARNING: config.log: no matching files
WARNING: Makefile: no matching files
ERROR: No files to upload
Cleaning up file based variables
ERROR: Job failed: exit code 1
failed
tarballs Tarballs
autoreconf: running: aclocal --warnings=error 
configure.ac:179: error: AM_COND_IF: no such condition "HAVE_PYTHON"
/usr/share/aclocal-1.13/cond-if.m4:23: AM_COND_IF is expanded from...
configure.ac:179: the top level
autom4te: /usr/bin/m4 failed with exit status: 1
aclocal: error: echo failed with exit status: 1
autoreconf: aclocal failed with exit status: 1
!!! ./00boot: autoreconf --verbose --warnings=error failed
Cleaning up file based variables
ERROR: Job failed: exit code 1
failed
documentation Documentation
autoreconf: running: aclocal --warnings=error 
configure.ac:179: error: AM_COND_IF: no such condition "HAVE_PYTHON"
/usr/share/aclocal-1.16/cond-if.m4:23: AM_COND_IF is expanded from...
configure.ac:179: the top level
autom4te: /usr/bin/m4 failed with exit status: 1
aclocal: error: echo failed with exit status: 1
autoreconf: aclocal failed with exit status: 1
!!! ./00boot: autoreconf --verbose --warnings=error failed
Cleaning up file based variables
ERROR: Job failed: exit code 1