lalsimulation: improve waveform generation test

31 jobs for lalsimulation-python-waveform-tests in 65 minutes and 13 seconds (queued for 4 seconds)
latest
Status Job ID Name Coverage
  .Pre
passed #612314
make-dist

00:05:09

 
  Lal
passed #612317
lal:conda:fftw

00:15:23

passed #612318
lal:conda:mkl

00:15:56

passed #612316
lal:deb

00:33:52

passed #612315
lal:rpm

00:19:09

 
  Lal Frame
passed #612321
lalframe:conda

00:13:33

passed #612320
lalframe:deb

00:11:31

passed #612319
lalframe:rpm

00:13:50

 
  Lal Meta Io
passed #612324
lalmetaio:conda

00:11:38

passed #612323
lalmetaio:deb

00:10:57

passed #612322
lalmetaio:rpm

00:11:08

 
  Lal Simulation
failed #612327
lalsimulation:conda

00:15:20

failed #612326
lalsimulation:deb

00:22:52

failed #612325
lalsimulation:rpm

00:18:01

 
  Lal Burst
skipped #612330
lalburst:conda
skipped #612329
lalburst:deb
skipped #612328
lalburst:rpm
 
  Lal Inspiral
skipped #612333
lalinspiral:conda
skipped #612332
lalinspiral:deb
skipped #612331
lalinspiral:rpm
 
  Lal Pulsar
passed #612336
lalpulsar:conda

00:13:42

passed #612335
lalpulsar:deb

00:23:57

passed #612334
lalpulsar:rpm

00:15:49

 
  Lal Inference
skipped #612339
lalinference:conda
skipped #612338
lalinference:deb
skipped #612337
lalinference:rpm
 
  Lal Apps
skipped #612342
lalapps:conda
skipped #612341
lalapps:deb
skipped #612340
lalapps:rpm
 
  Documentation
passed #612343
documentation

00:07:12

 
  Integration Tests
failed #612344
top-level

00:25:40

 
Name Stage Failure
failed
lalsimulation:deb Lal Simulation
make[1]: Leaving directory '/builds/duncanmmacleod/lalsuite/lalsimulation-1.10.1.1/.pybuild/pythonX.Y_2.7/build'
E: pybuild pybuild:283: test: plugin custom failed with: exit code=2: /usr/bin/make -C /builds/duncanmmacleod/lalsuite/lalsimulation-1.10.1.1/.pybuild/pythonX.Y_2.7/build V=1 pythondir=/usr/lib/python2.7/dist-packages pyexecdir=/usr/lib/python2.7/dist-packages pkgpythondir=/usr/lib/python2.7/dist-packages/lalsimulation pkgpyexecdir=/usr/lib/python2.7/dist-packages/lalsimulation VERBOSE=1 check
dh_auto_test: pybuild --test --test-pytest -i python{version} -p 2.7 returned exit code 13
debian/lalsuite.mk:28: recipe for target 'build' failed
make: *** [build] Error 25
dpkg-buildpackage: error: debian/rules build gave error exit status 2
debuild: fatal error at line 1116:
dpkg-buildpackage -us -uc failed
ERROR: Job failed: exit code 1
failed
lalsimulation:rpm Lal Simulation
make[1]: *** [check-recursive] Error 1
make[1]: Leaving directory `/builds/duncanmmacleod/lalsuite/rpmbuild/BUILD/lalsimulation-1.10.1.1'
make: *** [check] Error 2


RPM build errors:
error: Bad exit status from /var/tmp/rpm-tmp.bjuLqs (%check)
Bad exit status from /var/tmp/rpm-tmp.bjuLqs (%check)
ERROR: Job failed: exit code 1
failed
lalsimulation:conda Lal Simulation
WARNING: conda/bld/linux-64/lalsimulation-*.conda: no matching files 
conda/bld/linux-64/lalsimulation-*.tar.bz2: found 1 matching files

WARNING: conda/bld/linux-64/python-lalsimulation-*.conda: no matching files
WARNING: conda/bld/linux-64/python-lalsimulation-*.tar.bz2: no matching files
WARNING: conda/bld/lalsimulation_*/work/test/test-suite.log: no matching files
WARNING: conda/bld/lalsimulation_*/work/test/python/test-suite.log: no matching files
WARNING: conda/bld/lalsimulation_*/work/*/*/*/test-suite.log: no matching files
Uploading artifacts to coordinator... ok
id=612327 responseStatus=201 Created token=ULpJWnN4
ERROR: Job failed: exit code 1
failed
top-level Integration Tests
make[4]: Leaving directory `/builds/duncanmmacleod/lalsuite/lalsuite-6.67.1/_build/lalsimulation'
make[3]: *** [check] Error 2
make[3]: Leaving directory `/builds/duncanmmacleod/lalsuite/lalsuite-6.67.1/_build/lalsimulation'
make[2]: *** [check-recursive] Error 1
make[2]: Leaving directory `/builds/duncanmmacleod/lalsuite/lalsuite-6.67.1/_build'
make[1]: *** [check] Error 2
make[1]: Leaving directory `/builds/duncanmmacleod/lalsuite/lalsuite-6.67.1/_build'
make: *** [distcheck] Error 1
ERROR: Job failed: exit code 1