%!PS-Adobe-3.0 EPSF-3.0
%%Title: splaneiwave.fig
%%Creator: fig2dev Version 3.2 Patchlevel 5d
%%CreationDate: Thu Jun  4 15:43:02 2015
%%For: edaw@dyn006254.shef.ac.uk (Edward Daw)
%%BoundingBox: 0 0 223 168
%Magnification: 1.0000
%%EndComments
%%BeginProlog
/$F2psDict 200 dict def
$F2psDict begin
$F2psDict /mtrx matrix put
/col-1 {0 setgray} bind def
/col0 {0.000 0.000 0.000 srgb} bind def
/col1 {0.000 0.000 1.000 srgb} bind def
/col2 {0.000 1.000 0.000 srgb} bind def
/col3 {0.000 1.000 1.000 srgb} bind def
/col4 {1.000 0.000 0.000 srgb} bind def
/col5 {1.000 0.000 1.000 srgb} bind def
/col6 {1.000 1.000 0.000 srgb} bind def
/col7 {1.000 1.000 1.000 srgb} bind def
/col8 {0.000 0.000 0.560 srgb} bind def
/col9 {0.000 0.000 0.690 srgb} bind def
/col10 {0.000 0.000 0.820 srgb} bind def
/col11 {0.530 0.810 1.000 srgb} bind def
/col12 {0.000 0.560 0.000 srgb} bind def
/col13 {0.000 0.690 0.000 srgb} bind def
/col14 {0.000 0.820 0.000 srgb} bind def
/col15 {0.000 0.560 0.560 srgb} bind def
/col16 {0.000 0.690 0.690 srgb} bind def
/col17 {0.000 0.820 0.820 srgb} bind def
/col18 {0.560 0.000 0.000 srgb} bind def
/col19 {0.690 0.000 0.000 srgb} bind def
/col20 {0.820 0.000 0.000 srgb} bind def
/col21 {0.560 0.000 0.560 srgb} bind def
/col22 {0.690 0.000 0.690 srgb} bind def
/col23 {0.820 0.000 0.820 srgb} bind def
/col24 {0.500 0.190 0.000 srgb} bind def
/col25 {0.630 0.250 0.000 srgb} bind def
/col26 {0.750 0.380 0.000 srgb} bind def
/col27 {1.000 0.500 0.500 srgb} bind def
/col28 {1.000 0.630 0.630 srgb} bind def
/col29 {1.000 0.750 0.750 srgb} bind def
/col30 {1.000 0.880 0.880 srgb} bind def
/col31 {1.000 0.840 0.000 srgb} bind def

end

/cp {closepath} bind def
/ef {eofill} bind def
/gr {grestore} bind def
/gs {gsave} bind def
/sa {save} bind def
/rs {restore} bind def
/l {lineto} bind def
/m {moveto} bind def
/rm {rmoveto} bind def
/n {newpath} bind def
/s {stroke} bind def
/sh {show} bind def
/slc {setlinecap} bind def
/slj {setlinejoin} bind def
/slw {setlinewidth} bind def
/srgb {setrgbcolor} bind def
/rot {rotate} bind def
/sc {scale} bind def
/sd {setdash} bind def
/ff {findfont} bind def
/sf {setfont} bind def
/scf {scalefont} bind def
/sw {stringwidth} bind def
/tr {translate} bind def
/tnt {dup dup currentrgbcolor
  4 -2 roll dup 1 exch sub 3 -1 roll mul add
  4 -2 roll dup 1 exch sub 3 -1 roll mul add
  4 -2 roll dup 1 exch sub 3 -1 roll mul add srgb}
  bind def
/shd {dup dup currentrgbcolor 4 -2 roll mul 4 -2 roll mul
  4 -2 roll mul srgb} bind def
 /DrawEllipse {
	/endangle exch def
	/startangle exch def
	/yrad exch def
	/xrad exch def
	/y exch def
	/x exch def
	/savematrix mtrx currentmatrix def
	x y tr xrad yrad sc 0 0 1 startangle endangle arc
	closepath
	savematrix setmatrix
	} def

/$F2psBegin {$F2psDict begin /$F2psEnteredState save def} def
/$F2psEnd {$F2psEnteredState restore end} def

/pageheader {
save
newpath 0 168 moveto 0 0 lineto 223 0 lineto 223 168 lineto closepath clip newpath
-34.6 198.7 translate
1 -1 scale
$F2psBegin
10 setmiterlimit
0 slj 0 slc
 0.06000 0.06000 sc
} bind def
/pagefooter {
$F2psEnd
restore
} bind def
%%EndProlog
pageheader
%
% Fig objects follow
%
% 
% here starts figure with depth 50
% Polyline
0 slj
0 slc
7.500 slw
n 2400 2250 m
 3225 2250 l gs col0 s gr 
% Polyline
n 3330 1950 m 3225 1950 3225 2445 105 arcto 4 {pop} repeat
  3225 2550 3870 2550 105 arcto 4 {pop} repeat
  3975 2550 3975 2055 105 arcto 4 {pop} repeat
  3975 1950 3330 1950 105 arcto 4 {pop} repeat
 cp gs col0 s gr 
% Polyline
n 1005 525 m 900 525 900 1320 105 arcto 4 {pop} repeat
  900 1425 2820 1425 105 arcto 4 {pop} repeat
  2925 1425 2925 630 105 arcto 4 {pop} repeat
  2925 525 1005 525 105 arcto 4 {pop} repeat
 cp gs col0 s gr 
% Polyline
n 2925 975 m
 3225 975 l gs col0 s gr 
% Polyline
n 2400 2025 m 1950 2250 l 2400 2475 l
 2400 2025 l  cp gs col0 s gr 
% Polyline
n 1005 1950 m 900 1950 900 2445 105 arcto 4 {pop} repeat
  900 2550 1545 2550 105 arcto 4 {pop} repeat
  1650 2550 1650 2055 105 arcto 4 {pop} repeat
  1650 1950 1005 1950 105 arcto 4 {pop} repeat
 cp gs col0 s gr 
% Polyline
n 1005 2700 m 900 2700 900 3195 105 arcto 4 {pop} repeat
  900 3300 1545 3300 105 arcto 4 {pop} repeat
  1650 3300 1650 2805 105 arcto 4 {pop} repeat
  1650 2700 1005 2700 105 arcto 4 {pop} repeat
 cp gs col0 s gr 
% Polyline
n 900 1200 m 750 1200 l 750 3000 l
 900 3000 l gs col0 s gr 
% Polyline
n 750 2250 m
 900 2250 l gs col0 s gr 
% Polyline
n 1650 2250 m
 1950 2250 l gs col0 s gr 
% Polyline
n 1650 3000 m
 1950 3000 l gs col0 s gr 
% Polyline
n 900 750 m
 600 750 l gs col0 s gr 
% Polyline
n 4275 975 m 4275 2250 l
 3975 2250 l gs col0 s gr 
% Polyline
n 3975 975 m
 4275 975 l gs col0 s gr 
% Polyline
n 3330 675 m 3225 675 3225 1170 105 arcto 4 {pop} repeat
  3225 1275 3870 1275 105 arcto 4 {pop} repeat
  3975 1275 3975 780 105 arcto 4 {pop} repeat
  3975 675 3330 675 105 arcto 4 {pop} repeat
 cp gs col0 s gr 
% here ends figure;
% 
% here starts figure with depth 0
% Ellipse
7.500 slw
n 750 2250 15 15 0 360 DrawEllipse gs 0.00 setgray ef gr gs col0 s gr

% Ellipse
n 1950 3000 15 15 0 360 DrawEllipse gs 0.00 setgray ef gr gs col0 s gr

% Ellipse
n 600 750 15 15 0 360 DrawEllipse gs 0.00 setgray ef gr gs col0 s gr

% here ends figure;
pagefooter
showpage
%%Trailer
%EOF
