+1.562500e-002	   +7.808423e-005
+3.125000e-002	   +2.253970e-005
+4.687500e-002	   +2.043155e-006
+6.250000e-002	   +7.681518e-007
+7.812500e-002	   +6.377750e-007
+9.375000e-002	   +5.379081e-007
+1.093750e-001	   +4.697924e-007
+1.250000e-001	   +4.545107e-007
+1.406250e-001	   +5.409191e-007
+1.562500e-001	   +5.470489e-007
+1.718750e-001	   +4.873066e-007
+1.875000e-001	   +4.535964e-007
+2.031250e-001	   +4.234099e-007
+2.187500e-001	   +3.594131e-007
+2.343750e-001	   +2.980970e-007
+2.500000e-001	   +2.864293e-007
+2.656250e-001	   +3.024734e-007
+2.812500e-001	   +2.762952e-007
+2.968750e-001	   +2.563811e-007
+3.125000e-001	   +2.505871e-007
+3.281250e-001	   +2.286262e-007
+3.437500e-001	   +2.377639e-007
+3.593750e-001	   +3.092011e-007
+3.750000e-001	   +3.626226e-007
+3.906250e-001	   +3.492421e-007
+4.062500e-001	   +3.006028e-007
+4.218750e-001	   +2.373257e-007
+4.375000e-001	   +1.941191e-007
+4.531250e-001	   +1.987325e-007
+4.687500e-001	   +2.199381e-007
+4.843750e-001	   +2.451220e-007
+5.000000e-001	   +2.370171e-007
+5.156250e-001	   +2.120396e-007
+5.312500e-001	   +2.182228e-007
+5.468750e-001	   +2.315280e-007
+5.625000e-001	   +1.975982e-007
+5.781250e-001	   +1.805264e-007
+5.937500e-001	   +1.891043e-007
+6.093750e-001	   +1.950859e-007
+6.250000e-001	   +2.384394e-007
+6.406250e-001	   +2.396859e-007
+6.562500e-001	   +1.860507e-007
+6.718750e-001	   +1.820243e-007
+6.875000e-001	   +1.877356e-007
+7.031250e-001	   +1.679890e-007
+7.187500e-001	   +1.504491e-007
+7.343750e-001	   +1.556703e-007
+7.500000e-001	   +1.761196e-007
+7.656250e-001	   +1.631428e-007
+7.812500e-001	   +1.425760e-007
+7.968750e-001	   +1.257343e-007
+8.125000e-001	   +1.368847e-007
+8.281250e-001	   +1.511530e-007
+8.437500e-001	   +1.312209e-007
+8.593750e-001	   +1.587716e-007
+8.750000e-001	   +2.032005e-007
+8.906250e-001	   +2.121551e-007
+9.062500e-001	   +1.971674e-007
+9.218750e-001	   +1.647960e-007
+9.375000e-001	   +1.770063e-007
+9.531250e-001	   +1.916157e-007
+9.687500e-001	   +1.844340e-007
+9.843750e-001	   +1.990078e-007
+1.000000e+000	   +2.181864e-007
+1.015625e+000	   +2.153343e-007
+1.031250e+000	   +1.823908e-007
+1.046875e+000	   +1.568457e-007
+1.062500e+000	   +1.524682e-007
+1.078125e+000	   +1.720061e-007
+1.093750e+000	   +1.588971e-007
+1.109375e+000	   +1.684089e-007
+1.125000e+000	   +1.866580e-007
+1.140625e+000	   +2.032344e-007
+1.156250e+000	   +2.268895e-007
+1.171875e+000	   +1.962919e-007
+1.187500e+000	   +1.503391e-007
+1.203125e+000	   +1.420683e-007
+1.218750e+000	   +1.588460e-007
+1.234375e+000	   +1.721975e-007
+1.250000e+000	   +1.631231e-007
+1.265625e+000	   +1.548341e-007
+1.281250e+000	   +1.496522e-007
+1.296875e+000	   +1.454324e-007
+1.312500e+000	   +1.295921e-007
+1.328125e+000	   +1.290009e-007
+1.343750e+000	   +1.227794e-007
+1.359375e+000	   +1.271631e-007
+1.375000e+000	   +1.447348e-007
+1.390625e+000	   +1.213676e-007
+1.406250e+000	   +1.216320e-007
+1.421875e+000	   +1.373288e-007
+1.437500e+000	   +1.427400e-007
+1.453125e+000	   +1.431415e-007
+1.468750e+000	   +1.338290e-007
+1.484375e+000	   +1.424276e-007
+1.500000e+000	   +1.528947e-007
+1.515625e+000	   +1.640904e-007
+1.531250e+000	   +1.475181e-007
+1.546875e+000	   +1.268151e-007
+1.562500e+000	   +1.651430e-007
+1.578125e+000	   +1.610705e-007
+1.593750e+000	   +1.242253e-007
+1.609375e+000	   +1.324947e-007
+1.625000e+000	   +1.597492e-007
+1.640625e+000	   +1.839547e-007
+1.656250e+000	   +2.012243e-007
+1.671875e+000	   +1.757153e-007
+1.687500e+000	   +1.368607e-007
+1.703125e+000	   +1.461829e-007
+1.718750e+000	   +1.511486e-007
+1.734375e+000	   +1.357671e-007
+1.750000e+000	   +1.301086e-007
+1.765625e+000	   +1.053372e-007
+1.781250e+000	   +1.251864e-007
+1.796875e+000	   +1.521082e-007
+1.812500e+000	   +1.535928e-007
+1.828125e+000	   +1.630645e-007
+1.843750e+000	   +1.634804e-007
+1.859375e+000	   +1.718443e-007
+1.875000e+000	   +1.622719e-007
+1.890625e+000	   +1.600537e-007
+1.906250e+000	   +1.390829e-007
+1.921875e+000	   +1.285931e-007
+1.937500e+000	   +1.298735e-007
+1.953125e+000	   +1.403055e-007
+1.968750e+000	   +1.453639e-007
+1.984375e+000	   +1.227503e-007
+2.000000e+000	   +1.392071e-007
+2.015625e+000	   +1.463264e-007
+2.031250e+000	   +1.328060e-007
+2.046875e+000	   +1.261376e-007
+2.062500e+000	   +9.906999e-008
+2.078125e+000	   +9.281639e-008
+2.093750e+000	   +1.338737e-007
+2.109375e+000	   +1.783767e-007
+2.125000e+000	   +1.595469e-007
+2.140625e+000	   +1.810501e-007
+2.156250e+000	   +1.900908e-007
+2.171875e+000	   +1.650473e-007
+2.187500e+000	   +1.590083e-007
+2.203125e+000	   +1.592820e-007
+2.218750e+000	   +1.609908e-007
+2.234375e+000	   +1.777249e-007
+2.250000e+000	   +1.662597e-007
+2.265625e+000	   +1.290410e-007
+2.281250e+000	   +1.128513e-007
+2.296875e+000	   +1.132227e-007
+2.312500e+000	   +1.137041e-007
+2.328125e+000	   +1.250987e-007
+2.343750e+000	   +1.134541e-007
+2.359375e+000	   +9.421833e-008
+2.375000e+000	   +1.201957e-007
+2.390625e+000	   +1.226116e-007
+2.406250e+000	   +1.100359e-007
+2.421875e+000	   +1.405979e-007
+2.437500e+000	   +1.644822e-007
+2.453125e+000	   +1.705447e-007
+2.468750e+000	   +1.378447e-007
+2.484375e+000	   +1.170005e-007
+2.500000e+000	   +1.128589e-007
+2.515625e+000	   +1.053211e-007
+2.531250e+000	   +9.752998e-008
+2.546875e+000	   +1.180454e-007
+2.562500e+000	   +1.320568e-007
+2.578125e+000	   +1.407023e-007
+2.593750e+000	   +1.244664e-007
+2.609375e+000	   +1.132559e-007
+2.625000e+000	   +1.318863e-007
+2.640625e+000	   +1.552462e-007
+2.656250e+000	   +1.414045e-007
+2.671875e+000	   +1.365150e-007
+2.687500e+000	   +1.420696e-007
+2.703125e+000	   +1.443092e-007
+2.718750e+000	   +1.365569e-007
+2.734375e+000	   +1.478112e-007
+2.750000e+000	   +1.578311e-007
+2.765625e+000	   +1.383955e-007
+2.781250e+000	   +1.205795e-007
+2.796875e+000	   +1.323676e-007
+2.812500e+000	   +1.327428e-007
+2.828125e+000	   +1.320163e-007
+2.843750e+000	   +1.488980e-007
+2.859375e+000	   +1.568921e-007
+2.875000e+000	   +1.138169e-007
+2.890625e+000	   +8.775621e-008
+2.906250e+000	   +9.431262e-008
+2.921875e+000	   +9.575261e-008
+2.937500e+000	   +1.064907e-007
+2.953125e+000	   +1.170398e-007
+2.968750e+000	   +1.323177e-007
+2.984375e+000	   +1.407672e-007
+3.000000e+000	   +1.423894e-007
+3.015625e+000	   +1.305999e-007
+3.031250e+000	   +1.109241e-007
+3.046875e+000	   +1.184153e-007
+3.062500e+000	   +1.212322e-007
+3.078125e+000	   +1.176774e-007
+3.093750e+000	   +1.068597e-007
+3.109375e+000	   +1.302950e-007
+3.125000e+000	   +1.317092e-007
+3.140625e+000	   +1.290174e-007
+3.156250e+000	   +1.364410e-007
+3.171875e+000	   +1.262147e-007
+3.187500e+000	   +1.238640e-007
+3.203125e+000	   +1.402622e-007
+3.218750e+000	   +1.335318e-007
+3.234375e+000	   +1.132018e-007
+3.250000e+000	   +1.029884e-007
+3.265625e+000	   +1.128080e-007
+3.281250e+000	   +1.269147e-007
+3.296875e+000	   +1.391061e-007
+3.312500e+000	   +1.401691e-007
+3.328125e+000	   +1.220552e-007
+3.343750e+000	   +1.001118e-007
+3.359375e+000	   +9.436368e-008
+3.375000e+000	   +1.077034e-007
+3.390625e+000	   +1.291923e-007
+3.406250e+000	   +1.293595e-007
+3.421875e+000	   +1.296903e-007
+3.437500e+000	   +1.555291e-007
+3.453125e+000	   +1.538782e-007
+3.468750e+000	   +1.104727e-007
+3.484375e+000	   +1.233006e-007
+3.500000e+000	   +1.671606e-007
+3.515625e+000	   +1.775189e-007
+3.531250e+000	   +1.441602e-007
+3.546875e+000	   +1.104836e-007
+3.562500e+000	   +1.178636e-007
+3.578125e+000	   +1.182161e-007
+3.593750e+000	   +1.211829e-007
+3.609375e+000	   +1.231538e-007
+3.625000e+000	   +1.183733e-007
+3.640625e+000	   +1.313888e-007
+3.656250e+000	   +1.514204e-007
+3.671875e+000	   +1.299704e-007
+3.687500e+000	   +1.125573e-007
+3.703125e+000	   +1.145508e-007
+3.718750e+000	   +1.052080e-007
+3.734375e+000	   +1.279616e-007
+3.750000e+000	   +1.345546e-007
+3.765625e+000	   +1.430947e-007
+3.781250e+000	   +1.438617e-007
+3.796875e+000	   +1.185643e-007
+3.812500e+000	   +1.053107e-007
+3.828125e+000	   +1.494171e-007
+3.843750e+000	   +1.739614e-007
+3.859375e+000	   +1.569119e-007
+3.875000e+000	   +1.249214e-007
+3.890625e+000	   +1.036804e-007
+3.906250e+000	   +1.161402e-007
+3.921875e+000	   +1.302108e-007
+3.937500e+000	   +1.742649e-007
+3.953125e+000	   +1.705507e-007
+3.968750e+000	   +1.332776e-007
+3.984375e+000	   +1.299895e-007
+4.000000e+000	   +1.430120e-007
+4.015625e+000	   +1.581869e-007
+4.031250e+000	   +1.902917e-007
+4.046875e+000	   +1.993612e-007
+4.062500e+000	   +1.537166e-007
+4.078125e+000	   +1.374084e-007
+4.093750e+000	   +1.489424e-007
+4.109375e+000	   +1.512336e-007
+4.125000e+000	   +1.360010e-007
+4.140625e+000	   +1.197671e-007
+4.156250e+000	   +1.142369e-007
+4.171875e+000	   +1.443701e-007
+4.187500e+000	   +1.384921e-007
+4.203125e+000	   +1.248628e-007
+4.218750e+000	   +1.229559e-007
+4.234375e+000	   +1.305174e-007
+4.250000e+000	   +1.438205e-007
+4.265625e+000	   +1.167205e-007
+4.281250e+000	   +9.127783e-008
+4.296875e+000	   +1.141835e-007
+4.312500e+000	   +1.627878e-007
+4.328125e+000	   +1.489315e-007
+4.343750e+000	   +1.392356e-007
+4.359375e+000	   +1.929377e-007
+4.375000e+000	   +1.780655e-007
+4.390625e+000	   +1.290933e-007
+4.406250e+000	   +1.107756e-007
+4.421875e+000	   +1.555200e-007
+4.437500e+000	   +1.816432e-007
+4.453125e+000	   +1.506726e-007
+4.468750e+000	   +1.189967e-007
+4.484375e+000	   +1.124025e-007
+4.500000e+000	   +1.114314e-007
+4.515625e+000	   +1.095643e-007
+4.531250e+000	   +1.206995e-007
+4.546875e+000	   +1.439472e-007
+4.562500e+000	   +1.480251e-007
+4.578125e+000	   +1.357186e-007
+4.593750e+000	   +1.039134e-007
+4.609375e+000	   +9.399040e-008
+4.625000e+000	   +1.077841e-007
+4.640625e+000	   +9.394336e-008
+4.656250e+000	   +1.081393e-007
+4.671875e+000	   +1.209457e-007
+4.687500e+000	   +1.130032e-007
+4.703125e+000	   +1.092541e-007
+4.718750e+000	   +1.179454e-007
+4.734375e+000	   +1.156447e-007
+4.750000e+000	   +1.141894e-007
+4.765625e+000	   +1.249660e-007
+4.781250e+000	   +1.385204e-007
+4.796875e+000	   +1.362925e-007
+4.812500e+000	   +1.325576e-007
+4.828125e+000	   +1.384017e-007
+4.843750e+000	   +1.574061e-007
+4.859375e+000	   +1.455185e-007
+4.875000e+000	   +1.459068e-007
+4.890625e+000	   +1.563583e-007
+4.906250e+000	   +1.648235e-007
+4.921875e+000	   +1.580000e-007
+4.937500e+000	   +1.491827e-007
+4.953125e+000	   +1.563042e-007
+4.968750e+000	   +1.800503e-007
+4.984375e+000	   +1.709110e-007
+5.000000e+000	   +1.372159e-007
+5.015625e+000	   +1.316120e-007
+5.031250e+000	   +1.382372e-007
+5.046875e+000	   +1.328351e-007
+5.062500e+000	   +1.275804e-007
+5.078125e+000	   +1.286006e-007
+5.093750e+000	   +1.498898e-007
+5.109375e+000	   +1.721995e-007
+5.125000e+000	   +1.714263e-007
+5.140625e+000	   +1.414479e-007
+5.156250e+000	   +1.097681e-007
+5.171875e+000	   +1.180159e-007
+5.187500e+000	   +1.268816e-007
+5.203125e+000	   +1.337679e-007
+5.218750e+000	   +1.402070e-007
+5.234375e+000	   +1.260629e-007
+5.250000e+000	   +1.138070e-007
+5.265625e+000	   +1.022145e-007
+5.281250e+000	   +9.839053e-008
+5.296875e+000	   +9.115094e-008
+5.312500e+000	   +1.021051e-007
+5.328125e+000	   +1.256913e-007
+5.343750e+000	   +1.339704e-007
+5.359375e+000	   +1.177304e-007
+5.375000e+000	   +1.162177e-007
+5.390625e+000	   +1.453519e-007
+5.406250e+000	   +1.420733e-007
+5.421875e+000	   +1.082392e-007
+5.437500e+000	   +1.062372e-007
+5.453125e+000	   +1.112441e-007
+5.468750e+000	   +1.212401e-007
+5.484375e+000	   +1.312456e-007
+5.500000e+000	   +1.262757e-007
+5.515625e+000	   +1.340624e-007
+5.531250e+000	   +1.446908e-007
+5.546875e+000	   +1.248752e-007
+5.562500e+000	   +1.063176e-007
+5.578125e+000	   +1.077528e-007
+5.593750e+000	   +1.043918e-007
+5.609375e+000	   +1.346666e-007
+5.625000e+000	   +1.566960e-007
+5.640625e+000	   +1.366209e-007
+5.656250e+000	   +1.393261e-007
+5.671875e+000	   +1.343598e-007
+5.687500e+000	   +1.224211e-007
+5.703125e+000	   +1.430940e-007
+5.718750e+000	   +1.454191e-007
+5.734375e+000	   +1.309303e-007
+5.750000e+000	   +1.240673e-007
+5.765625e+000	   +1.140191e-007
+5.781250e+000	   +1.058976e-007
+5.796875e+000	   +1.146528e-007
+5.812500e+000	   +1.176979e-007
+5.828125e+000	   +1.091666e-007
+5.843750e+000	   +1.319493e-007
+5.859375e+000	   +1.355963e-007
+5.875000e+000	   +1.384620e-007
+5.890625e+000	   +1.733179e-007
+5.906250e+000	   +1.784817e-007
+5.921875e+000	   +1.439936e-007
+5.937500e+000	   +1.149021e-007
+5.953125e+000	   +1.204307e-007
+5.968750e+000	   +1.310845e-007
+5.984375e+000	   +1.210986e-007
+6.000000e+000	   +1.291832e-007
+6.015625e+000	   +1.390390e-007
+6.031250e+000	   +1.296655e-007
+6.046875e+000	   +1.234711e-007
+6.062500e+000	   +1.339706e-007
+6.078125e+000	   +1.183735e-007
+6.093750e+000	   +1.020562e-007
+6.109375e+000	   +1.345480e-007
+6.125000e+000	   +1.576851e-007
+6.140625e+000	   +1.511360e-007
+6.156250e+000	   +1.237581e-007
+6.171875e+000	   +1.070265e-007
+6.187500e+000	   +1.237408e-007
+6.203125e+000	   +1.541204e-007
+6.218750e+000	   +1.671100e-007
+6.234375e+000	   +1.340109e-007
+6.250000e+000	   +8.031446e-008
+6.265625e+000	   +1.337514e-007
+6.281250e+000	   +1.674494e-007
+6.296875e+000	   +1.527546e-007
+6.312500e+000	   +1.267605e-007
+6.328125e+000	   +1.214948e-007
+6.343750e+000	   +1.277172e-007
+6.359375e+000	   +1.455149e-007
+6.375000e+000	   +1.502748e-007
+6.390625e+000	   +1.350823e-007
+6.406250e+000	   +1.214177e-007
+6.421875e+000	   +1.006300e-007
+6.437500e+000	   +1.242679e-007
+6.453125e+000	   +1.368539e-007
+6.468750e+000	   +1.032272e-007
+6.484375e+000	   +8.523703e-008
+6.500000e+000	   +1.053508e-007
+6.515625e+000	   +1.171283e-007
+6.531250e+000	   +1.205321e-007
+6.546875e+000	   +1.220764e-007
+6.562500e+000	   +1.116811e-007
+6.578125e+000	   +7.518332e-008
+6.593750e+000	   +1.085028e-007
+6.609375e+000	   +1.471974e-007
+6.625000e+000	   +1.504708e-007
+6.640625e+000	   +1.566287e-007
+6.656250e+000	   +1.641605e-007
+6.671875e+000	   +1.797033e-007
+6.687500e+000	   +1.863071e-007
+6.703125e+000	   +1.663362e-007
+6.718750e+000	   +1.465454e-007
+6.734375e+000	   +1.332722e-007
+6.750000e+000	   +1.378117e-007
+6.765625e+000	   +1.259658e-007
+6.781250e+000	   +9.071454e-008
+6.796875e+000	   +9.735174e-008
+6.812500e+000	   +1.437834e-007
+6.828125e+000	   +1.690527e-007
+6.843750e+000	   +1.623346e-007
+6.859375e+000	   +1.440888e-007
+6.875000e+000	   +1.285095e-007
+6.890625e+000	   +1.301490e-007
+6.906250e+000	   +1.505615e-007
+6.921875e+000	   +1.526832e-007
+6.937500e+000	   +1.353397e-007
+6.953125e+000	   +1.202441e-007
+6.968750e+000	   +1.365002e-007
+6.984375e+000	   +1.392986e-007
+7.000000e+000	   +1.081070e-007
+7.015625e+000	   +9.399814e-008
+7.031250e+000	   +8.839289e-008
+7.046875e+000	   +1.072470e-007
+7.062500e+000	   +1.216710e-007
+7.078125e+000	   +1.277778e-007
+7.093750e+000	   +1.329435e-007
+7.109375e+000	   +1.331730e-007
+7.125000e+000	   +1.180431e-007
+7.140625e+000	   +1.298708e-007
+7.156250e+000	   +1.476696e-007
+7.171875e+000	   +1.401752e-007
+7.187500e+000	   +1.252389e-007
+7.203125e+000	   +1.154319e-007
+7.218750e+000	   +1.071445e-007
+7.234375e+000	   +1.044051e-007
+7.250000e+000	   +1.331010e-007
+7.265625e+000	   +1.287672e-007
+7.281250e+000	   +1.272588e-007
+7.296875e+000	   +1.325096e-007
+7.312500e+000	   +1.449727e-007
+7.328125e+000	   +1.484034e-007
+7.343750e+000	   +1.405307e-007
+7.359375e+000	   +1.272297e-007
+7.375000e+000	   +1.201586e-007
+7.390625e+000	   +1.080907e-007
+7.406250e+000	   +1.293872e-007
+7.421875e+000	   +1.498301e-007
+7.437500e+000	   +1.418282e-007
+7.453125e+000	   +1.410633e-007
+7.468750e+000	   +1.243727e-007
+7.484375e+000	   +1.011953e-007
+7.500000e+000	   +1.253569e-007
+7.515625e+000	   +1.381811e-007
+7.531250e+000	   +1.197531e-007
+7.546875e+000	   +1.293176e-007
+7.562500e+000	   +1.449810e-007
+7.578125e+000	   +1.581562e-007
+7.593750e+000	   +1.323835e-007
+7.609375e+000	   +9.894422e-008
+7.625000e+000	   +1.003366e-007
+7.640625e+000	   +1.344263e-007
+7.656250e+000	   +1.711134e-007
+7.671875e+000	   +1.621454e-007
+7.687500e+000	   +1.324486e-007
+7.703125e+000	   +1.079681e-007
+7.718750e+000	   +1.189904e-007
+7.734375e+000	   +1.232606e-007
+7.750000e+000	   +1.328976e-007
+7.765625e+000	   +1.520051e-007
+7.781250e+000	   +1.583750e-007
+7.796875e+000	   +1.491224e-007
+7.812500e+000	   +1.435510e-007
+7.828125e+000	   +1.499315e-007
+7.843750e+000	   +1.246459e-007
+7.859375e+000	   +1.024379e-007
+7.875000e+000	   +1.071805e-007
+7.890625e+000	   +1.179495e-007
+7.906250e+000	   +1.058733e-007
+7.921875e+000	   +1.277236e-007
+7.937500e+000	   +1.640412e-007
+7.953125e+000	   +1.546365e-007
+7.968750e+000	   +1.078364e-007
+7.984375e+000	   +1.041678e-007
+8.000000e+000	   +1.188277e-007
+8.015625e+000	   +1.305925e-007
+8.031250e+000	   +1.570613e-007
+8.046875e+000	   +1.339694e-007
+8.062500e+000	   +1.113932e-007
+8.078125e+000	   +1.134589e-007
+8.093750e+000	   +1.198488e-007
+8.109375e+000	   +1.162459e-007
+8.125000e+000	   +1.121587e-007
+8.140625e+000	   +1.289868e-007
+8.156250e+000	   +1.265414e-007
+8.171875e+000	   +1.276265e-007
+8.187500e+000	   +1.334142e-007
+8.203125e+000	   +1.228956e-007
+8.218750e+000	   +1.174831e-007
+8.234375e+000	   +1.121763e-007
+8.250000e+000	   +1.204867e-007
+8.265625e+000	   +1.200948e-007
+8.281250e+000	   +1.277378e-007
+8.296875e+000	   +1.497653e-007
+8.312500e+000	   +1.531033e-007
+8.328125e+000	   +1.496097e-007
+8.343750e+000	   +1.441100e-007
+8.359375e+000	   +1.405059e-007
+8.375000e+000	   +1.444449e-007
+8.390625e+000	   +1.553627e-007
+8.406250e+000	   +1.159037e-007
+8.421875e+000	   +1.178486e-007
+8.437500e+000	   +1.627054e-007
+8.453125e+000	   +1.629829e-007
+8.468750e+000	   +1.720780e-007
+8.484375e+000	   +1.883490e-007
+8.500000e+000	   +1.733335e-007
+8.515625e+000	   +1.313789e-007
+8.531250e+000	   +9.242852e-008
+8.546875e+000	   +1.214682e-007
+8.562500e+000	   +1.452039e-007
+8.578125e+000	   +1.253587e-007
+8.593750e+000	   +1.029595e-007
+8.609375e+000	   +1.163511e-007
+8.625000e+000	   +1.336918e-007
+8.640625e+000	   +1.402541e-007
+8.656250e+000	   +1.442150e-007
+8.671875e+000	   +1.250600e-007
+8.687500e+000	   +1.144847e-007
+8.703125e+000	   +1.267257e-007
+8.718750e+000	   +1.440809e-007
+8.734375e+000	   +1.527761e-007
+8.750000e+000	   +1.593015e-007
+8.765625e+000	   +1.640916e-007
+8.781250e+000	   +1.494534e-007
+8.796875e+000	   +1.238931e-007
+8.812500e+000	   +1.215198e-007
+8.828125e+000	   +1.278134e-007
+8.843750e+000	   +1.264037e-007
+8.859375e+000	   +1.215643e-007
+8.875000e+000	   +1.276455e-007
+8.890625e+000	   +1.539534e-007
+8.906250e+000	   +1.594256e-007
+8.921875e+000	   +1.415412e-007
+8.937500e+000	   +1.252480e-007
+8.953125e+000	   +1.251699e-007
+8.968750e+000	   +1.266964e-007
+8.984375e+000	   +1.370206e-007
+9.000000e+000	   +1.240938e-007
+9.015625e+000	   +1.345503e-007
+9.031250e+000	   +1.452455e-007
+9.046875e+000	   +1.309802e-007
+9.062500e+000	   +1.050027e-007
+9.078125e+000	   +7.064602e-008
+9.093750e+000	   +7.580149e-008
+9.109375e+000	   +9.423727e-008
+9.125000e+000	   +1.259958e-007
+9.140625e+000	   +1.339113e-007
+9.156250e+000	   +1.316448e-007
+9.171875e+000	   +1.391738e-007
+9.187500e+000	   +1.284854e-007
+9.203125e+000	   +1.258718e-007
+9.218750e+000	   +1.386514e-007
+9.234375e+000	   +1.500036e-007
+9.250000e+000	   +1.526988e-007
+9.265625e+000	   +1.401411e-007
+9.281250e+000	   +1.177883e-007
+9.296875e+000	   +1.204874e-007
+9.312500e+000	   +1.271262e-007
+9.328125e+000	   +1.319171e-007
+9.343750e+000	   +1.318898e-007
+9.359375e+000	   +1.059009e-007
+9.375000e+000	   +9.237982e-008
+9.390625e+000	   +1.043400e-007
+9.406250e+000	   +1.115772e-007
+9.421875e+000	   +1.018131e-007
+9.437500e+000	   +1.225629e-007
+9.453125e+000	   +1.561793e-007
+9.468750e+000	   +1.561529e-007
+9.484375e+000	   +1.203586e-007
+9.500000e+000	   +1.016764e-007
+9.515625e+000	   +1.196618e-007
+9.531250e+000	   +1.269544e-007
+9.546875e+000	   +1.386149e-007
+9.562500e+000	   +1.428300e-007
+9.578125e+000	   +1.237307e-007
+9.593750e+000	   +1.175044e-007
+9.609375e+000	   +1.216414e-007
+9.625000e+000	   +1.483995e-007
+9.640625e+000	   +1.679792e-007
+9.656250e+000	   +1.493392e-007
+9.671875e+000	   +1.141357e-007
+9.687500e+000	   +1.114036e-007
+9.703125e+000	   +1.337401e-007
+9.718750e+000	   +1.659340e-007
+9.734375e+000	   +1.647135e-007
+9.750000e+000	   +1.516855e-007
+9.765625e+000	   +1.569143e-007
+9.781250e+000	   +1.490574e-007
+9.796875e+000	   +1.513114e-007
+9.812500e+000	   +1.597766e-007
+9.828125e+000	   +1.443680e-007
+9.843750e+000	   +1.340671e-007
+9.859375e+000	   +1.430912e-007
+9.875000e+000	   +1.548399e-007
+9.890625e+000	   +1.624810e-007
+9.906250e+000	   +1.444365e-007
+9.921875e+000	   +1.259562e-007
+9.937500e+000	   +1.307400e-007
+9.953125e+000	   +1.221540e-007
+9.968750e+000	   +1.259753e-007
+9.984375e+000	   +1.645179e-007
+1.000000e+001	   +1.639922e-007
+1.001563e+001	   +1.358164e-007
+1.003125e+001	   +1.190674e-007
+1.004688e+001	   +1.248934e-007
+1.006250e+001	   +1.311788e-007
+1.007813e+001	   +1.002716e-007
+1.009375e+001	   +1.202618e-007
+1.010938e+001	   +1.376697e-007
+1.012500e+001	   +1.262484e-007
+1.014063e+001	   +1.128738e-007
+1.015625e+001	   +1.140238e-007
+1.017188e+001	   +1.193987e-007
+1.018750e+001	   +1.181144e-007
+1.020313e+001	   +1.185252e-007
+1.021875e+001	   +1.154703e-007
+1.023438e+001	   +1.174329e-007
+1.025000e+001	   +1.231289e-007
+1.026563e+001	   +1.142805e-007
+1.028125e+001	   +1.127341e-007
+1.029688e+001	   +1.198155e-007
+1.031250e+001	   +1.027365e-007
+1.032813e+001	   +1.025367e-007
+1.034375e+001	   +1.112339e-007
+1.035938e+001	   +1.009840e-007
+1.037500e+001	   +1.192015e-007
+1.039063e+001	   +1.106589e-007
+1.040625e+001	   +9.840684e-008
+1.042188e+001	   +1.304721e-007
+1.043750e+001	   +1.342297e-007
+1.045313e+001	   +1.227212e-007
+1.046875e+001	   +1.108033e-007
+1.048438e+001	   +1.319613e-007
+1.050000e+001	   +1.554886e-007
+1.051563e+001	   +1.607954e-007
+1.053125e+001	   +1.664398e-007
+1.054688e+001	   +1.536073e-007
+1.056250e+001	   +1.401940e-007
+1.057813e+001	   +1.290861e-007
+1.059375e+001	   +1.202474e-007
+1.060938e+001	   +1.273882e-007
+1.062500e+001	   +1.077195e-007
+1.064063e+001	   +9.999803e-008
+1.065625e+001	   +1.011197e-007
+1.067188e+001	   +8.813008e-008
+1.068750e+001	   +9.930304e-008
+1.070313e+001	   +1.228747e-007
+1.071875e+001	   +1.256468e-007
+1.073438e+001	   +1.278583e-007
+1.075000e+001	   +1.305009e-007
+1.076563e+001	   +1.201155e-007
+1.078125e+001	   +8.793474e-008
+1.079688e+001	   +6.631910e-008
+1.081250e+001	   +1.052586e-007
+1.082813e+001	   +1.490116e-007
+1.084375e+001	   +1.566860e-007
+1.085938e+001	   +1.360906e-007
+1.087500e+001	   +1.308747e-007
+1.089063e+001	   +1.421654e-007
+1.090625e+001	   +1.478261e-007
+1.092188e+001	   +1.189483e-007
+1.093750e+001	   +1.036851e-007
+1.095313e+001	   +1.200725e-007
+1.096875e+001	   +1.063655e-007
+1.098438e+001	   +9.342791e-008
+1.100000e+001	   +1.127760e-007
+1.101563e+001	   +1.211801e-007
+1.103125e+001	   +1.200374e-007
+1.104688e+001	   +1.501531e-007
+1.106250e+001	   +1.839056e-007
+1.107813e+001	   +1.769336e-007
+1.109375e+001	   +1.553062e-007
+1.110938e+001	   +1.461394e-007
+1.112500e+001	   +1.518606e-007
+1.114063e+001	   +1.340500e-007
+1.115625e+001	   +1.162333e-007
+1.117188e+001	   +1.231185e-007
+1.118750e+001	   +1.319767e-007
+1.120313e+001	   +1.383652e-007
+1.121875e+001	   +1.488986e-007
+1.123438e+001	   +1.490792e-007
+1.125000e+001	   +1.241431e-007
+1.126563e+001	   +1.276144e-007
+1.128125e+001	   +1.336970e-007
+1.129688e+001	   +1.461813e-007
+1.131250e+001	   +1.654792e-007
+1.132813e+001	   +1.427593e-007
+1.134375e+001	   +1.195018e-007
+1.135938e+001	   +1.190402e-007
+1.137500e+001	   +1.347702e-007
+1.139063e+001	   +1.498617e-007
+1.140625e+001	   +1.391402e-007
+1.142188e+001	   +1.126507e-007
+1.143750e+001	   +1.063387e-007
+1.145313e+001	   +1.047523e-007
+1.146875e+001	   +1.142377e-007
+1.148438e+001	   +1.288670e-007
+1.150000e+001	   +1.348478e-007
+1.151563e+001	   +1.621698e-007
+1.153125e+001	   +1.711179e-007
+1.154688e+001	   +1.383864e-007
+1.156250e+001	   +1.147903e-007
+1.157813e+001	   +1.289991e-007
+1.159375e+001	   +1.245550e-007
+1.160938e+001	   +1.200546e-007
+1.162500e+001	   +1.311477e-007
+1.164063e+001	   +1.400185e-007
+1.165625e+001	   +1.310262e-007
+1.167188e+001	   +1.108543e-007
+1.168750e+001	   +1.219568e-007
+1.170313e+001	   +1.216472e-007
+1.171875e+001	   +1.395956e-007
+1.173438e+001	   +1.548482e-007
+1.175000e+001	   +1.295746e-007
+1.176563e+001	   +1.073325e-007
+1.178125e+001	   +1.028988e-007
+1.179688e+001	   +1.165758e-007
+1.181250e+001	   +1.103493e-007
+1.182813e+001	   +1.254222e-007
+1.184375e+001	   +1.479804e-007
+1.185938e+001	   +1.431193e-007
+1.187500e+001	   +1.313157e-007
+1.189063e+001	   +1.271314e-007
+1.190625e+001	   +1.231722e-007
+1.192188e+001	   +1.161734e-007
+1.193750e+001	   +1.199211e-007
+1.195313e+001	   +1.256804e-007
+1.196875e+001	   +1.214059e-007
+1.198438e+001	   +1.226943e-007
+1.200000e+001	   +1.277138e-007
+1.201563e+001	   +1.251296e-007
+1.203125e+001	   +1.162333e-007
+1.204688e+001	   +1.247835e-007
+1.206250e+001	   +1.218351e-007
+1.207813e+001	   +1.052929e-007
+1.209375e+001	   +1.172276e-007
+1.210938e+001	   +1.389872e-007
+1.212500e+001	   +1.215130e-007
+1.214063e+001	   +1.100465e-007
+1.215625e+001	   +1.415278e-007
+1.217188e+001	   +1.580364e-007
+1.218750e+001	   +1.575482e-007
+1.220313e+001	   +1.430048e-007
+1.221875e+001	   +1.431130e-007
+1.223438e+001	   +1.391103e-007
+1.225000e+001	   +1.429689e-007
+1.226563e+001	   +1.332285e-007
+1.228125e+001	   +1.071858e-007
+1.229688e+001	   +1.218497e-007
+1.231250e+001	   +1.400322e-007
+1.232813e+001	   +1.574813e-007
+1.234375e+001	   +1.503878e-007
+1.235938e+001	   +1.229649e-007
+1.237500e+001	   +1.109359e-007
+1.239063e+001	   +1.273730e-007
+1.240625e+001	   +1.374555e-007
+1.242188e+001	   +1.348239e-007
+1.243750e+001	   +1.183959e-007
+1.245313e+001	   +1.131743e-007
+1.246875e+001	   +1.205933e-007
+1.248438e+001	   +1.251871e-007
+1.250000e+001	   +1.007819e-007
+1.275000e+001	   +1.297921e-007
+1.300000e+001	   +1.392906e-007
+1.325000e+001	   +1.294572e-007
+1.350000e+001	   +1.348732e-007
+1.375000e+001	   +1.622886e-007
+1.400000e+001	   +1.645064e-007
+1.425000e+001	   +1.407394e-007
+1.450000e+001	   +1.130249e-007
+1.475000e+001	   +9.845872e-008
+1.500000e+001	   +9.014700e-008
+1.525000e+001	   +9.777132e-008
+1.550000e+001	   +1.168225e-007
+1.575000e+001	   +1.093144e-007
+1.600000e+001	   +1.361959e-007
+1.625000e+001	   +1.628210e-007
+1.650000e+001	   +1.330414e-007
+1.675000e+001	   +1.051541e-007
+1.700000e+001	   +1.014636e-007
+1.725000e+001	   +1.209298e-007
+1.750000e+001	   +1.270235e-007
+1.775000e+001	   +1.423633e-007
+1.800000e+001	   +1.690197e-007
+1.825000e+001	   +1.747825e-007
+1.850000e+001	   +1.594825e-007
+1.875000e+001	   +1.331786e-007
+1.900000e+001	   +1.228678e-007
+1.925000e+001	   +1.250739e-007
+1.950000e+001	   +1.175968e-007
+1.975000e+001	   +1.150576e-007
+2.000000e+001	   +1.010470e-007
+2.025000e+001	   +1.107220e-007
+2.050000e+001	   +1.111719e-007
+2.075000e+001	   +1.214055e-007
+2.100000e+001	   +1.313704e-007
+2.125000e+001	   +1.182240e-007
+2.150000e+001	   +1.150950e-007
+2.175000e+001	   +1.346442e-007
+2.200000e+001	   +1.458553e-007
+2.225000e+001	   +1.299347e-007
+2.250000e+001	   +1.266443e-007
+2.275000e+001	   +1.356976e-007
+2.300000e+001	   +1.228781e-007
+2.325000e+001	   +1.149977e-007
+2.350000e+001	   +1.171005e-007
+2.375000e+001	   +1.143300e-007
+2.400000e+001	   +1.101214e-007
+2.425000e+001	   +1.057110e-007
+2.450000e+001	   +1.007223e-007
+2.475000e+001	   +1.125645e-007
+2.500000e+001	   +1.235952e-007
+2.525000e+001	   +1.260220e-007
+2.550000e+001	   +1.455901e-007
+2.575000e+001	   +1.570273e-007
+2.600000e+001	   +1.616394e-007
+2.625000e+001	   +1.627790e-007
+2.650000e+001	   +1.268904e-007
+2.675000e+001	   +1.008400e-007
+2.700000e+001	   +1.351120e-007
+2.725000e+001	   +1.476848e-007
+2.750000e+001	   +1.334494e-007
+2.775000e+001	   +1.344440e-007
+2.800000e+001	   +1.432877e-007
+2.825000e+001	   +1.197324e-007
+2.850000e+001	   +8.352497e-008
+2.875000e+001	   +9.319903e-008
+2.900000e+001	   +1.031435e-007
+2.925000e+001	   +1.089686e-007
+2.950000e+001	   +1.139857e-007
+2.975000e+001	   +1.243674e-007
+3.000000e+001	   +1.491400e-007
+3.025000e+001	   +1.587130e-007
+3.050000e+001	   +1.265582e-007
+3.075000e+001	   +1.171046e-007
+3.100000e+001	   +1.227625e-007
+3.125000e+001	   +1.204190e-007
+3.150000e+001	   +1.045562e-007
+3.175000e+001	   +1.033527e-007
+3.200000e+001	   +1.222552e-007
+3.225000e+001	   +1.284184e-007
+3.250000e+001	   +1.328615e-007
+3.275000e+001	   +1.320319e-007
+3.300000e+001	   +1.266071e-007
+3.325000e+001	   +1.227275e-007
+3.350000e+001	   +1.236633e-007
+3.375000e+001	   +1.248598e-007
+3.400000e+001	   +1.086847e-007
+3.425000e+001	   +1.078488e-007
+3.450000e+001	   +1.254796e-007
+3.475000e+001	   +1.322339e-007
+3.500000e+001	   +1.270630e-007
+3.525000e+001	   +1.169046e-007
+3.550000e+001	   +1.260189e-007
+3.575000e+001	   +1.261153e-007
+3.600000e+001	   +1.149078e-007
+3.625000e+001	   +1.134152e-007
+3.650000e+001	   +1.060663e-007
+3.675000e+001	   +1.198940e-007
+3.700000e+001	   +1.442210e-007
+3.725000e+001	   +1.483630e-007
+3.750000e+001	   +1.319208e-007
+3.775000e+001	   +8.854471e-008
+3.800000e+001	   +9.940275e-008
+3.825000e+001	   +1.325797e-007
+3.850000e+001	   +1.272115e-007
+3.875000e+001	   +1.129301e-007
+3.900000e+001	   +1.249414e-007
+3.925000e+001	   +1.302424e-007
+3.950000e+001	   +1.481234e-007
+3.975000e+001	   +1.667839e-007
+4.000000e+001	   +1.463558e-007
+4.025000e+001	   +1.093300e-007
+4.050000e+001	   +1.066974e-007
+4.075000e+001	   +1.092680e-007
+4.100000e+001	   +1.070030e-007
+4.125000e+001	   +1.197537e-007
+4.150000e+001	   +1.398165e-007
+4.175000e+001	   +1.421896e-007
+4.200000e+001	   +1.441138e-007
+4.225000e+001	   +1.508935e-007
+4.250000e+001	   +1.489398e-007
+4.275000e+001	   +1.302455e-007
+4.300000e+001	   +1.082264e-007
+4.325000e+001	   +1.117047e-007
+4.350000e+001	   +1.121340e-007
+4.375000e+001	   +1.241653e-007
+4.400000e+001	   +1.601437e-007
+4.425000e+001	   +1.509601e-007
+4.450000e+001	   +1.251520e-007
+4.475000e+001	   +1.085121e-007
+4.500000e+001	   +1.251376e-007
+4.525000e+001	   +1.307365e-007
+4.550000e+001	   +1.234118e-007
+4.575000e+001	   +1.101832e-007
+4.600000e+001	   +1.115204e-007
+4.625000e+001	   +1.406207e-007
+4.650000e+001	   +1.459768e-007
+4.675000e+001	   +1.419441e-007
+4.700000e+001	   +1.252649e-007
+4.725000e+001	   +9.105951e-008
+4.750000e+001	   +9.613849e-008
+4.775000e+001	   +1.176146e-007
+4.800000e+001	   +1.403420e-007
+4.825000e+001	   +1.568661e-007
+4.850000e+001	   +1.327529e-007
+4.875000e+001	   +1.121940e-007
+4.900000e+001	   +1.180848e-007
+4.925000e+001	   +1.237216e-007
+4.950000e+001	   +1.290701e-007
+4.975000e+001	   +1.088351e-007
+5.000000e+001	   +1.215802e-007
+5.025000e+001	   +1.603374e-007
+5.050000e+001	   +1.594310e-007
+5.075000e+001	   +1.402772e-007
+5.100000e+001	   +1.348880e-007
+5.125000e+001	   +1.379328e-007
+5.150000e+001	   +1.251498e-007
+5.175000e+001	   +1.146371e-007
+5.200000e+001	   +1.204401e-007
+5.225000e+001	   +1.174543e-007
+5.250000e+001	   +1.166106e-007
+5.275000e+001	   +8.829986e-008
+5.300000e+001	   +9.453240e-008
+5.325000e+001	   +9.544235e-008
+5.350000e+001	   +8.566260e-008
+5.375000e+001	   +9.550870e-008
+5.400000e+001	   +1.099680e-007
+5.425000e+001	   +1.272704e-007
+5.450000e+001	   +1.355270e-007
+5.475000e+001	   +1.356788e-007
+5.500000e+001	   +1.272314e-007
+5.525000e+001	   +1.178604e-007
+5.550000e+001	   +1.251993e-007
+5.575000e+001	   +1.300240e-007
+5.600000e+001	   +1.079174e-007
+5.625000e+001	   +1.096053e-007
+5.650000e+001	   +1.186087e-007
+5.675000e+001	   +1.005429e-007
+5.700000e+001	   +9.207857e-008
+5.725000e+001	   +9.808668e-008
+5.750000e+001	   +9.701562e-008
+5.775000e+001	   +1.227204e-007
+5.800000e+001	   +1.331891e-007
+5.825000e+001	   +1.140891e-007
+5.850000e+001	   +1.002818e-007
+5.875000e+001	   +1.243768e-007
+5.900000e+001	   +1.273040e-007
+5.925000e+001	   +1.160051e-007
+5.950000e+001	   +1.327966e-007
+5.975000e+001	   +1.619677e-007
+6.000000e+001	   +1.664354e-007
+6.025000e+001	   +1.302192e-007
+6.050000e+001	   +8.869027e-008
+6.075000e+001	   +1.007352e-007
+6.100000e+001	   +1.080964e-007
+6.125000e+001	   +1.345988e-007
+6.150000e+001	   +1.633754e-007
+6.175000e+001	   +1.484044e-007
+6.200000e+001	   +1.145957e-007
+6.225000e+001	   +1.117679e-007
+6.250000e+001	   +1.220256e-007
+6.275000e+001	   +1.258310e-007
+6.300000e+001	   +1.089718e-007
+6.325000e+001	   +7.708147e-008
+6.350000e+001	   +1.184613e-007
+6.375000e+001	   +1.403295e-007
+6.400000e+001	   +1.108578e-007
+6.425000e+001	   +1.133221e-007
+6.450000e+001	   +1.476252e-007
+6.475000e+001	   +1.735927e-007
+6.500000e+001	   +1.478878e-007
+6.525000e+001	   +1.242294e-007
+6.550000e+001	   +1.104915e-007
+6.575000e+001	   +8.725871e-008
+6.600000e+001	   +9.204046e-008
+6.625000e+001	   +1.018968e-007
+6.650000e+001	   +1.076576e-007
+6.675000e+001	   +1.151092e-007
+6.700000e+001	   +1.163025e-007
+6.725000e+001	   +1.084856e-007
+6.750000e+001	   +1.134894e-007
+6.775000e+001	   +1.145639e-007
+6.800000e+001	   +9.058694e-008
+6.825000e+001	   +7.629882e-008
+6.850000e+001	   +8.835107e-008
+6.875000e+001	   +1.082826e-007
+6.900000e+001	   +9.801843e-008
+6.925000e+001	   +7.829379e-008
+6.950000e+001	   +8.842716e-008
+6.975000e+001	   +1.028915e-007
+7.000000e+001	   +1.064590e-007
+7.025000e+001	   +1.001111e-007
+7.050000e+001	   +1.057370e-007
+7.075000e+001	   +1.140524e-007
+7.100000e+001	   +1.152486e-007
+7.125000e+001	   +1.243047e-007
+7.150000e+001	   +1.213157e-007
+7.175000e+001	   +1.015526e-007
+7.200000e+001	   +6.214013e-008
+7.225000e+001	   +9.268390e-008
+7.250000e+001	   +1.307750e-007
+7.275000e+001	   +1.173655e-007
+7.300000e+001	   +9.870865e-008
+7.325000e+001	   +1.056371e-007
+7.350000e+001	   +1.174938e-007
+7.375000e+001	   +1.212444e-007
+7.400000e+001	   +1.063843e-007
+7.425000e+001	   +8.778839e-008
+7.450000e+001	   +9.904922e-008
+7.475000e+001	   +1.287946e-007
+7.500000e+001	   +1.259615e-007
+7.525000e+001	   +1.190159e-007
+7.550000e+001	   +1.192516e-007
+7.575000e+001	   +1.120588e-007
+7.600000e+001	   +1.142650e-007
+7.625000e+001	   +1.198787e-007
+7.650000e+001	   +1.131351e-007
+7.675000e+001	   +1.064894e-007
+7.700000e+001	   +1.040601e-007
+7.725000e+001	   +1.079704e-007
+7.750000e+001	   +1.072914e-007
+7.775000e+001	   +1.257646e-007
+7.800000e+001	   +1.434557e-007
+7.825000e+001	   +1.491911e-007
+7.850000e+001	   +1.240705e-007
+7.875000e+001	   +8.324820e-008
+7.900000e+001	   +8.771738e-008
+7.925000e+001	   +1.269834e-007
+7.950000e+001	   +1.530407e-007
+7.975000e+001	   +1.278489e-007
+8.000000e+001	   +9.496277e-008
+8.025000e+001	   +1.048716e-007
+8.050000e+001	   +1.068455e-007
+8.075000e+001	   +1.086122e-007
+8.100000e+001	   +1.043967e-007
+8.125000e+001	   +1.118497e-007
+8.150000e+001	   +1.068746e-007
+8.175000e+001	   +1.061978e-007
+8.200000e+001	   +1.079133e-007
+8.225000e+001	   +1.090062e-007
+8.250000e+001	   +1.215625e-007
+8.275000e+001	   +1.060673e-007
+8.300000e+001	   +9.134921e-008
+8.325000e+001	   +9.312456e-008
+8.350000e+001	   +9.489325e-008
+8.375000e+001	   +9.615517e-008
+8.400000e+001	   +7.719895e-008
+8.425000e+001	   +1.192622e-007
+8.450000e+001	   +1.259311e-007
+8.475000e+001	   +1.041271e-007
+8.500000e+001	   +1.182088e-007
+8.525000e+001	   +1.220172e-007
+8.550000e+001	   +1.133531e-007
+8.575000e+001	   +1.147256e-007
+8.600000e+001	   +1.039509e-007
+8.625000e+001	   +1.032970e-007
+8.650000e+001	   +1.285561e-007
+8.675000e+001	   +1.320632e-007
+8.700000e+001	   +1.031512e-007
+8.725000e+001	   +9.221404e-008
+8.750000e+001	   +1.065575e-007
+8.775000e+001	   +9.894476e-008
+8.800000e+001	   +1.131744e-007
+8.825000e+001	   +1.261381e-007
+8.850000e+001	   +1.323878e-007
+8.875000e+001	   +1.474475e-007
+8.900000e+001	   +1.434314e-007
+8.925000e+001	   +1.336723e-007
+8.950000e+001	   +1.119040e-007
+8.975000e+001	   +1.006492e-007
+9.000000e+001	   +1.043653e-007
+9.025000e+001	   +8.638997e-008
+9.050000e+001	   +8.463878e-008
+9.075000e+001	   +1.085466e-007
+9.100000e+001	   +1.246732e-007
+9.125000e+001	   +9.761311e-008
+9.150000e+001	   +1.023804e-007
+9.175000e+001	   +1.438609e-007
+9.200000e+001	   +1.537475e-007
+9.225000e+001	   +1.338692e-007
+9.250000e+001	   +1.198203e-007
+9.275000e+001	   +1.150833e-007
+9.300000e+001	   +9.807128e-008
+9.325000e+001	   +8.605504e-008
+9.350000e+001	   +8.228892e-008
+9.375000e+001	   +8.927598e-008
+9.400000e+001	   +1.120689e-007
+9.425000e+001	   +1.217855e-007
+9.450000e+001	   +1.234830e-007
+9.475000e+001	   +1.277689e-007
+9.500000e+001	   +1.190701e-007
+9.525000e+001	   +1.071720e-007
+9.550000e+001	   +1.157491e-007
+9.575000e+001	   +1.322185e-007
+9.600000e+001	   +1.371716e-007
+9.625000e+001	   +1.494548e-007
+9.650000e+001	   +1.500476e-007
+9.675000e+001	   +1.338241e-007
+9.700000e+001	   +1.245813e-007
+9.725000e+001	   +1.203498e-007
+9.750000e+001	   +1.217330e-007
+9.775000e+001	   +1.175182e-007
+9.800000e+001	   +1.098065e-007
+9.825000e+001	   +1.141533e-007
+9.850000e+001	   +1.211624e-007
+9.875000e+001	   +1.060213e-007
+9.900000e+001	   +1.137137e-007
+9.925000e+001	   +1.418419e-007
+9.950000e+001	   +1.396512e-007
+9.975000e+001	   +1.096401e-007
+1.000000e+002	   +1.016525e-007
+1.002500e+002	   +1.185280e-007
+1.005000e+002	   +1.234830e-007
+1.007500e+002	   +1.085474e-007
+1.010000e+002	   +1.025076e-007
+1.012500e+002	   +1.016817e-007
+1.015000e+002	   +1.100144e-007
+1.017500e+002	   +1.151062e-007
+1.020000e+002	   +1.029022e-007
+1.022500e+002	   +9.963198e-008
+1.025000e+002	   +1.014329e-007
+1.027500e+002	   +8.678727e-008
+1.030000e+002	   +8.439269e-008
+1.032500e+002	   +1.066383e-007
+1.035000e+002	   +1.132475e-007
+1.037500e+002	   +8.157180e-008
+1.040000e+002	   +7.632982e-008
+1.042500e+002	   +1.003417e-007
+1.045000e+002	   +1.265266e-007
+1.047500e+002	   +1.219967e-007
+1.050000e+002	   +8.803849e-008
+1.052500e+002	   +8.200904e-008
+1.055000e+002	   +9.839074e-008
+1.057500e+002	   +9.932540e-008
+1.060000e+002	   +1.037537e-007
+1.062500e+002	   +1.198692e-007
+1.065000e+002	   +1.266738e-007
+1.067500e+002	   +1.160109e-007
+1.070000e+002	   +1.053474e-007
+1.072500e+002	   +9.686332e-008
+1.075000e+002	   +8.503736e-008
+1.077500e+002	   +9.153184e-008
+1.080000e+002	   +9.988917e-008
+1.082500e+002	   +9.110821e-008
+1.085000e+002	   +8.915246e-008
+1.087500e+002	   +1.004945e-007
+1.090000e+002	   +1.042017e-007
+1.092500e+002	   +8.582528e-008
+1.095000e+002	   +8.346071e-008
+1.097500e+002	   +9.421988e-008
+1.100000e+002	   +1.030517e-007
+1.102500e+002	   +1.115789e-007
+1.105000e+002	   +1.036544e-007
+1.107500e+002	   +9.509789e-008
+1.110000e+002	   +1.047647e-007
+1.112500e+002	   +1.041024e-007
+1.115000e+002	   +1.077856e-007
+1.117500e+002	   +1.150443e-007
+1.120000e+002	   +1.107558e-007
+1.122500e+002	   +9.083633e-008
+1.125000e+002	   +7.521940e-008
+1.127500e+002	   +8.787045e-008
+1.130000e+002	   +1.033596e-007
+1.132500e+002	   +1.107807e-007
+1.135000e+002	   +1.048112e-007
+1.137500e+002	   +1.067602e-007
+1.140000e+002	   +1.007455e-007
+1.142500e+002	   +7.646982e-008
+1.145000e+002	   +5.684909e-008
+1.147500e+002	   +6.175448e-008
+1.150000e+002	   +8.152130e-008
+1.152500e+002	   +8.945858e-008
+1.155000e+002	   +8.624554e-008
+1.157500e+002	   +1.001505e-007
+1.160000e+002	   +1.012818e-007
+1.162500e+002	   +1.176890e-007
+1.165000e+002	   +1.452396e-007
+1.167500e+002	   +1.553352e-007
+1.170000e+002	   +1.452648e-007
+1.172500e+002	   +1.204584e-007
+1.175000e+002	   +1.022346e-007
+1.177500e+002	   +1.112042e-007
+1.180000e+002	   +1.093822e-007
+1.182500e+002	   +9.202025e-008
+1.185000e+002	   +9.840890e-008
+1.187500e+002	   +1.191431e-007
+1.190000e+002	   +1.289345e-007
+1.192500e+002	   +1.177787e-007
+1.195000e+002	   +9.701456e-008
+1.197500e+002	   +8.487301e-008
+1.200000e+002	   +9.921923e-008
+1.202500e+002	   +1.011721e-007
+1.205000e+002	   +1.033727e-007
+1.207500e+002	   +1.139870e-007
+1.210000e+002	   +1.127948e-007
+1.212500e+002	   +1.149812e-007
+1.215000e+002	   +1.211588e-007
+1.217500e+002	   +1.265509e-007
+1.220000e+002	   +1.369787e-007
+1.222500e+002	   +1.324549e-007
+1.225000e+002	   +1.148006e-007
+1.227500e+002	   +1.169214e-007
+1.230000e+002	   +1.097845e-007
+1.232500e+002	   +8.487329e-008
+1.235000e+002	   +7.372095e-008
+1.237500e+002	   +8.969837e-008
+1.240000e+002	   +1.048955e-007
+1.242500e+002	   +1.077682e-007
+1.245000e+002	   +9.897497e-008
+1.247500e+002	   +1.124276e-007
+1.250000e+002	   +1.255615e-007
+1.252500e+002	   +1.262099e-007
+1.255000e+002	   +1.149108e-007
+1.257500e+002	   +1.181392e-007
+1.260000e+002	   +1.075367e-007
+1.262500e+002	   +6.986731e-008
+1.265000e+002	   +7.136748e-008
+1.267500e+002	   +9.818441e-008
+1.270000e+002	   +9.594751e-008
+1.272500e+002	   +8.245515e-008
+1.275000e+002	   +1.079259e-007
+1.277500e+002	   +1.451244e-007
+1.280000e+002	   +1.462694e-007
+1.282500e+002	   +1.203566e-007
+1.285000e+002	   +1.049038e-007
+1.287500e+002	   +1.175206e-007
+1.290000e+002	   +1.142564e-007
+1.292500e+002	   +1.056964e-007
+1.295000e+002	   +1.003870e-007
+1.297500e+002	   +8.460951e-008
+1.300000e+002	   +9.701850e-008
+1.302500e+002	   +1.155870e-007
+1.305000e+002	   +1.006053e-007
+1.307500e+002	   +9.229203e-008
+1.310000e+002	   +9.980190e-008
+1.312500e+002	   +9.748523e-008
+1.315000e+002	   +8.495832e-008
+1.317500e+002	   +8.082196e-008
+1.320000e+002	   +8.342608e-008
+1.322500e+002	   +8.229181e-008
+1.325000e+002	   +1.037564e-007
+1.327500e+002	   +1.322015e-007
+1.330000e+002	   +1.222618e-007
+1.332500e+002	   +8.965268e-008
+1.335000e+002	   +1.126008e-007
+1.337500e+002	   +1.367393e-007
+1.340000e+002	   +1.221708e-007
+1.342500e+002	   +1.029060e-007
+1.345000e+002	   +8.964323e-008
+1.347500e+002	   +8.387787e-008
+1.350000e+002	   +7.902486e-008
+1.352500e+002	   +7.668549e-008
+1.355000e+002	   +1.012506e-007
+1.357500e+002	   +1.033239e-007
+1.360000e+002	   +1.018933e-007
+1.362500e+002	   +9.186307e-008
+1.365000e+002	   +1.111030e-007
+1.367500e+002	   +1.139815e-007
+1.370000e+002	   +9.651617e-008
+1.372500e+002	   +1.097978e-007
+1.375000e+002	   +1.239322e-007
+1.377500e+002	   +1.153035e-007
+1.380000e+002	   +1.100430e-007
+1.382500e+002	   +1.168871e-007
+1.385000e+002	   +1.081780e-007
+1.387500e+002	   +9.703416e-008
+1.390000e+002	   +9.873499e-008
+1.392500e+002	   +1.064773e-007
+1.395000e+002	   +1.136744e-007
+1.397500e+002	   +1.095559e-007
+1.400000e+002	   +1.016136e-007
+1.402500e+002	   +1.075584e-007
+1.405000e+002	   +1.031096e-007
+1.407500e+002	   +9.367010e-008
+1.410000e+002	   +9.109981e-008
+1.412500e+002	   +1.037741e-007
+1.415000e+002	   +1.119287e-007
+1.417500e+002	   +1.037551e-007
+1.420000e+002	   +1.052528e-007
+1.422500e+002	   +1.090418e-007
+1.425000e+002	   +1.023778e-007
+1.427500e+002	   +1.010697e-007
+1.430000e+002	   +1.036545e-007
+1.432500e+002	   +7.669660e-008
+1.435000e+002	   +6.852473e-008
+1.437500e+002	   +8.461917e-008
+1.440000e+002	   +8.817818e-008
+1.442500e+002	   +9.958124e-008
+1.445000e+002	   +1.037498e-007
+1.447500e+002	   +1.032440e-007
+1.450000e+002	   +9.841992e-008
+1.452500e+002	   +1.007735e-007
+1.455000e+002	   +9.610102e-008
+1.457500e+002	   +8.022879e-008
+1.460000e+002	   +9.796646e-008
+1.462500e+002	   +1.270834e-007
+1.465000e+002	   +1.156530e-007
+1.467500e+002	   +1.104160e-007
+1.470000e+002	   +1.118706e-007
+1.472500e+002	   +1.079249e-007
+1.475000e+002	   +1.219050e-007
+1.477500e+002	   +1.091223e-007
+1.480000e+002	   +1.078932e-007
+1.482500e+002	   +1.156037e-007
+1.485000e+002	   +9.686714e-008
+1.487500e+002	   +9.803188e-008
+1.490000e+002	   +1.049830e-007
+1.492500e+002	   +9.792409e-008
+1.495000e+002	   +8.908944e-008
+1.497500e+002	   +8.940065e-008
+1.500000e+002	   +9.458120e-008
+1.502500e+002	   +1.218817e-007
+1.505000e+002	   +1.222575e-007
+1.507500e+002	   +8.263814e-008
+1.510000e+002	   +4.818421e-008
+1.512500e+002	   +5.130873e-008
+1.515000e+002	   +6.966776e-008
+1.517500e+002	   +1.185696e-007
+1.520000e+002	   +1.246780e-007
+1.522500e+002	   +1.092098e-007
+1.525000e+002	   +1.029318e-007
+1.527500e+002	   +1.006314e-007
+1.530000e+002	   +9.698612e-008
+1.532500e+002	   +1.009714e-007
+1.535000e+002	   +9.806741e-008
+1.537500e+002	   +1.116829e-007
+1.540000e+002	   +1.425702e-007
+1.542500e+002	   +1.244219e-007
+1.545000e+002	   +9.208766e-008
+1.547500e+002	   +9.422050e-008
+1.550000e+002	   +8.265112e-008
+1.552500e+002	   +7.525600e-008
+1.555000e+002	   +1.008052e-007
+1.557500e+002	   +1.038599e-007
+1.560000e+002	   +1.044723e-007
+1.562500e+002	   +9.339427e-008
+1.565000e+002	   +8.692822e-008
+1.567500e+002	   +9.296539e-008
+1.570000e+002	   +9.522944e-008
+1.572500e+002	   +9.877142e-008
+1.575000e+002	   +1.051829e-007
+1.577500e+002	   +9.884617e-008
+1.580000e+002	   +9.827382e-008
+1.582500e+002	   +1.106424e-007
+1.585000e+002	   +1.208106e-007
+1.587500e+002	   +1.260065e-007
+1.590000e+002	   +1.255644e-007
+1.592500e+002	   +1.110626e-007
+1.595000e+002	   +9.941432e-008
+1.597500e+002	   +1.039719e-007
+1.600000e+002	   +1.088972e-007
+1.602500e+002	   +1.269796e-007
+1.605000e+002	   +1.312320e-007
+1.607500e+002	   +1.045086e-007
+1.610000e+002	   +8.205606e-008
+1.612500e+002	   +8.436452e-008
+1.615000e+002	   +9.685311e-008
+1.617500e+002	   +9.353363e-008
+1.620000e+002	   +1.091242e-007
+1.622500e+002	   +1.143082e-007
+1.625000e+002	   +9.857608e-008
+1.627500e+002	   +9.765149e-008
+1.630000e+002	   +8.589296e-008
+1.632500e+002	   +9.728539e-008
+1.635000e+002	   +1.209076e-007
+1.637500e+002	   +1.167691e-007
+1.640000e+002	   +8.551778e-008
+1.642500e+002	   +7.435215e-008
+1.645000e+002	   +8.493957e-008
+1.647500e+002	   +1.026866e-007
+1.650000e+002	   +1.080265e-007
+1.652500e+002	   +8.200922e-008
+1.655000e+002	   +8.783699e-008
+1.657500e+002	   +1.232039e-007
+1.660000e+002	   +1.192482e-007
+1.662500e+002	   +9.417696e-008
+1.665000e+002	   +9.140861e-008
+1.667500e+002	   +1.043747e-007
+1.670000e+002	   +1.102791e-007
+1.672500e+002	   +1.069939e-007
+1.675000e+002	   +8.893502e-008
+1.677500e+002	   +7.493658e-008
+1.680000e+002	   +7.732653e-008
+1.682500e+002	   +8.828950e-008
+1.685000e+002	   +9.273194e-008
+1.687500e+002	   +1.019608e-007
+1.690000e+002	   +1.163812e-007
+1.692500e+002	   +1.069865e-007
+1.695000e+002	   +8.118500e-008
+1.697500e+002	   +7.259833e-008
+1.700000e+002	   +6.838682e-008
+1.702500e+002	   +6.163202e-008
+1.705000e+002	   +7.719284e-008
+1.707500e+002	   +9.110031e-008
+1.710000e+002	   +8.463645e-008
+1.712500e+002	   +6.216742e-008
+1.715000e+002	   +7.395484e-008
+1.717500e+002	   +8.953906e-008
+1.720000e+002	   +1.162269e-007
+1.722500e+002	   +1.305103e-007
+1.725000e+002	   +1.085487e-007
+1.727500e+002	   +1.054313e-007
+1.730000e+002	   +1.243983e-007
+1.732500e+002	   +1.188630e-007
+1.735000e+002	   +9.852393e-008
+1.737500e+002	   +7.957504e-008
+1.740000e+002	   +6.692579e-008
+1.742500e+002	   +7.395541e-008
+1.745000e+002	   +7.801611e-008
+1.747500e+002	   +8.547976e-008
+1.750000e+002	   +9.937165e-008
+1.752500e+002	   +1.009673e-007
+1.755000e+002	   +8.755727e-008
+1.757500e+002	   +8.974900e-008
+1.760000e+002	   +9.347849e-008
+1.762500e+002	   +8.151754e-008
+1.765000e+002	   +9.226396e-008
+1.767500e+002	   +9.624611e-008
+1.770000e+002	   +9.695258e-008
+1.772500e+002	   +1.032737e-007
+1.775000e+002	   +9.129577e-008
+1.777500e+002	   +7.687592e-008
+1.780000e+002	   +8.771998e-008
+1.782500e+002	   +9.351227e-008
+1.785000e+002	   +8.921973e-008
+1.787500e+002	   +9.964052e-008
+1.790000e+002	   +1.098891e-007
+1.792500e+002	   +1.091072e-007
+1.795000e+002	   +9.539907e-008
+1.797500e+002	   +8.444042e-008
+1.800000e+002	   +9.932332e-008
+1.802500e+002	   +9.314123e-008
+1.805000e+002	   +8.170015e-008
+1.807500e+002	   +8.175390e-008
+1.810000e+002	   +9.684396e-008
+1.812500e+002	   +1.151571e-007
+1.815000e+002	   +1.067864e-007
+1.817500e+002	   +9.287776e-008
+1.820000e+002	   +9.276718e-008
+1.822500e+002	   +9.453188e-008
+1.825000e+002	   +1.045799e-007
+1.827500e+002	   +1.122724e-007
+1.830000e+002	   +9.809509e-008
+1.832500e+002	   +7.784874e-008
+1.835000e+002	   +8.548098e-008
+1.837500e+002	   +9.447346e-008
+1.840000e+002	   +1.016951e-007
+1.842500e+002	   +1.093749e-007
+1.845000e+002	   +9.856223e-008
+1.847500e+002	   +9.432038e-008
+1.850000e+002	   +9.061618e-008
+1.852500e+002	   +9.636560e-008
+1.855000e+002	   +9.185995e-008
+1.857500e+002	   +9.047273e-008
+1.860000e+002	   +9.331196e-008
+1.862500e+002	   +8.868433e-008
+1.865000e+002	   +9.525935e-008
+1.867500e+002	   +1.082350e-007
+1.870000e+002	   +1.105109e-007
+1.872500e+002	   +1.061495e-007
+1.875000e+002	   +1.037739e-007
+1.877500e+002	   +1.117704e-007
+1.880000e+002	   +1.200145e-007
+1.882500e+002	   +1.091649e-007
+1.885000e+002	   +1.030019e-007
+1.887500e+002	   +9.424389e-008
+1.890000e+002	   +8.830578e-008
+1.892500e+002	   +7.711152e-008
+1.895000e+002	   +6.927311e-008
+1.897500e+002	   +8.278335e-008
+1.900000e+002	   +9.593330e-008
+1.902500e+002	   +8.939241e-008
+1.905000e+002	   +9.546163e-008
+1.907500e+002	   +9.485741e-008
+1.910000e+002	   +8.895739e-008
+1.912500e+002	   +8.231793e-008
+1.915000e+002	   +9.048177e-008
+1.917500e+002	   +1.062689e-007
+1.920000e+002	   +9.883163e-008
+1.922500e+002	   +9.130569e-008
+1.925000e+002	   +8.099794e-008
+1.927500e+002	   +7.468925e-008
+1.930000e+002	   +8.645763e-008
+1.932500e+002	   +7.331863e-008
+1.935000e+002	   +8.370078e-008
+1.937500e+002	   +9.066893e-008
+1.940000e+002	   +9.502921e-008
+1.942500e+002	   +1.146289e-007
+1.945000e+002	   +1.085778e-007
+1.947500e+002	   +9.395656e-008
+1.950000e+002	   +9.111741e-008
+1.952500e+002	   +8.933952e-008
+1.955000e+002	   +8.812834e-008
+1.957500e+002	   +1.072270e-007
+1.960000e+002	   +1.172553e-007
+1.962500e+002	   +1.046916e-007
+1.965000e+002	   +9.528319e-008
+1.967500e+002	   +9.364183e-008
+1.970000e+002	   +9.023573e-008
+1.972500e+002	   +8.046204e-008
+1.975000e+002	   +8.831848e-008
+1.977500e+002	   +8.394061e-008
+1.980000e+002	   +6.638736e-008
+1.982500e+002	   +7.023835e-008
+1.985000e+002	   +8.088303e-008
+1.987500e+002	   +8.131489e-008
+1.990000e+002	   +6.602347e-008
+1.992500e+002	   +6.583967e-008
+1.995000e+002	   +8.765192e-008
+1.997500e+002	   +9.841948e-008
+2.000000e+002	   +9.024038e-008
