{
  "submitter": "albert.einstein@LIGO.ORG",
  "created": "2022-03-16 16:24:22 UTC",
  "group": "CBC",
  "graceid": "G194533",
  "pipeline": "gstlal",
  "gpstime": 1331483080.381693,
  "instruments": "H1,L1",
  "nevents": 2,
  "offline": true,
  "search": "AllSky",
  "far": 9.838364843405464e-07,
  "far_is_upper_limit": false,
  "likelihood": 7.102756279364618,
  "labels": [],
  "extra_attributes": {
    "CoincInspiral": {
      "ifos": "H1,L1",
      "end_time": 1331483080,
      "end_time_ns": 381693272,
      "mass": 33.25822162628174,
      "mchirp": 8.482876777648926,
      "minimum_duration": 10.69916749000549,
      "snr": 8.132830463379912,
      "false_alarm_rate": 1.0,
      "combined_far": 9.838364843405464e-07
    },
    "SingleInspiral": [
      {
        "alpha5": 0.0,
        "Gamma9": 0.0,
        "alpha3": 0.0,
        "chi": 0.0,
        "Gamma3": 0.0,
        "mass2": 3.8596239,
        "psi3": 0.0,
        "bank_chisq_dof": 0,
        "alpha4": 0.0,
        "spin1x": 0.0,
        "tau5": 0.0,
        "cont_chisq_dof": 0,
        "tau0": 13.399828,
        "spin2z": -0.7718026,
        "chisq": 0.84257615,
        "ttotal": 0.0,
        "Gamma5": 0.0,
        "Gamma2": 0.0,
        "Gamma7": 0.0,
        "ifo": "H1",
        "tau3": 2.0797865,
        "coa_phase": 1.0123366,
        "template_duration": 16.54621628092527,
        "bank_chisq": 4.4854383,
        "event_duration": 0.0,
        "sigmasq": 94135947.51864928,
        "Gamma4": 0.0,
        "Gamma6": 0.0,
        "mtotal": 33.258221,
        "tau4": 0.0,
        "psi0": 0.0,
        "impulse_time": 0,
        "alpha6": 0.0,
        "spin2x": 0.0,
        "cont_chisq": 0.0,
        "end_time_ns": 296526746,
        "mchirp": 8.4828768,
        "alpha": 0.0,
        "mass1": 29.398598,
        "impulse_time_ns": 0,
        "spin1y": 0.0,
        "Gamma8": 0.0,
        "spin2y": 0.0,
        "spin1z": -0.023584178,
        "channel": "GDS-CALIB_STRAIN_CLEAN",
        "end_time": 1269006850,
        "eta": 0.10258257,
        "kappa": 0.0,
        "search": "",
        "amplitude": 0.0,
        "snr": 4.4854383,
        "alpha2": 0.0,
        "beta": 0.0,
        "rsqveto_duration": 0.0,
        "alpha1": 0.0,
        "chisq_dof": 1,
        "end_time_gmst": 46546.36006766932,
        "f_final": 1024.0,
        "Gamma0": 8754102.0,
        "tau2": 0.0,
        "Gamma1": 682.0
      },
      {
        "alpha5": 0.0,
        "Gamma9": 0.0,
        "alpha3": 0.0,
        "chi": 0.0,
        "Gamma3": 0.0,
        "mass2": 3.8596239,
        "psi3": 0.0,
        "bank_chisq_dof": 0,
        "alpha4": 0.0,
        "spin1x": 0.0,
        "tau5": 0.0,
        "cont_chisq_dof": 0,
        "tau0": 13.399828,
        "spin2z": -0.7718026,
        "chisq": 0.80979407,
        "ttotal": 0.0,
        "Gamma5": 0.0,
        "Gamma2": 0.0,
        "Gamma7": 0.0,
        "ifo": "L1",
        "tau3": 2.0797865,
        "coa_phase": -2.6118183,
        "template_duration": 16.54621628092527,
        "bank_chisq": 6.7840824,
        "event_duration": 0.0,
        "sigmasq": 147851034.091153,
        "Gamma4": 0.0,
        "Gamma6": 0.0,
        "mtotal": 33.258221,
        "tau4": 0.0,
        "psi0": 0.0,
        "impulse_time": 0,
        "alpha6": 0.0,
        "spin2x": 0.0,
        "cont_chisq": 0.0,
        "end_time_ns": 300832569,
        "mchirp": 8.4828768,
        "alpha": 0.0,
        "mass1": 29.398598,
        "impulse_time_ns": 0,
        "spin1y": 0.0,
        "Gamma8": 0.0,
        "spin2y": 0.0,
        "spin1z": -0.023584178,
        "channel": "GDS-CALIB_STRAIN_CLEAN",
        "end_time": 1269006850,
        "eta": 0.10258257,
        "kappa": 0.0,
        "search": "",
        "amplitude": 0.0,
        "snr": 6.7840824,
        "alpha2": 0.0,
        "beta": 0.0,
        "rsqveto_duration": 0.0,
        "alpha1": 0.0,
        "chisq_dof": 1,
        "end_time_gmst": 46546.36006798331,
        "f_final": 1024.0,
        "Gamma0": 8754102.0,
        "tau2": 0.0,
        "Gamma1": 682.0
      }
    ]
  },
  "superevent": null,
  "superevent_neighbours": {
    "S220316o": {
        "... S220316o dict excluded for clarity ..."
  },
  "links": {
    "neighbors": "https://gracedb-test.ligo.org/api/events/G194533/neighbors/",
    "log": "https://gracedb-test.ligo.org/api/events/G194533/log/",
    "emobservations": "https://gracedb-test.ligo.org/api/events/G194533/emobservation/",
    "files": "https://gracedb-test.ligo.org/api/events/G194533/files/",
    "labels": "https://gracedb-test.ligo.org/api/events/G194533/labels/",
    "self": "https://gracedb-test.ligo.org/api/events/G194533",
    "tags": "https://gracedb-test.ligo.org/api/events/G194533/tag/"
  }
}
