{
    "graceid": "G194536",
    "gpstime": 1042312876.509,
    "pipeline": "CWB",
    "labels": [],
    "group": "Burst",
    "extra_attributes": {
        "MultiBurst": {
            "central_freq": 1392.169556,
            "false_alarm_rate": null,
            "confidence": null,
            "start_time_ns": 500000000,
            "start_time": 1042312876,
            "ligo_angle_sig": null,
            "bandwidth": 256.0,
            "single_ifo_times": "1042312876.5073,1042312876.5090",
            "snr": 7.298671111921677,
            "ligo_angle": null,
            "amplitude": 5.017162,
            "ligo_axis_ra": 201.224625,
            "duration": 0.023438,
            "ligo_axis_dec": 69.422546,
            "peak_time_ns": null,
            "peak_time": null,
            "ifos": "H1,L1"
        }
    },
    "links": {
        "neighbors": "https://gracedb-test.ligo.org/api/events/G194536/neighbors/",
        "files": "https://gracedb-test.ligo.org/api/events/G194536/files/",
        "log": "https://gracedb-test.ligo.org/api/events/G194536/log/",
        "tags": "https://gracedb-test.ligo.org/api/events/G194536/tag/",
        "self": "https://gracedb-test.ligo.org/api/events/G194536",
        "labels": "https://gracedb-test.ligo.org/api/events/G194536/labels/",
        "emobservations": "https://gracedb-test.ligo.org/api/events/G194536/emobservation/"
    },
    "created": "2022-03-16 18:18:52 UTC",
    "far": 0.00019265,
    "instruments": "H1,L1",
    "warnings": [],
    "search": "AllSky",
    "nevents": null,
    "superevent": null,
    "submitter": "albert.einstein@LIGO.ORG",
    "superevent_neighbours": {},
    "offline": false,
    "likelihood": 53.2706,
    "far_is_upper_limit": false
}
