JS luminosity_distance: 3.85e-04 (+5.421010862427522e-18 -7.047314121155779e-18)
JS azimuth: 1.31e-03 (+8.456776945386935e-18 -7.15573433840433e-18)
JS phase: 6.53e-04 (+5.312590645178972e-18 -7.806255641895632e-18)
JS chi_2_in_plane: 7.91e-04 (+6.288372600415926e-18 -4.87890977618477e-18)
JS theta_jn: 5.48e-04 (+6.071532165918825e-18 -4.553649124439119e-18)
JS chi_1: 7.90e-04 (+6.5052130349130266e-18 -6.396792817664476e-18)
JS psi: 1.23e-03 (+5.637851296924623e-18 -4.7704895589362195e-18)
JS chi_2: 4.84e-04 (+5.5294310796760726e-18 -7.37257477290143e-18)
JS zenith: 2.49e-04 (+4.174178364069192e-18 -6.2341624917916505e-18)
JS mass_ratio: 6.09e-04 (+6.179952383167375e-18 -6.179952383167375e-18)
JS phi_12: 1.02e-03 (+5.854691731421724e-18 -4.7704895589362195e-18)
JS chi_1_in_plane: 3.80e-04 (+4.716279450311944e-18 -4.607859233063394e-18)
JS chirp_mass: 3.52e-04 (+8.077306185017008e-18 -5.2583805365546965e-18)
JS geocent_time: 5.09e-04 (+5.9631119486702744e-18 -6.071532165918825e-18)
JS phi_jl: 1.33e-03 (+5.637851296924623e-18 -5.637851296924623e-18)
