JS values:
  chirp_mass: 0.0009746581842875762
  mass_ratio: 0.0006190025909767692
  mass_1: 0.0007380477196719207
  mass_2: 0.0006415958709214282
  mass_1_source: 0.0009624920576255025
  mass_2_source: 0.0005292337587671826
  a_1: 0.0007358248998503188
  a_2: 0.0004814209737323402
  chi_eff: 0.000976000407866258
  chi_p: 0.00030832773566610627
  luminosity_distance: 0.0006848149479383637
  dec: 0.002232665954227351
  ra: 0.0013475420531568903
  theta_jn: 0.0038510607125009123
  psi: 0.0006405307556657828
  phase: 0.00018556648016124824
  lambda_1: 0.00023371877052310615
  lambda_2: 0.0002772787132377114
  delta_lambda_tilde: 0.0001494170276377395
  lambda_tilde: 0.0005672392941883787
Maximum JS for 5000 samples of theta_jn is 0.0038510607125009123
