05:47 bilby_pipe INFO    : Running bilby_pipe version: 1.0.4: (CLEAN) a0f8deb 2021-05-14 15:08:45 +0000
05:47 bilby_pipe INFO    : Running bilby: 1.1.4: release
05:47 bilby_pipe INFO    : Command line arguments: Namespace(accounting='ligo.dev.o3.cbc.pe.lalinference', allow_tape=True, analysis_executable=None, calibration_model=None, catch_waveform_errors=False, channel_dict='{H1:GWOSC, L1:GWOSC, V1:GWOSC}', coherence_test=False, condor_job_priority=0, conversion_function=None, convert_to_flat_in_component_mass=False, create_plots=False, create_summary=False, data_dict=None, data_dump_file='outdir_GW170817TaylorF2Ecc/data/GW170817TaylorF2Ecc_data0_1187008882-4_generation_data_dump.pickle', data_format=None, default_prior='BBHPriorDict', deltaT=0.2, detectors=['H1', 'L1', 'V1'], distance_marginalization=False, distance_marginalization_lookup_table=None, duration=16.0, email=None, existing_dir=None, extra_likelihood_kwargs=None, frequency_domain_source_model='lal_eccentric_binary_black_hole_no_spins', gaussian_noise=False, generation_function=None, generation_seed=None, gps_file=None, gps_tuple=None, idx=0, ignore_gwpy_data_quality_check=True, ini='GW170817TaylorF2Ecc_config_complete.ini', injection=False, injection_dict=None, injection_file=None, injection_numbers=['None'], injection_waveform_approximant=None, jitter_time=True, label='GW170817TaylorF2Ecc_data0_1187008882-4_analysis_H1L1V1_dynesty', likelihood_type='GravitationalWaveTransient', local=False, local_generation=False, local_plot=False, log_directory=None, maximum_frequency=None, minimum_frequency='20', mode_array=[None], n_parallel=1, n_simulation=1, notification='Never', numerical_relativity_file=None, online_pe=False, osg=False, outdir='outdir_GW170817TaylorF2Ecc', overwrite_outdir=False, periodic_restart_time=28800, phase_marginalization=False, plot_calibration=False, plot_corner=False, plot_format='png', plot_marginal=False, plot_skymap=False, plot_waveform=False, pn_amplitude_order=0, pn_phase_order=-1, pn_spin_order=-1, pn_tidal_order=-1, post_trigger_duration=1.0, postprocessing_arguments=None, postprocessing_executable=None, prior_dict="{chirp-mass: Uniform(name='chirp_mass', minimum=0.8705505632961241,maximum=2.611651689888372), mass_ratio = Uniform(name='mass_ratio', minimum=0.3333333333333333, maximum=1), eccentricity = Uniform(name='e0', minimum=0.0, maximum=0.1), luminosity_distance = 40.7, a_1 = Uniform(name='a_1', minimum=-0.5, maximum=0.5), a_2 = Uniform(name='a_1', minimum=-0.5, maximum=0.5), theta_jn = Sine(name='theta_jn'), psi =  Uniform(name='psi', minimum=0, maximum=6.283185307179586), phase = Uniform(name='phase', minimum=0, maximum=6.283185307179586), geocent_time = Uniform(1187008882.33, 1187008882.53, name='geocent_time', unit='s'), ra = 3.44615914, dec =  -0.40808407, }", prior_file=None, psd_dict=None, psd_fractional_overlap=0.5, psd_length=32, psd_maximum_duration=1024, psd_method='median', psd_start_time=None, reference_frame='sky', reference_frequency=20.0, request_cpus=8, request_memory=4.0, request_memory_generation=None, resampling_method='lal', result_format='json', roq_folder=None, roq_scale_factor=1.0, roq_weights=None, sampler='dynesty', sampler_kwargs="{'nlive': 500, 'npool': 8}", sampling_frequency=1024.0, sampling_seed=None, scheduler='condor', scheduler_analysis_time='7-00:00:00', scheduler_args=None, scheduler_env=None, scheduler_module=[None], single_postprocessing_arguments=None, single_postprocessing_executable=None, singularity_image=None, spline_calibration_amplitude_uncertainty_dict=None, spline_calibration_envelope_dict=None, spline_calibration_nodes=5, spline_calibration_phase_uncertainty_dict=None, submit=False, summarypages_arguments=None, time_marginalization=False, time_reference='geocent', timeslide_dict=None, timeslide_file=None, transfer_files=True, trigger_time='1187008882.4', tukey_roll_off=0.4, verbose=False, waveform_approximant='TaylorF2Ecc', waveform_arguments_dict=None, waveform_generator='bilby.gw.waveform_generator.WaveformGenerator', webdir=None, zero_noise=False)
05:47 bilby_pipe INFO    : Sampling seed set to 558273
05:47 bilby_pipe INFO    : No maximum frequency given. Setting to sampling frequency / 2 = 512.0
05:47 bilby_pipe INFO    : No calibration_model model provided, calibration marginalization will not be used
05:47 bilby_pipe INFO    : Found data for detectors = ['H1', 'L1', 'V1']
05:47 bilby_pipe INFO    : Using data for detectors = ['H1', 'L1', 'V1']
05:47 bilby_pipe INFO    : H1: sampling-frequency=1024.0, segment-start-time=1187008867.3999023, duration=16.0
05:47 bilby_pipe INFO    : L1: sampling-frequency=1024.0, segment-start-time=1187008867.3999023, duration=16.0
05:47 bilby_pipe INFO    : V1: sampling-frequency=1024.0, segment-start-time=1187008867.3999023, duration=16.0
05:47 bilby_pipe INFO    : Using the lal_eccentric_binary_black_hole_no_spins source model
05:47 bilby_pipe INFO    : Using conversion_function convert_to_lal_binary_black_hole_parameters
05:47 bilby INFO    : Waveform generator initiated with
  frequency_domain_source_model: bilby.gw.source.lal_eccentric_binary_black_hole_no_spins
  time_domain_source_model: None
  parameter_conversion: bilby.gw.conversion.convert_to_lal_binary_black_hole_parameters
05:47 bilby_pipe INFO    : Using generation_function generate_all_bbh_parameters
05:47 bilby INFO    : Running for label 'GW170817TaylorF2Ecc_data0_1187008882-4_analysis_H1L1V1_dynesty', output will be saved to 'outdir_GW170817TaylorF2Ecc/result'
05:47 bilby INFO    : Using lal version 7.1.4.1
05:47 bilby INFO    : Using lal git version Branch: main;Tag: None;Id: 2d59f4ee7b23c4b496e756e939153dd38682f33c;;Builder: hemantakumar.phurailatpam <hemantaphurailatpam@gmail.com>;Repository status: UNCLEAN: Modified working tree
05:47 bilby INFO    : Using lalsimulation version 3.0.0.1
05:47 bilby INFO    : Using lalsimulation git version Branch: main;Tag: None;Id: 2d59f4ee7b23c4b496e756e939153dd38682f33c;;Builder: hemantakumar.phurailatpam <hemantaphurailatpam@gmail.com>;Repository status: UNCLEAN: Modified working tree
05:47 bilby INFO    : Search parameters:
05:47 bilby INFO    :   chirp_mass = Uniform(minimum=0.8705505632961241, maximum=2.611651689888372, name='chirp_mass', latex_label='$\\mathcal{M}$', unit=None, boundary=None)
05:47 bilby INFO    :   mass_ratio = Uniform(minimum=0.3333333333333333, maximum=1, name='mass_ratio', latex_label='$q$', unit=None, boundary=None)
05:47 bilby INFO    :   eccentricity = Uniform(minimum=0.0, maximum=0.1, name='e0', latex_label='e0', unit=None, boundary=None)
05:47 bilby INFO    :   a_1 = Uniform(minimum=-0.5, maximum=0.5, name='a_1', latex_label='$a_1$', unit=None, boundary=None)
05:47 bilby INFO    :   a_2 = Uniform(minimum=-0.5, maximum=0.5, name='a_1', latex_label='$a_1$', unit=None, boundary=None)
05:47 bilby INFO    :   theta_jn = Sine(minimum=0, maximum=3.141592653589793, name='theta_jn', latex_label='$\\theta_{JN}$', unit=None, boundary=None)
05:47 bilby INFO    :   psi = Uniform(minimum=0, maximum=6.283185307179586, name='psi', latex_label='$\\psi$', unit=None, boundary=None)
05:47 bilby INFO    :   phase = Uniform(minimum=0, maximum=6.283185307179586, name='phase', latex_label='$\\phi$', unit=None, boundary=None)
05:47 bilby INFO    :   geocent_time = Uniform(minimum=1187008882.33, maximum=1187008882.53, name='geocent_time', latex_label='$t_c$', unit='s', boundary=None)
05:47 bilby INFO    :   luminosity_distance = 40.7
05:47 bilby INFO    :   ra = 3.44615914
05:47 bilby INFO    :   dec = -0.40808407
05:47 bilby INFO    : Generating frequency domain strain from given time domain strain.
05:47 bilby INFO    : Applying a tukey window with alpha=0.05, roll off=0.4
05:47 bilby INFO    : Generating frequency domain strain from given time domain strain.
05:47 bilby INFO    : Applying a tukey window with alpha=0.05, roll off=0.4
05:47 bilby INFO    : Generating frequency domain strain from given time domain strain.
05:47 bilby INFO    : Applying a tukey window with alpha=0.05, roll off=0.4
05:47 bilby INFO    : Single likelihood evaluation took 7.174e-03 s
05:47 bilby INFO    : Using sampler Dynesty with kwargs {'bound': 'multi', 'sample': 'rwalk', 'verbose': True, 'periodic': None, 'reflective': None, 'check_point_delta_t': 1800, 'nlive': 500, 'first_update': None, 'walks': 100, 'npdim': None, 'rstate': None, 'queue_size': 8, 'pool': None, 'use_pool': None, 'live_points': None, 'logl_args': None, 'logl_kwargs': None, 'ptform_args': None, 'ptform_kwargs': None, 'enlarge': 1.5, 'bootstrap': None, 'vol_dec': 0.5, 'vol_check': 8.0, 'facc': 0.2, 'slices': 5, 'update_interval': 300, 'print_func': <bound method Dynesty._print_func of <bilby.core.sampler.dynesty.Dynesty object at 0x2b03504a6c90>>, 'dlogz': 0.1, 'maxiter': None, 'maxcall': None, 'logl_max': inf, 'add_live': True, 'print_progress': True, 'save_bounds': False, 'n_effective': None, 'maxmcmc': 5000, 'nact': 5, 'print_method': 'tqdm'}
05:47 bilby INFO    : Checkpoint every check_point_delta_t = 600s
05:47 bilby INFO    : Using dynesty version 1.0.1
05:47 bilby INFO    : Using the bilby-implemented rwalk sample method with ACT estimated walks
05:47 bilby INFO    : Setting up multiproccesing pool with 8 processes.
05:47 bilby INFO    : Resume file outdir_GW170817TaylorF2Ecc/result/GW170817TaylorF2Ecc_data0_1187008882-4_analysis_H1L1V1_dynesty_resume.pickle does not exist.
05:47 bilby INFO    : Generating initial points from the prior
05:57 bilby INFO    : Written checkpoint file outdir_GW170817TaylorF2Ecc/result/GW170817TaylorF2Ecc_data0_1187008882-4_analysis_H1L1V1_dynesty_resume.pickle
05:57 bilby WARNING : singular matrix
05:57 bilby WARNING : Failed to create dynesty state plot at checkpoint
05:57 bilby WARNING : singular matrix
05:57 bilby WARNING : Failed to create dynesty unit state plot at checkpoint
05:57 bilby WARNING : singular matrix
05:57 bilby WARNING : Failed to create dynesty run plot at checkpoint
06:07 bilby INFO    : Written checkpoint file outdir_GW170817TaylorF2Ecc/result/GW170817TaylorF2Ecc_data0_1187008882-4_analysis_H1L1V1_dynesty_resume.pickle
06:07 bilby WARNING : singular matrix
06:07 bilby WARNING : Failed to create dynesty state plot at checkpoint
06:07 bilby WARNING : singular matrix
06:07 bilby WARNING : Failed to create dynesty unit state plot at checkpoint
/home/hemantakumar.phurailatpam/anaconda3/envs/lal2/lib/python3.7/site-packages/dynesty/plotting.py:179: RuntimeWarning: overflow encountered in exp
  data = [nlive, np.exp(logl), np.exp(logwt), np.exp(logz)]
06:07 bilby WARNING : singular matrix
06:07 bilby WARNING : Failed to create dynesty run plot at checkpoint
06:17 bilby INFO    : Written checkpoint file outdir_GW170817TaylorF2Ecc/result/GW170817TaylorF2Ecc_data0_1187008882-4_analysis_H1L1V1_dynesty_resume.pickle
/home/hemantakumar.phurailatpam/anaconda3/envs/lal2/lib/python3.7/site-packages/dynesty/plotting.py:675: UserWarning: Attempting to set identical bottom == top == 0.0 results in singular transformations; automatically expanding.
  ax.set_ylim([0., max(y0) * 1.05])
/home/hemantakumar.phurailatpam/anaconda3/envs/lal2/lib/python3.7/site-packages/dynesty/plotting.py:675: UserWarning: Attempting to set identical bottom == top == 0.0 results in singular transformations; automatically expanding.
  ax.set_ylim([0., max(y0) * 1.05])
/home/hemantakumar.phurailatpam/anaconda3/envs/lal2/lib/python3.7/site-packages/dynesty/plotting.py:179: RuntimeWarning: overflow encountered in exp
  data = [nlive, np.exp(logl), np.exp(logwt), np.exp(logz)]
/home/hemantakumar.phurailatpam/anaconda3/envs/lal2/lib/python3.7/site-packages/dynesty/plotting.py:203: RuntimeWarning: overflow encountered in exp
  zspan = (0., 1.05 * np.exp(logz[-1] + 3. * logzerr[-1]))
06:17 bilby WARNING : Axis limits cannot be NaN or Inf
06:17 bilby WARNING : Failed to create dynesty run plot at checkpoint
06:27 bilby INFO    : Written checkpoint file outdir_GW170817TaylorF2Ecc/result/GW170817TaylorF2Ecc_data0_1187008882-4_analysis_H1L1V1_dynesty_resume.pickle
/home/hemantakumar.phurailatpam/anaconda3/envs/lal2/lib/python3.7/site-packages/dynesty/plotting.py:179: RuntimeWarning: overflow encountered in exp
  data = [nlive, np.exp(logl), np.exp(logwt), np.exp(logz)]
/home/hemantakumar.phurailatpam/anaconda3/envs/lal2/lib/python3.7/site-packages/dynesty/plotting.py:203: RuntimeWarning: overflow encountered in exp
  zspan = (0., 1.05 * np.exp(logz[-1] + 3. * logzerr[-1]))
06:27 bilby WARNING : Axis limits cannot be NaN or Inf
06:27 bilby WARNING : Failed to create dynesty run plot at checkpoint
06:37 bilby INFO    : Written checkpoint file outdir_GW170817TaylorF2Ecc/result/GW170817TaylorF2Ecc_data0_1187008882-4_analysis_H1L1V1_dynesty_resume.pickle
/home/hemantakumar.phurailatpam/anaconda3/envs/lal2/lib/python3.7/site-packages/dynesty/plotting.py:179: RuntimeWarning: overflow encountered in exp
  data = [nlive, np.exp(logl), np.exp(logwt), np.exp(logz)]
/home/hemantakumar.phurailatpam/anaconda3/envs/lal2/lib/python3.7/site-packages/dynesty/plotting.py:203: RuntimeWarning: overflow encountered in exp
  zspan = (0., 1.05 * np.exp(logz[-1] + 3. * logzerr[-1]))
06:37 bilby WARNING : Axis limits cannot be NaN or Inf
06:37 bilby WARNING : Failed to create dynesty run plot at checkpoint
06:47 bilby INFO    : Written checkpoint file outdir_GW170817TaylorF2Ecc/result/GW170817TaylorF2Ecc_data0_1187008882-4_analysis_H1L1V1_dynesty_resume.pickle
/home/hemantakumar.phurailatpam/anaconda3/envs/lal2/lib/python3.7/site-packages/dynesty/plotting.py:179: RuntimeWarning: overflow encountered in exp
  data = [nlive, np.exp(logl), np.exp(logwt), np.exp(logz)]
/home/hemantakumar.phurailatpam/anaconda3/envs/lal2/lib/python3.7/site-packages/dynesty/plotting.py:203: RuntimeWarning: overflow encountered in exp
  zspan = (0., 1.05 * np.exp(logz[-1] + 3. * logzerr[-1]))
06:47 bilby WARNING : Axis limits cannot be NaN or Inf
06:47 bilby WARNING : Failed to create dynesty run plot at checkpoint
06:57 bilby INFO    : Written checkpoint file outdir_GW170817TaylorF2Ecc/result/GW170817TaylorF2Ecc_data0_1187008882-4_analysis_H1L1V1_dynesty_resume.pickle
/home/hemantakumar.phurailatpam/anaconda3/envs/lal2/lib/python3.7/site-packages/dynesty/plotting.py:675: UserWarning: Attempting to set identical bottom == top == 0.0 results in singular transformations; automatically expanding.
  ax.set_ylim([0., max(y0) * 1.05])
/home/hemantakumar.phurailatpam/anaconda3/envs/lal2/lib/python3.7/site-packages/dynesty/plotting.py:675: UserWarning: Attempting to set identical bottom == top == 0.0 results in singular transformations; automatically expanding.
  ax.set_ylim([0., max(y0) * 1.05])
/home/hemantakumar.phurailatpam/anaconda3/envs/lal2/lib/python3.7/site-packages/dynesty/plotting.py:179: RuntimeWarning: overflow encountered in exp
  data = [nlive, np.exp(logl), np.exp(logwt), np.exp(logz)]
/home/hemantakumar.phurailatpam/anaconda3/envs/lal2/lib/python3.7/site-packages/dynesty/plotting.py:203: RuntimeWarning: overflow encountered in exp
  zspan = (0., 1.05 * np.exp(logz[-1] + 3. * logzerr[-1]))
06:57 bilby WARNING : Axis limits cannot be NaN or Inf
06:57 bilby WARNING : Failed to create dynesty run plot at checkpoint
07:07 bilby INFO    : Written checkpoint file outdir_GW170817TaylorF2Ecc/result/GW170817TaylorF2Ecc_data0_1187008882-4_analysis_H1L1V1_dynesty_resume.pickle
/home/hemantakumar.phurailatpam/anaconda3/envs/lal2/lib/python3.7/site-packages/dynesty/plotting.py:179: RuntimeWarning: overflow encountered in exp
  data = [nlive, np.exp(logl), np.exp(logwt), np.exp(logz)]
/home/hemantakumar.phurailatpam/anaconda3/envs/lal2/lib/python3.7/site-packages/dynesty/plotting.py:203: RuntimeWarning: overflow encountered in exp
  zspan = (0., 1.05 * np.exp(logz[-1] + 3. * logzerr[-1]))
07:08 bilby WARNING : Axis limits cannot be NaN or Inf
07:08 bilby WARNING : Failed to create dynesty run plot at checkpoint
07:18 bilby INFO    : Written checkpoint file outdir_GW170817TaylorF2Ecc/result/GW170817TaylorF2Ecc_data0_1187008882-4_analysis_H1L1V1_dynesty_resume.pickle
/home/hemantakumar.phurailatpam/anaconda3/envs/lal2/lib/python3.7/site-packages/dynesty/plotting.py:179: RuntimeWarning: overflow encountered in exp
  data = [nlive, np.exp(logl), np.exp(logwt), np.exp(logz)]
/home/hemantakumar.phurailatpam/anaconda3/envs/lal2/lib/python3.7/site-packages/dynesty/plotting.py:203: RuntimeWarning: overflow encountered in exp
  zspan = (0., 1.05 * np.exp(logz[-1] + 3. * logzerr[-1]))
07:18 bilby WARNING : Axis limits cannot be NaN or Inf
07:18 bilby WARNING : Failed to create dynesty run plot at checkpoint
07:28 bilby INFO    : Written checkpoint file outdir_GW170817TaylorF2Ecc/result/GW170817TaylorF2Ecc_data0_1187008882-4_analysis_H1L1V1_dynesty_resume.pickle
/home/hemantakumar.phurailatpam/anaconda3/envs/lal2/lib/python3.7/site-packages/dynesty/plotting.py:179: RuntimeWarning: overflow encountered in exp
  data = [nlive, np.exp(logl), np.exp(logwt), np.exp(logz)]
/home/hemantakumar.phurailatpam/anaconda3/envs/lal2/lib/python3.7/site-packages/dynesty/plotting.py:203: RuntimeWarning: overflow encountered in exp
  zspan = (0., 1.05 * np.exp(logz[-1] + 3. * logzerr[-1]))
07:28 bilby WARNING : Axis limits cannot be NaN or Inf
07:28 bilby WARNING : Failed to create dynesty run plot at checkpoint
07:38 bilby INFO    : Written checkpoint file outdir_GW170817TaylorF2Ecc/result/GW170817TaylorF2Ecc_data0_1187008882-4_analysis_H1L1V1_dynesty_resume.pickle
/home/hemantakumar.phurailatpam/anaconda3/envs/lal2/lib/python3.7/site-packages/dynesty/plotting.py:179: RuntimeWarning: overflow encountered in exp
  data = [nlive, np.exp(logl), np.exp(logwt), np.exp(logz)]
/home/hemantakumar.phurailatpam/anaconda3/envs/lal2/lib/python3.7/site-packages/dynesty/plotting.py:203: RuntimeWarning: overflow encountered in exp
  zspan = (0., 1.05 * np.exp(logz[-1] + 3. * logzerr[-1]))
07:38 bilby WARNING : Axis limits cannot be NaN or Inf
07:38 bilby WARNING : Failed to create dynesty run plot at checkpoint
07:48 bilby INFO    : Written checkpoint file outdir_GW170817TaylorF2Ecc/result/GW170817TaylorF2Ecc_data0_1187008882-4_analysis_H1L1V1_dynesty_resume.pickle
/home/hemantakumar.phurailatpam/anaconda3/envs/lal2/lib/python3.7/site-packages/dynesty/plotting.py:179: RuntimeWarning: overflow encountered in exp
  data = [nlive, np.exp(logl), np.exp(logwt), np.exp(logz)]
/home/hemantakumar.phurailatpam/anaconda3/envs/lal2/lib/python3.7/site-packages/dynesty/plotting.py:203: RuntimeWarning: overflow encountered in exp
  zspan = (0., 1.05 * np.exp(logz[-1] + 3. * logzerr[-1]))
07:48 bilby WARNING : Axis limits cannot be NaN or Inf
07:48 bilby WARNING : Failed to create dynesty run plot at checkpoint
07:58 bilby INFO    : Written checkpoint file outdir_GW170817TaylorF2Ecc/result/GW170817TaylorF2Ecc_data0_1187008882-4_analysis_H1L1V1_dynesty_resume.pickle
/home/hemantakumar.phurailatpam/anaconda3/envs/lal2/lib/python3.7/site-packages/dynesty/plotting.py:179: RuntimeWarning: overflow encountered in exp
  data = [nlive, np.exp(logl), np.exp(logwt), np.exp(logz)]
/home/hemantakumar.phurailatpam/anaconda3/envs/lal2/lib/python3.7/site-packages/dynesty/plotting.py:203: RuntimeWarning: overflow encountered in exp
  zspan = (0., 1.05 * np.exp(logz[-1] + 3. * logzerr[-1]))
07:58 bilby WARNING : Axis limits cannot be NaN or Inf
07:58 bilby WARNING : Failed to create dynesty run plot at checkpoint
08:08 bilby INFO    : Written checkpoint file outdir_GW170817TaylorF2Ecc/result/GW170817TaylorF2Ecc_data0_1187008882-4_analysis_H1L1V1_dynesty_resume.pickle
/home/hemantakumar.phurailatpam/anaconda3/envs/lal2/lib/python3.7/site-packages/dynesty/plotting.py:179: RuntimeWarning: overflow encountered in exp
  data = [nlive, np.exp(logl), np.exp(logwt), np.exp(logz)]
/home/hemantakumar.phurailatpam/anaconda3/envs/lal2/lib/python3.7/site-packages/dynesty/plotting.py:203: RuntimeWarning: overflow encountered in exp
  zspan = (0., 1.05 * np.exp(logz[-1] + 3. * logzerr[-1]))
08:08 bilby WARNING : Axis limits cannot be NaN or Inf
08:08 bilby WARNING : Failed to create dynesty run plot at checkpoint
08:18 bilby INFO    : Written checkpoint file outdir_GW170817TaylorF2Ecc/result/GW170817TaylorF2Ecc_data0_1187008882-4_analysis_H1L1V1_dynesty_resume.pickle
/home/hemantakumar.phurailatpam/anaconda3/envs/lal2/lib/python3.7/site-packages/dynesty/plotting.py:179: RuntimeWarning: overflow encountered in exp
  data = [nlive, np.exp(logl), np.exp(logwt), np.exp(logz)]
/home/hemantakumar.phurailatpam/anaconda3/envs/lal2/lib/python3.7/site-packages/dynesty/plotting.py:203: RuntimeWarning: overflow encountered in exp
  zspan = (0., 1.05 * np.exp(logz[-1] + 3. * logzerr[-1]))
08:18 bilby WARNING : Axis limits cannot be NaN or Inf
08:18 bilby WARNING : Failed to create dynesty run plot at checkpoint
08:29 bilby INFO    : Written checkpoint file outdir_GW170817TaylorF2Ecc/result/GW170817TaylorF2Ecc_data0_1187008882-4_analysis_H1L1V1_dynesty_resume.pickle
/home/hemantakumar.phurailatpam/anaconda3/envs/lal2/lib/python3.7/site-packages/dynesty/plotting.py:179: RuntimeWarning: overflow encountered in exp
  data = [nlive, np.exp(logl), np.exp(logwt), np.exp(logz)]
/home/hemantakumar.phurailatpam/anaconda3/envs/lal2/lib/python3.7/site-packages/dynesty/plotting.py:203: RuntimeWarning: overflow encountered in exp
  zspan = (0., 1.05 * np.exp(logz[-1] + 3. * logzerr[-1]))
08:29 bilby WARNING : Axis limits cannot be NaN or Inf
08:29 bilby WARNING : Failed to create dynesty run plot at checkpoint
08:39 bilby INFO    : Written checkpoint file outdir_GW170817TaylorF2Ecc/result/GW170817TaylorF2Ecc_data0_1187008882-4_analysis_H1L1V1_dynesty_resume.pickle
/home/hemantakumar.phurailatpam/anaconda3/envs/lal2/lib/python3.7/site-packages/dynesty/plotting.py:179: RuntimeWarning: overflow encountered in exp
  data = [nlive, np.exp(logl), np.exp(logwt), np.exp(logz)]
/home/hemantakumar.phurailatpam/anaconda3/envs/lal2/lib/python3.7/site-packages/dynesty/plotting.py:203: RuntimeWarning: overflow encountered in exp
  zspan = (0., 1.05 * np.exp(logz[-1] + 3. * logzerr[-1]))
08:39 bilby WARNING : Axis limits cannot be NaN or Inf
08:39 bilby WARNING : Failed to create dynesty run plot at checkpoint
08:41 bilby INFO    : Written checkpoint file outdir_GW170817TaylorF2Ecc/result/GW170817TaylorF2Ecc_data0_1187008882-4_analysis_H1L1V1_dynesty_resume.pickle
/home/hemantakumar.phurailatpam/anaconda3/envs/lal2/lib/python3.7/site-packages/dynesty/plotting.py:179: RuntimeWarning: overflow encountered in exp
  data = [nlive, np.exp(logl), np.exp(logwt), np.exp(logz)]
/home/hemantakumar.phurailatpam/anaconda3/envs/lal2/lib/python3.7/site-packages/dynesty/plotting.py:203: RuntimeWarning: overflow encountered in exp
  zspan = (0., 1.05 * np.exp(logz[-1] + 3. * logzerr[-1]))
08:41 bilby WARNING : Axis limits cannot be NaN or Inf
08:41 bilby WARNING : Failed to create dynesty run plot at checkpoint
08:41 bilby INFO    : Starting to close worker pool.
08:41 bilby INFO    : Finished closing worker pool.
08:41 bilby INFO    : Sampling time: 2:53:47.072385
08:41 bilby INFO    : Generating sky frame parameters.
08:41 bilby INFO    : Computing SNRs for every sample.
08:41 bilby INFO    : Using a pool with size 8 for nsamples=15992
08:41 bilby INFO    : Generation of spin parameters failed with message 'spin_1z'
08:42 bilby INFO    : Summary of results:
nsamples: 15992
ln_noise_evidence: -361149.887
ln_evidence: -360319.744 +/-  0.323
ln_bayes_factor: 830.143 +/-  0.323

