000 (94461185.000.000) 2022-04-28 11:39:09 Job submitted from host: <10.14.0.51:9618?addrs=10.14.0.51-9618&alias=ldas-pcdev5.ligo.caltech.edu&noUDP&sock=schedd_3504500_162f>
    DAG Node: PeriastronEccFD15Hz_e0logprior2_data0_1187008882-4_analysis_H1L1V1_dynesty_arg_0
    WARNING: Committed job submission into the queue with the following warning(s): QMGMT:0:Please specify the amount of disk needed using "request_disk" (https://htcondor.readthedocs.io/en/v9_0/man-pages/condor_submit.html?highlight=request_disk).  This will soon be required and jobs such as this will be rejected.
...
040 (94461185.000.000) 2022-04-28 11:41:27 Started transferring input files
	Transferring to host: <10.14.9.159:9618?addrs=10.14.9.159-9618&alias=node2159.cluster.ldas.cit&noUDP&sock=slot1_4_3617748_7e24_2975>
...
040 (94461185.000.000) 2022-04-28 11:41:27 Finished transferring input files
...
001 (94461185.000.000) 2022-04-28 11:41:27 Job executing on host: <10.14.9.159:9618?addrs=10.14.9.159-9618&alias=node2159.cluster.ldas.cit&noUDP&sock=startd_4005_ace4>
...
006 (94461185.000.000) 2022-04-28 11:41:36 Image size of job updated: 613392
	102  -  MemoryUsage of job (MB)
	103704  -  ResidentSetSize of job (KB)
...
006 (94461185.000.000) 2022-04-28 11:46:37 Image size of job updated: 11824336
	203  -  MemoryUsage of job (MB)
	207356  -  ResidentSetSize of job (KB)
...
006 (94461185.000.000) 2022-04-28 11:51:37 Image size of job updated: 11824592
	203  -  MemoryUsage of job (MB)
	207836  -  ResidentSetSize of job (KB)
...
006 (94461185.000.000) 2022-04-28 11:56:37 Image size of job updated: 11908832
	319  -  MemoryUsage of job (MB)
	326320  -  ResidentSetSize of job (KB)
...
006 (94461185.000.000) 2022-04-28 12:01:37 Image size of job updated: 11917948
	320  -  MemoryUsage of job (MB)
	326692  -  ResidentSetSize of job (KB)
...
006 (94461185.000.000) 2022-04-28 12:06:37 Image size of job updated: 11928992
	331  -  MemoryUsage of job (MB)
	338080  -  ResidentSetSize of job (KB)
...
006 (94461185.000.000) 2022-04-28 12:11:37 Image size of job updated: 11928992
	331  -  MemoryUsage of job (MB)
	338304  -  ResidentSetSize of job (KB)
...
006 (94461185.000.000) 2022-04-28 12:16:37 Image size of job updated: 11928992
	331  -  MemoryUsage of job (MB)
	338312  -  ResidentSetSize of job (KB)
...
006 (94461185.000.000) 2022-04-28 12:21:37 Image size of job updated: 11929504
	331  -  MemoryUsage of job (MB)
	338668  -  ResidentSetSize of job (KB)
...
006 (94461185.000.000) 2022-04-28 12:26:37 Image size of job updated: 11929504
	331  -  MemoryUsage of job (MB)
	338672  -  ResidentSetSize of job (KB)
...
006 (94461185.000.000) 2022-04-28 12:31:37 Image size of job updated: 11933804
	336  -  MemoryUsage of job (MB)
	343228  -  ResidentSetSize of job (KB)
...
006 (94461185.000.000) 2022-04-28 12:36:38 Image size of job updated: 11933804
	336  -  MemoryUsage of job (MB)
	343236  -  ResidentSetSize of job (KB)
...
006 (94461185.000.000) 2022-04-28 12:41:39 Image size of job updated: 11933804
	336  -  MemoryUsage of job (MB)
	343244  -  ResidentSetSize of job (KB)
...
006 (94461185.000.000) 2022-04-28 12:46:40 Image size of job updated: 11934316
	336  -  MemoryUsage of job (MB)
	343764  -  ResidentSetSize of job (KB)
...
006 (94461185.000.000) 2022-04-28 12:51:41 Image size of job updated: 11934316
	336  -  MemoryUsage of job (MB)
	343768  -  ResidentSetSize of job (KB)
...
006 (94461185.000.000) 2022-04-28 13:06:44 Image size of job updated: 11941200
	343  -  MemoryUsage of job (MB)
	350748  -  ResidentSetSize of job (KB)
...
006 (94461185.000.000) 2022-04-28 13:11:45 Image size of job updated: 11941200
	343  -  MemoryUsage of job (MB)
	350752  -  ResidentSetSize of job (KB)
...
006 (94461185.000.000) 2022-04-28 13:16:46 Image size of job updated: 11945040
	347  -  MemoryUsage of job (MB)
	354556  -  ResidentSetSize of job (KB)
...
006 (94461185.000.000) 2022-04-28 13:41:49 Image size of job updated: 11946056
	349  -  MemoryUsage of job (MB)
	356956  -  ResidentSetSize of job (KB)
...
006 (94461185.000.000) 2022-04-28 13:46:49 Image size of job updated: 11946056
	349  -  MemoryUsage of job (MB)
	356968  -  ResidentSetSize of job (KB)
...
006 (94461185.000.000) 2022-04-28 13:51:49 Image size of job updated: 11948616
	352  -  MemoryUsage of job (MB)
	359736  -  ResidentSetSize of job (KB)
...
006 (94461185.000.000) 2022-04-28 14:06:49 Image size of job updated: 11948872
	352  -  MemoryUsage of job (MB)
	360004  -  ResidentSetSize of job (KB)
...
006 (94461185.000.000) 2022-04-28 14:26:49 Image size of job updated: 11948872
	352  -  MemoryUsage of job (MB)
	360204  -  ResidentSetSize of job (KB)
...
006 (94461185.000.000) 2022-04-28 14:31:49 Image size of job updated: 11949128
	352  -  MemoryUsage of job (MB)
	360204  -  ResidentSetSize of job (KB)
...
006 (94461185.000.000) 2022-04-28 18:52:14 Image size of job updated: 11954760
	358  -  MemoryUsage of job (MB)
	366120  -  ResidentSetSize of job (KB)
...
006 (94461185.000.000) 2022-04-28 18:57:15 Image size of job updated: 11954760
	358  -  MemoryUsage of job (MB)
	366124  -  ResidentSetSize of job (KB)
...
006 (94461185.000.000) 2022-04-28 19:22:20 Image size of job updated: 12216408
	358  -  MemoryUsage of job (MB)
	366124  -  ResidentSetSize of job (KB)
...
006 (94461185.000.000) 2022-04-28 19:37:23 Image size of job updated: 12221008
	362  -  MemoryUsage of job (MB)
	370444  -  ResidentSetSize of job (KB)
...
040 (94461185.000.000) 2022-04-28 19:41:36 Started transferring output files
...
040 (94461185.000.000) 2022-04-28 19:41:36 Finished transferring output files
...
006 (94461185.000.000) 2022-04-28 22:22:36 Image size of job updated: 12221008
	369  -  MemoryUsage of job (MB)
	377144  -  ResidentSetSize of job (KB)
...
006 (94461185.000.000) 2022-04-28 22:27:36 Image size of job updated: 12221008
	369  -  MemoryUsage of job (MB)
	377656  -  ResidentSetSize of job (KB)
...
006 (94461185.000.000) 2022-04-28 23:47:44 Image size of job updated: 12221008
	371  -  MemoryUsage of job (MB)
	379704  -  ResidentSetSize of job (KB)
...
006 (94461185.000.000) 2022-04-28 23:52:45 Image size of job updated: 12221136
	371  -  MemoryUsage of job (MB)
	379872  -  ResidentSetSize of job (KB)
...
006 (94461185.000.000) 2022-04-28 23:57:46 Image size of job updated: 12221392
	371  -  MemoryUsage of job (MB)
	379872  -  ResidentSetSize of job (KB)
...
006 (94461185.000.000) 2022-04-29 00:27:52 Image size of job updated: 12223696
	371  -  MemoryUsage of job (MB)
	379872  -  ResidentSetSize of job (KB)
...
006 (94461185.000.000) 2022-04-29 02:13:04 Image size of job updated: 12223696
	372  -  MemoryUsage of job (MB)
	380156  -  ResidentSetSize of job (KB)
...
006 (94461185.000.000) 2022-04-29 02:18:04 Image size of job updated: 12223696
	372  -  MemoryUsage of job (MB)
	380160  -  ResidentSetSize of job (KB)
...
006 (94461185.000.000) 2022-04-29 02:48:04 Image size of job updated: 12225404
	373  -  MemoryUsage of job (MB)
	381396  -  ResidentSetSize of job (KB)
...
006 (94461185.000.000) 2022-04-29 02:53:04 Image size of job updated: 12225404
	373  -  MemoryUsage of job (MB)
	381400  -  ResidentSetSize of job (KB)
...
006 (94461185.000.000) 2022-04-29 02:58:04 Image size of job updated: 12235376
	385  -  MemoryUsage of job (MB)
	393304  -  ResidentSetSize of job (KB)
...
040 (94461185.000.000) 2022-04-29 03:42:08 Started transferring output files
...
040 (94461185.000.000) 2022-04-29 03:42:08 Finished transferring output files
...
006 (94461185.000.000) 2022-04-29 03:58:08 Image size of job updated: 12304348
	385  -  MemoryUsage of job (MB)
	393304  -  ResidentSetSize of job (KB)
...
006 (94461185.000.000) 2022-04-29 04:08:09 Image size of job updated: 12356932
	385  -  MemoryUsage of job (MB)
	393304  -  ResidentSetSize of job (KB)
...
006 (94461185.000.000) 2022-04-29 05:23:22 Image size of job updated: 12358720
	385  -  MemoryUsage of job (MB)
	393828  -  ResidentSetSize of job (KB)
...
006 (94461185.000.000) 2022-04-29 05:48:27 Image size of job updated: 12360000
	386  -  MemoryUsage of job (MB)
	394548  -  ResidentSetSize of job (KB)
...
006 (94461185.000.000) 2022-04-29 05:53:27 Image size of job updated: 12360000
	386  -  MemoryUsage of job (MB)
	394576  -  ResidentSetSize of job (KB)
...
006 (94461185.000.000) 2022-04-29 05:58:27 Image size of job updated: 12361024
	387  -  MemoryUsage of job (MB)
	395488  -  ResidentSetSize of job (KB)
...
006 (94461185.000.000) 2022-04-29 06:08:29 Image size of job updated: 12386624
	387  -  MemoryUsage of job (MB)
	395548  -  ResidentSetSize of job (KB)
...
006 (94461185.000.000) 2022-04-29 06:18:31 Image size of job updated: 12386624
	387  -  MemoryUsage of job (MB)
	395812  -  ResidentSetSize of job (KB)
...
006 (94461185.000.000) 2022-04-29 06:28:33 Image size of job updated: 12386624
	387  -  MemoryUsage of job (MB)
	395840  -  ResidentSetSize of job (KB)
...
006 (94461185.000.000) 2022-04-29 07:13:42 Image size of job updated: 12391232
	387  -  MemoryUsage of job (MB)
	395840  -  ResidentSetSize of job (KB)
...
006 (94461185.000.000) 2022-04-29 07:48:47 Image size of job updated: 12391232
	388  -  MemoryUsage of job (MB)
	396680  -  ResidentSetSize of job (KB)
...
006 (94461185.000.000) 2022-04-29 07:58:47 Image size of job updated: 12391232
	388  -  MemoryUsage of job (MB)
	396752  -  ResidentSetSize of job (KB)
...
006 (94461185.000.000) 2022-04-29 08:43:51 Image size of job updated: 12391232
	388  -  MemoryUsage of job (MB)
	396944  -  ResidentSetSize of job (KB)
...
006 (94461185.000.000) 2022-04-29 09:18:53 Image size of job updated: 12391232
	388  -  MemoryUsage of job (MB)
	397156  -  ResidentSetSize of job (KB)
...
006 (94461185.000.000) 2022-04-29 09:28:53 Image size of job updated: 12391232
	389  -  MemoryUsage of job (MB)
	397744  -  ResidentSetSize of job (KB)
...
006 (94461185.000.000) 2022-04-29 09:38:53 Image size of job updated: 12391232
	389  -  MemoryUsage of job (MB)
	397868  -  ResidentSetSize of job (KB)
...
006 (94461185.000.000) 2022-04-29 09:48:55 Image size of job updated: 12491848
	390  -  MemoryUsage of job (MB)
	398468  -  ResidentSetSize of job (KB)
...
006 (94461185.000.000) 2022-04-29 09:58:57 Image size of job updated: 12492104
	390  -  MemoryUsage of job (MB)
	398468  -  ResidentSetSize of job (KB)
...
006 (94461185.000.000) 2022-04-29 10:08:59 Image size of job updated: 12492104
	390  -  MemoryUsage of job (MB)
	398792  -  ResidentSetSize of job (KB)
...
006 (94461185.000.000) 2022-04-29 10:19:01 Image size of job updated: 12493128
	390  -  MemoryUsage of job (MB)
	398960  -  ResidentSetSize of job (KB)
...
006 (94461185.000.000) 2022-04-29 11:19:12 Image size of job updated: 12494676
	391  -  MemoryUsage of job (MB)
	400160  -  ResidentSetSize of job (KB)
...
006 (94461185.000.000) 2022-04-29 11:29:13 Image size of job updated: 12494676
	391  -  MemoryUsage of job (MB)
	400252  -  ResidentSetSize of job (KB)
...
006 (94461185.000.000) 2022-04-29 11:39:14 Image size of job updated: 12494676
	392  -  MemoryUsage of job (MB)
	400784  -  ResidentSetSize of job (KB)
...
004 (94461185.000.000) 2022-04-29 11:41:36 Job was evicted.
	(0) CPU times
		Usr 10 19:16:22, Sys 0 00:04:37  -  Run Remote Usage
		Usr 0 00:00:00, Sys 0 00:00:00  -  Run Local Usage
	9483527  -  Run Bytes Sent By Job
	1983913  -  Run Bytes Received By Job
	Partitionable Resources :    Usage  Request Allocated 
	   Cpus                 :    15.86       16        16 
	   Disk (KB)            :  8807     1000000   1124934 
	   GPUs                 :                           0 
	   Memory (MB)          :   392        4096      4096 
...
040 (94461185.000.000) 2022-04-29 11:44:38 Started transferring input files
	Transferring to host: <10.14.9.133:9618?addrs=10.14.9.133-9618&alias=node2133.cluster.ldas.cit&noUDP&sock=slot1_5_83223_e1d1_3109>
...
040 (94461185.000.000) 2022-04-29 11:44:39 Finished transferring input files
...
001 (94461185.000.000) 2022-04-29 11:44:39 Job executing on host: <10.14.9.133:9618?addrs=10.14.9.133-9618&alias=node2133.cluster.ldas.cit&noUDP&sock=startd_4669_1fc6>
...
006 (94461185.000.000) 2022-04-29 19:40:36 Image size of job updated: 12537520
	416  -  MemoryUsage of job (MB)
	425000  -  ResidentSetSize of job (KB)
...
040 (94461185.000.000) 2022-04-29 19:44:55 Started transferring output files
...
040 (94461185.000.000) 2022-04-29 19:44:55 Finished transferring output files
...
006 (94461185.000.000) 2022-04-29 23:41:03 Image size of job updated: 12648948
	416  -  MemoryUsage of job (MB)
	425000  -  ResidentSetSize of job (KB)
...
006 (94461185.000.000) 2022-04-29 23:51:03 Image size of job updated: 12652008
	416  -  MemoryUsage of job (MB)
	425000  -  ResidentSetSize of job (KB)
...
006 (94461185.000.000) 2022-04-30 00:01:03 Image size of job updated: 12652264
	416  -  MemoryUsage of job (MB)
	425000  -  ResidentSetSize of job (KB)
...
006 (94461185.000.000) 2022-04-30 00:16:03 Image size of job updated: 12666600
	416  -  MemoryUsage of job (MB)
	425000  -  ResidentSetSize of job (KB)
...
006 (94461185.000.000) 2022-04-30 01:11:06 Image size of job updated: 12685776
	416  -  MemoryUsage of job (MB)
	425000  -  ResidentSetSize of job (KB)
...
006 (94461185.000.000) 2022-04-30 03:26:25 Image size of job updated: 12705000
	429  -  MemoryUsage of job (MB)
	438456  -  ResidentSetSize of job (KB)
...
006 (94461185.000.000) 2022-04-30 03:31:26 Image size of job updated: 12719336
	429  -  MemoryUsage of job (MB)
	438560  -  ResidentSetSize of job (KB)
...
040 (94461185.000.000) 2022-04-30 03:45:46 Started transferring output files
...
040 (94461185.000.000) 2022-04-30 03:45:46 Finished transferring output files
...
006 (94461185.000.000) 2022-04-30 04:31:26 Image size of job updated: 12777348
	429  -  MemoryUsage of job (MB)
	438560  -  ResidentSetSize of job (KB)
...
006 (94461185.000.000) 2022-04-30 04:41:26 Image size of job updated: 12785540
	429  -  MemoryUsage of job (MB)
	438560  -  ResidentSetSize of job (KB)
...
006 (94461185.000.000) 2022-04-30 04:51:26 Image size of job updated: 12786564
	429  -  MemoryUsage of job (MB)
	438560  -  ResidentSetSize of job (KB)
...
006 (94461185.000.000) 2022-04-30 05:01:26 Image size of job updated: 12823680
	429  -  MemoryUsage of job (MB)
	438560  -  ResidentSetSize of job (KB)
...
006 (94461185.000.000) 2022-04-30 08:11:47 Image size of job updated: 12844732
	429  -  MemoryUsage of job (MB)
	438560  -  ResidentSetSize of job (KB)
...
006 (94461185.000.000) 2022-04-30 08:31:50 Image size of job updated: 12922556
	429  -  MemoryUsage of job (MB)
	438560  -  ResidentSetSize of job (KB)
...
006 (94461185.000.000) 2022-04-30 08:46:53 Image size of job updated: 12924124
	429  -  MemoryUsage of job (MB)
	438560  -  ResidentSetSize of job (KB)
...
006 (94461185.000.000) 2022-04-30 09:06:54 Image size of job updated: 12963292
	429  -  MemoryUsage of job (MB)
	438560  -  ResidentSetSize of job (KB)
...
006 (94461185.000.000) 2022-04-30 11:22:06 Image size of job updated: 12984652
	429  -  MemoryUsage of job (MB)
	438560  -  ResidentSetSize of job (KB)
...
006 (94461185.000.000) 2022-04-30 11:45:48 Image size of job updated: 13064276
	429  -  MemoryUsage of job (MB)
	438560  -  ResidentSetSize of job (KB)
...
040 (94461185.000.000) 2022-04-30 11:46:46 Entered queue to transfer output files
...
040 (94461185.000.000) 2022-04-30 12:11:08 Finished transferring output files
...
040 (94461185.000.000) 2022-04-30 12:15:37 Started transferring input files
	Transferring to host: <10.14.9.171:9618?addrs=10.14.9.171-9618&alias=node2171.cluster.ldas.cit&noUDP&sock=slot1_10_3217461_16ee_6777>
...
040 (94461185.000.000) 2022-04-30 12:15:37 Finished transferring input files
...
001 (94461185.000.000) 2022-04-30 12:15:37 Job executing on host: <10.14.9.171:9618?addrs=10.14.9.171-9618&alias=node2171.cluster.ldas.cit&noUDP&sock=startd_4478_1d2f>
...
007 (94461185.000.000) 2022-04-30 15:55:01 Shadow exception!
	Assertion ERROR on (result)
	0  -  Run Bytes Sent By Job
	10002281  -  Run Bytes Received By Job
...
040 (94461185.000.000) 2022-04-30 16:02:41 Started transferring input files
	Transferring to host: <10.14.4.46:9618?addrs=10.14.4.46-9618&alias=node796.cluster.ldas.cit&noUDP&sock=slot1_1_1891886_95be_1652>
...
040 (94461185.000.000) 2022-04-30 16:02:41 Finished transferring input files
...
001 (94461185.000.000) 2022-04-30 16:02:41 Job executing on host: <10.14.4.46:9618?addrs=10.14.4.46-9618&alias=node796.cluster.ldas.cit&noUDP&sock=startd_1860_623e>
...
007 (94461185.000.000) 2022-04-30 23:12:23 Shadow exception!
	Assertion ERROR on (result)
	0  -  Run Bytes Sent By Job
	10002281  -  Run Bytes Received By Job
...
040 (94461185.000.000) 2022-04-30 23:21:35 Started transferring input files
	Transferring to host: <10.14.9.137:9618?addrs=10.14.9.137-9618&alias=node2137.cluster.ldas.cit&noUDP&sock=slot1_15_3750495_c35a_4725>
...
040 (94461185.000.000) 2022-04-30 23:21:36 Finished transferring input files
...
001 (94461185.000.000) 2022-04-30 23:21:36 Job executing on host: <10.14.9.137:9618?addrs=10.14.9.137-9618&alias=node2137.cluster.ldas.cit&noUDP&sock=startd_4030_d2c2>
...
040 (94461185.000.000) 2022-05-01 07:22:14 Started transferring output files
...
040 (94461185.000.000) 2022-05-01 07:22:15 Finished transferring output files
...
040 (94461185.000.000) 2022-05-01 12:28:16 Started transferring output files
...
040 (94461185.000.000) 2022-05-01 12:28:16 Finished transferring output files
...
005 (94461185.000.000) 2022-05-01 12:28:16 Job terminated.
	(1) Normal termination (return value 0)
		Usr 7 16:17:09, Sys 0 00:06:31  -  Run Remote Usage
		Usr 0 00:00:00, Sys 0 00:00:00  -  Run Local Usage
		Usr 37 22:05:01, Sys 0 01:12:33  -  Total Remote Usage
		Usr 0 00:00:00, Sys 0 00:00:00  -  Total Local Usage
	39272048  -  Run Bytes Sent By Job
	10002281  -  Run Bytes Received By Job
	63384144  -  Total Bytes Sent By Job
	39292272  -  Total Bytes Received By Job
	Partitionable Resources :    Usage  Request Allocated 
	   Cpus                 :    15.95       16        16 
	   Disk (KB)            : 30709     1000000   1124953 
	   GPUs                 :                           0 
	   Memory (MB)          :   440        4096      4096 

	Job terminated of its own accord at 2022-05-01T19:28:16Z.
...
