22:42 bilby_pipe WARNING : You do not have nds2 (python-nds2-client) installed. You may  experience problems accessing interferometer data.
22:42 bilby_pipe WARNING : You do not have LDAStools.frameCPP (python-ldas-tools-framecpp) installed. You may experience problems accessing interferometer data.
22:42 bilby_pipe INFO    : Running bilby_pipe version: 1.0.4: (CLEAN) a0f8deb 2021-05-14 15:08:45 +0000
22:42 bilby_pipe INFO    : Running bilby: 1.1.4: release
22:42 bilby_pipe INFO    : Command line arguments: Namespace(accounting='ligo.dev.o3.cbc.pe.lalinference', allow_tape=True, analysis_executable=None, calibration_model=None, catch_waveform_errors=False, channel_dict='{H1:GWOSC, L1:GWOSC, V1:GWOSC}', coherence_test=False, condor_job_priority=0, conversion_function=None, convert_to_flat_in_component_mass=False, create_plots=False, create_summary=False, data_dict=None, data_dump_file=None, data_format=None, default_prior='BBHPriorDict', deltaT=0.2, detectors=['H1', 'L1', 'V1'], distance_marginalization=False, distance_marginalization_lookup_table=None, duration=16.0, email=None, existing_dir=None, extra_likelihood_kwargs=None, frequency_domain_source_model='lal_taylorF2Ecc_fd', gaussian_noise=False, generation_function=None, generation_seed=None, gps_file=None, gps_tuple=None, idx=0, ignore_gwpy_data_quality_check=True, ini='outdir_GW170817TaylorF2Ecc/GW170817TaylorF2Ecc_config_complete.ini', injection=False, injection_dict=None, injection_file=None, injection_numbers=['None'], injection_waveform_approximant=None, jitter_time=True, label='GW170817TaylorF2Ecc_data0_1187008882-4_generation', likelihood_type='GravitationalWaveTransient', local=False, local_generation=False, local_plot=False, log_directory=None, maximum_frequency=None, minimum_frequency='20', mode_array=[None], n_parallel=1, n_simulation=1, notification='Never', numerical_relativity_file=None, online_pe=False, osg=False, outdir='/home/hemantakumar.phurailatpam/eccn3pn/test/condor_GW170817/outdir_GW170817TaylorF2Ecc', overwrite_outdir=False, periodic_restart_time=28800, phase_marginalization=False, plot_calibration=False, plot_corner=False, plot_format='png', plot_marginal=False, plot_skymap=False, plot_waveform=False, pn_amplitude_order=0, pn_phase_order=-1, pn_spin_order=-1, pn_tidal_order=-1, post_trigger_duration=1.0, postprocessing_arguments=None, postprocessing_executable=None, prior_dict="{chirp-mass: Uniform(name='chirp_mass', minimum=0.8705505632961241,maximum=2.611651689888372), mass_ratio = Uniform(name='mass_ratio', minimum=0.3333333333333333, maximum=1), eccentricity = Uniform(name='e0', minimum=0.0, maximum=0.1), luminosity_distance = 40.7, a_1 = Uniform(name='a_1', minimum=-0.5, maximum=0.5), a_2 = Uniform(name='a_1', minimum=-0.5, maximum=0.5), theta_jn = Sine(name='theta_jn'), psi =  Uniform(name='psi', minimum=0, maximum=6.283185307179586), phase = Uniform(name='phase', minimum=0, maximum=6.283185307179586), geocent_time = Uniform(1187008882.33, 1187008882.53, name='geocent_time', unit='s'), ra = 3.44615914, dec =  -0.40808407, }", prior_file=None, psd_dict=None, psd_fractional_overlap=0.5, psd_length=32, psd_maximum_duration=1024, psd_method='median', psd_start_time=None, reference_frame='sky', reference_frequency=20.0, request_cpus=8, request_memory=4.0, request_memory_generation=None, resampling_method='lal', result_format='json', roq_folder=None, roq_scale_factor=1.0, roq_weights=None, sampler='dynesty', sampler_kwargs="{'nlive': 500, 'npool': 8}", sampling_frequency=1024.0, sampling_seed=None, scheduler='condor', scheduler_analysis_time='7-00:00:00', scheduler_args=None, scheduler_env=None, scheduler_module=[None], single_postprocessing_arguments=None, single_postprocessing_executable=None, singularity_image=None, spline_calibration_amplitude_uncertainty_dict=None, spline_calibration_envelope_dict=None, spline_calibration_nodes=5, spline_calibration_phase_uncertainty_dict=None, submit=False, summarypages_arguments=None, time_marginalization=False, time_reference='geocent', timeslide_dict=None, timeslide_file=None, transfer_files=True, trigger_time='1187008882.4', tukey_roll_off=0.4, verbose=False, waveform_approximant='TaylorF2Ecc', waveform_arguments_dict=None, waveform_generator='bilby.gw.waveform_generator.WaveformGenerator', webdir=None, zero_noise=False)
22:42 bilby_pipe INFO    : Unknown command line arguments: []
22:42 bilby_pipe INFO    : Generation seed set to 602303
22:42 bilby_pipe INFO    : Setting trigger time 1187008882.4
22:42 bilby_pipe INFO    : Setting prior-file to None
22:42 bilby_pipe INFO    : Setting segment duration 16.0s
22:42 bilby_pipe INFO    : No maximum frequency given. Setting to sampling frequency / 2 = 512.0
22:42 bilby_pipe INFO    : PSD duration set to 512.0s, 32x the duration 16.0s
22:42 bilby_pipe INFO    : No calibration_model model provided, calibration marginalization will not be used
22:42 bilby_pipe INFO    : Setting PSD for H1 from data
22:42 bilby_pipe INFO    : Using default PSD start time -512.0 relative to start time
22:42 bilby_pipe INFO    : Getting psd-segment data for H1
22:42 bilby_pipe INFO    : Attempting to download data from GWOSC
22:42 bilby_pipe INFO    : Calling TimeSeries.fetch_open_data('H1', start=1187008355.4, end=1187008867.4)
22:42 bilby_pipe INFO    : Resampling data to sampling_frequency 1024.0 using lal
22:42 bilby_pipe INFO    : PSD settings: window=Tukey, Tukey-alpha=0.05 roll-off=0.4, overlap=8.0, method=median
22:42 bilby_pipe INFO    : Getting analysis-segment data for H1
22:42 bilby_pipe INFO    : Attempting to download data from GWOSC
22:42 bilby_pipe INFO    : Calling TimeSeries.fetch_open_data('H1', start=1187008867.4, end=1187008883.4)
22:42 bilby_pipe INFO    : Resampling data to sampling_frequency 1024.0 using lal
22:42 bilby_pipe INFO    : Setting PSD for L1 from data
22:42 bilby_pipe INFO    : Using default PSD start time -512.0 relative to start time
22:42 bilby_pipe INFO    : Getting psd-segment data for L1
22:42 bilby_pipe INFO    : Attempting to download data from GWOSC
22:42 bilby_pipe INFO    : Calling TimeSeries.fetch_open_data('L1', start=1187008355.4, end=1187008867.4)
22:42 bilby_pipe INFO    : Resampling data to sampling_frequency 1024.0 using lal
22:42 bilby_pipe INFO    : PSD settings: window=Tukey, Tukey-alpha=0.05 roll-off=0.4, overlap=8.0, method=median
22:42 bilby_pipe INFO    : Getting analysis-segment data for L1
22:42 bilby_pipe INFO    : Attempting to download data from GWOSC
22:42 bilby_pipe INFO    : Calling TimeSeries.fetch_open_data('L1', start=1187008867.4, end=1187008883.4)
22:42 bilby_pipe INFO    : Resampling data to sampling_frequency 1024.0 using lal
22:42 bilby_pipe INFO    : Setting PSD for V1 from data
22:42 bilby_pipe INFO    : Using default PSD start time -512.0 relative to start time
22:42 bilby_pipe INFO    : Getting psd-segment data for V1
22:42 bilby_pipe INFO    : Attempting to download data from GWOSC
22:42 bilby_pipe INFO    : Calling TimeSeries.fetch_open_data('V1', start=1187008355.4, end=1187008867.4)
22:42 bilby_pipe INFO    : Resampling data to sampling_frequency 1024.0 using lal
22:42 bilby_pipe INFO    : PSD settings: window=Tukey, Tukey-alpha=0.05 roll-off=0.4, overlap=8.0, method=median
22:42 bilby_pipe INFO    : Getting analysis-segment data for V1
22:42 bilby_pipe INFO    : Attempting to download data from GWOSC
22:42 bilby_pipe INFO    : Calling TimeSeries.fetch_open_data('V1', start=1187008867.4, end=1187008883.4)
22:42 bilby_pipe INFO    : Resampling data to sampling_frequency 1024.0 using lal
22:42 bilby_pipe INFO    : Using the lal_taylorF2Ecc_fd source model
22:42 bilby INFO    : Waveform generator initiated with
  frequency_domain_source_model: bilby.gw.source.lal_taylorF2Ecc_fd
  time_domain_source_model: None
  parameter_conversion: bilby.gw.conversion.convert_to_lal_binary_black_hole_parameters
22:42 bilby_pipe INFO    : Completed data generation
