04:27 bilby_pipe INFO    : Running bilby_pipe version: 1.0.4: (CLEAN) a0f8deb 2021-05-14 15:08:45 +0000
04:27 bilby_pipe INFO    : Running bilby: 1.1.4: (UNCLEAN) 6cf9a859 2021-11-01 03:42:33 +0000
04:27 bilby_pipe INFO    : Command line arguments: Namespace(accounting='ligo.dev.o3.cbc.pe.lalinference', allow_tape=True, analysis_executable=None, calibration_model=None, catch_waveform_errors=False, channel_dict='{H1:GWOSC, L1:GWOSC, V1:GWOSC}', coherence_test=False, condor_job_priority=0, conversion_function=None, convert_to_flat_in_component_mass=False, create_plots=False, create_summary=False, data_dict=None, data_dump_file='outdir_taylorf2_lal_binary_black_hole/data/eccn_taylorf2_lal_binary_black_hole_data0_1187008882-4_generation_data_dump.pickle', data_format=None, default_prior='BBHPriorDict', deltaT=0.2, detectors=['H1', 'L1', 'V1'], distance_marginalization=False, distance_marginalization_lookup_table=None, duration=8.0, email=None, existing_dir=None, extra_likelihood_kwargs=None, frequency_domain_source_model='lal_binary_black_hole', gaussian_noise=False, generation_function=None, generation_seed=None, gps_file=None, gps_tuple=None, idx=0, ignore_gwpy_data_quality_check=True, ini='eccn_taylorf2_lal_binary_black_hole_config_complete.ini', injection=False, injection_dict=None, injection_file=None, injection_numbers=['None'], injection_waveform_approximant=None, jitter_time=True, label='eccn_taylorf2_lal_binary_black_hole_data0_1187008882-4_analysis_H1L1V1_dynesty', likelihood_type='GravitationalWaveTransient', local=False, local_generation=False, local_plot=False, log_directory=None, maximum_frequency=None, minimum_frequency='20', mode_array=[None], n_parallel=1, n_simulation=1, notification='Never', numerical_relativity_file=None, online_pe=False, osg=False, outdir='outdir_taylorf2_lal_binary_black_hole', overwrite_outdir=False, periodic_restart_time=28800, phase_marginalization=False, plot_calibration=False, plot_corner=False, plot_format='png', plot_marginal=False, plot_skymap=False, plot_waveform=False, pn_amplitude_order=0, pn_phase_order=-1, pn_spin_order=-1, pn_tidal_order=-1, post_trigger_duration=1.0, postprocessing_arguments=None, postprocessing_executable=None, prior_dict="{mass-1: Constraint(name='mass_1', minimum=1.0, maximum=3.0), mass_2 = Constraint(name='mass_2', minimum=1.0, maximum=3.0), chirp_mass = Uniform(name='chirp_mass', minimum=0.8705505632961241,maximum=2.611651689888372), mass_ratio = Uniform(name='mass_ratio', minimum=0.3333333333333333, maximum=1), a_1 = 0., a_2 = 0., tilt_1 = 0., tilt_2 = 0., phi_12 = 0., phi_jl = 0., luminosity_distance = 40.7, theta_jn = Sine(name='theta_jn'), psi =  Uniform(name='psi', minimum=0, maximum=6.283185307179586), phase = Uniform(name='phase', minimum=0, maximum=6.283185307179586), geocent_time = Uniform(1187008882.33, 1187008882.53, name='geocent_time', unit='s'), ra = 3.44615914, dec =  -0.40808407, }", prior_file=None, psd_dict=None, psd_fractional_overlap=0.5, psd_length=32, psd_maximum_duration=1024, psd_method='median', psd_start_time=None, reference_frame='sky', reference_frequency=20.0, request_cpus=8, request_memory=4.0, request_memory_generation=None, resampling_method='lal', result_format='json', roq_folder=None, roq_scale_factor=1.0, roq_weights=None, sampler='dynesty', sampler_kwargs="{'nlive': 500, 'npool': 8}", sampling_frequency=1024.0, sampling_seed=None, scheduler='condor', scheduler_analysis_time='7-00:00:00', scheduler_args=None, scheduler_env=None, scheduler_module=[None], single_postprocessing_arguments=None, single_postprocessing_executable=None, singularity_image=None, spline_calibration_amplitude_uncertainty_dict=None, spline_calibration_envelope_dict=None, spline_calibration_nodes=5, spline_calibration_phase_uncertainty_dict=None, submit=False, summarypages_arguments=None, time_marginalization=False, time_reference='geocent', timeslide_dict=None, timeslide_file=None, transfer_files=True, trigger_time='1187008882.4', tukey_roll_off=0.4, verbose=False, waveform_approximant='TaylorF2', waveform_arguments_dict=None, waveform_generator='bilby.gw.waveform_generator.WaveformGenerator', webdir=None, zero_noise=False)
04:27 bilby_pipe INFO    : Sampling seed set to 652675
04:27 bilby_pipe INFO    : No maximum frequency given. Setting to sampling frequency / 2 = 512.0
04:27 bilby_pipe INFO    : No calibration_model model provided, calibration marginalization will not be used
04:27 bilby_pipe INFO    : Found data for detectors = ['H1', 'L1', 'V1']
04:27 bilby_pipe INFO    : Using data for detectors = ['H1', 'L1', 'V1']
04:27 bilby_pipe INFO    : H1: sampling-frequency=1024.0, segment-start-time=1187008875.3999023, duration=8.0
04:27 bilby_pipe INFO    : L1: sampling-frequency=1024.0, segment-start-time=1187008875.3999023, duration=8.0
04:27 bilby_pipe INFO    : V1: sampling-frequency=1024.0, segment-start-time=1187008875.3999023, duration=8.0
04:27 bilby_pipe INFO    : Using the lal_binary_black_hole source model
04:27 bilby_pipe INFO    : Using conversion_function convert_to_lal_binary_black_hole_parameters
04:27 bilby INFO    : Waveform generator initiated with
  frequency_domain_source_model: bilby.gw.source.lal_binary_black_hole
  time_domain_source_model: None
  parameter_conversion: bilby.gw.conversion.convert_to_lal_binary_black_hole_parameters
04:27 bilby_pipe INFO    : Using generation_function generate_all_bbh_parameters
04:27 bilby INFO    : Running for label 'eccn_taylorf2_lal_binary_black_hole_data0_1187008882-4_analysis_H1L1V1_dynesty', output will be saved to 'outdir_taylorf2_lal_binary_black_hole/result'
04:27 bilby INFO    : Using lal version 7.1.4.1
04:27 bilby INFO    : Using lal git version Branch: main;Tag: None;Id: dcd0a82f81f842e9ecfec960b579e67b70378bb9;;Builder: hemantakumar.phurailatpam <hemantaphurailatpam@gmail.com>;Repository status: UNCLEAN: Modified working tree
04:27 bilby INFO    : Using lalsimulation version 3.0.0.1
04:27 bilby INFO    : Using lalsimulation git version Branch: main;Tag: None;Id: dcd0a82f81f842e9ecfec960b579e67b70378bb9;;Builder: hemantakumar.phurailatpam <hemantaphurailatpam@gmail.com>;Repository status: UNCLEAN: Modified working tree
04:27 bilby INFO    : Search parameters:
04:27 bilby INFO    :   chirp_mass = Uniform(minimum=0.8705505632961241, maximum=2.611651689888372, name='chirp_mass', latex_label='$\\mathcal{M}$', unit=None, boundary=None)
04:27 bilby INFO    :   mass_ratio = Uniform(minimum=0.3333333333333333, maximum=1, name='mass_ratio', latex_label='$q$', unit=None, boundary=None)
04:27 bilby INFO    :   theta_jn = Sine(minimum=0, maximum=3.141592653589793, name='theta_jn', latex_label='$\\theta_{JN}$', unit=None, boundary=None)
04:27 bilby INFO    :   psi = Uniform(minimum=0, maximum=6.283185307179586, name='psi', latex_label='$\\psi$', unit=None, boundary=None)
04:27 bilby INFO    :   phase = Uniform(minimum=0, maximum=6.283185307179586, name='phase', latex_label='$\\phi$', unit=None, boundary=None)
04:27 bilby INFO    :   geocent_time = Uniform(minimum=1187008882.33, maximum=1187008882.53, name='geocent_time', latex_label='$t_c$', unit='s', boundary=None)
04:27 bilby INFO    :   mass_1 = Constraint(minimum=1.0, maximum=3.0, name='mass_1', latex_label='$m_1$', unit=None)
04:27 bilby INFO    :   mass_2 = Constraint(minimum=1.0, maximum=3.0, name='mass_2', latex_label='$m_2$', unit=None)
04:27 bilby INFO    :   a_1 = 0.0
04:27 bilby INFO    :   a_2 = 0.0
04:27 bilby INFO    :   tilt_1 = 0.0
04:27 bilby INFO    :   tilt_2 = 0.0
04:27 bilby INFO    :   phi_12 = 0.0
04:27 bilby INFO    :   phi_jl = 0.0
04:27 bilby INFO    :   luminosity_distance = 40.7
04:27 bilby INFO    :   ra = 3.44615914
04:27 bilby INFO    :   dec = -0.40808407
04:27 bilby INFO    : Generating frequency domain strain from given time domain strain.
04:27 bilby INFO    : Applying a tukey window with alpha=0.1, roll off=0.4
04:27 bilby INFO    : Generating frequency domain strain from given time domain strain.
04:27 bilby INFO    : Applying a tukey window with alpha=0.1, roll off=0.4
04:27 bilby INFO    : Generating frequency domain strain from given time domain strain.
04:27 bilby INFO    : Applying a tukey window with alpha=0.1, roll off=0.4
04:27 bilby INFO    : Single likelihood evaluation took 6.765e-03 s
04:27 bilby INFO    : Using sampler Dynesty with kwargs {'bound': 'multi', 'sample': 'rwalk', 'verbose': True, 'periodic': None, 'reflective': None, 'check_point_delta_t': 1800, 'nlive': 500, 'first_update': None, 'walks': 100, 'npdim': None, 'rstate': None, 'queue_size': 8, 'pool': None, 'use_pool': None, 'live_points': None, 'logl_args': None, 'logl_kwargs': None, 'ptform_args': None, 'ptform_kwargs': None, 'enlarge': 1.5, 'bootstrap': None, 'vol_dec': 0.5, 'vol_check': 8.0, 'facc': 0.2, 'slices': 5, 'update_interval': 300, 'print_func': <bound method Dynesty._print_func of <bilby.core.sampler.dynesty.Dynesty object at 0x2b957dda8990>>, 'dlogz': 0.1, 'maxiter': None, 'maxcall': None, 'logl_max': inf, 'add_live': True, 'print_progress': True, 'save_bounds': False, 'n_effective': None, 'maxmcmc': 5000, 'nact': 5, 'print_method': 'tqdm'}
04:27 bilby INFO    : Checkpoint every check_point_delta_t = 600s
04:27 bilby INFO    : Using dynesty version 1.0.1
04:27 bilby INFO    : Using the bilby-implemented rwalk sample method with ACT estimated walks
04:27 bilby INFO    : Setting up multiproccesing pool with 8 processes.
04:27 bilby INFO    : Resume file outdir_taylorf2_lal_binary_black_hole/result/eccn_taylorf2_lal_binary_black_hole_data0_1187008882-4_analysis_H1L1V1_dynesty_resume.pickle does not exist.
04:27 bilby INFO    : Generating initial points from the prior
04:37 bilby INFO    : Written checkpoint file outdir_taylorf2_lal_binary_black_hole/result/eccn_taylorf2_lal_binary_black_hole_data0_1187008882-4_analysis_H1L1V1_dynesty_resume.pickle
04:37 bilby WARNING : singular matrix
04:37 bilby WARNING : Failed to create dynesty state plot at checkpoint
04:37 bilby WARNING : singular matrix
04:37 bilby WARNING : Failed to create dynesty unit state plot at checkpoint
/home/hemantakumar.phurailatpam/anaconda3/envs/lal2/lib/python3.7/site-packages/dynesty/plotting.py:179: RuntimeWarning: overflow encountered in exp
  data = [nlive, np.exp(logl), np.exp(logwt), np.exp(logz)]
04:37 bilby WARNING : singular matrix
04:37 bilby WARNING : Failed to create dynesty run plot at checkpoint
04:47 bilby INFO    : Written checkpoint file outdir_taylorf2_lal_binary_black_hole/result/eccn_taylorf2_lal_binary_black_hole_data0_1187008882-4_analysis_H1L1V1_dynesty_resume.pickle
/home/hemantakumar.phurailatpam/anaconda3/envs/lal2/lib/python3.7/site-packages/dynesty/plotting.py:675: UserWarning: Attempting to set identical bottom == top == 0.0 results in singular transformations; automatically expanding.
  ax.set_ylim([0., max(y0) * 1.05])
/home/hemantakumar.phurailatpam/anaconda3/envs/lal2/lib/python3.7/site-packages/dynesty/plotting.py:675: UserWarning: Attempting to set identical bottom == top == 0.0 results in singular transformations; automatically expanding.
  ax.set_ylim([0., max(y0) * 1.05])
/home/hemantakumar.phurailatpam/anaconda3/envs/lal2/lib/python3.7/site-packages/dynesty/plotting.py:179: RuntimeWarning: overflow encountered in exp
  data = [nlive, np.exp(logl), np.exp(logwt), np.exp(logz)]
/home/hemantakumar.phurailatpam/anaconda3/envs/lal2/lib/python3.7/site-packages/dynesty/plotting.py:203: RuntimeWarning: overflow encountered in exp
  zspan = (0., 1.05 * np.exp(logz[-1] + 3. * logzerr[-1]))
04:47 bilby WARNING : Axis limits cannot be NaN or Inf
04:47 bilby WARNING : Failed to create dynesty run plot at checkpoint
04:57 bilby INFO    : Written checkpoint file outdir_taylorf2_lal_binary_black_hole/result/eccn_taylorf2_lal_binary_black_hole_data0_1187008882-4_analysis_H1L1V1_dynesty_resume.pickle
/home/hemantakumar.phurailatpam/anaconda3/envs/lal2/lib/python3.7/site-packages/dynesty/plotting.py:179: RuntimeWarning: overflow encountered in exp
  data = [nlive, np.exp(logl), np.exp(logwt), np.exp(logz)]
/home/hemantakumar.phurailatpam/anaconda3/envs/lal2/lib/python3.7/site-packages/dynesty/plotting.py:203: RuntimeWarning: overflow encountered in exp
  zspan = (0., 1.05 * np.exp(logz[-1] + 3. * logzerr[-1]))
04:57 bilby WARNING : Axis limits cannot be NaN or Inf
04:57 bilby WARNING : Failed to create dynesty run plot at checkpoint
05:07 bilby INFO    : Written checkpoint file outdir_taylorf2_lal_binary_black_hole/result/eccn_taylorf2_lal_binary_black_hole_data0_1187008882-4_analysis_H1L1V1_dynesty_resume.pickle
/home/hemantakumar.phurailatpam/anaconda3/envs/lal2/lib/python3.7/site-packages/dynesty/plotting.py:179: RuntimeWarning: overflow encountered in exp
  data = [nlive, np.exp(logl), np.exp(logwt), np.exp(logz)]
/home/hemantakumar.phurailatpam/anaconda3/envs/lal2/lib/python3.7/site-packages/dynesty/plotting.py:203: RuntimeWarning: overflow encountered in exp
  zspan = (0., 1.05 * np.exp(logz[-1] + 3. * logzerr[-1]))
05:07 bilby WARNING : Axis limits cannot be NaN or Inf
05:07 bilby WARNING : Failed to create dynesty run plot at checkpoint
05:17 bilby INFO    : Written checkpoint file outdir_taylorf2_lal_binary_black_hole/result/eccn_taylorf2_lal_binary_black_hole_data0_1187008882-4_analysis_H1L1V1_dynesty_resume.pickle
/home/hemantakumar.phurailatpam/anaconda3/envs/lal2/lib/python3.7/site-packages/dynesty/plotting.py:179: RuntimeWarning: overflow encountered in exp
  data = [nlive, np.exp(logl), np.exp(logwt), np.exp(logz)]
/home/hemantakumar.phurailatpam/anaconda3/envs/lal2/lib/python3.7/site-packages/dynesty/plotting.py:203: RuntimeWarning: overflow encountered in exp
  zspan = (0., 1.05 * np.exp(logz[-1] + 3. * logzerr[-1]))
05:18 bilby WARNING : Axis limits cannot be NaN or Inf
05:18 bilby WARNING : Failed to create dynesty run plot at checkpoint
05:28 bilby INFO    : Written checkpoint file outdir_taylorf2_lal_binary_black_hole/result/eccn_taylorf2_lal_binary_black_hole_data0_1187008882-4_analysis_H1L1V1_dynesty_resume.pickle
/home/hemantakumar.phurailatpam/anaconda3/envs/lal2/lib/python3.7/site-packages/dynesty/plotting.py:179: RuntimeWarning: overflow encountered in exp
  data = [nlive, np.exp(logl), np.exp(logwt), np.exp(logz)]
/home/hemantakumar.phurailatpam/anaconda3/envs/lal2/lib/python3.7/site-packages/dynesty/plotting.py:203: RuntimeWarning: overflow encountered in exp
  zspan = (0., 1.05 * np.exp(logz[-1] + 3. * logzerr[-1]))
05:28 bilby WARNING : Axis limits cannot be NaN or Inf
05:28 bilby WARNING : Failed to create dynesty run plot at checkpoint
05:38 bilby INFO    : Written checkpoint file outdir_taylorf2_lal_binary_black_hole/result/eccn_taylorf2_lal_binary_black_hole_data0_1187008882-4_analysis_H1L1V1_dynesty_resume.pickle
/home/hemantakumar.phurailatpam/anaconda3/envs/lal2/lib/python3.7/site-packages/dynesty/plotting.py:179: RuntimeWarning: overflow encountered in exp
  data = [nlive, np.exp(logl), np.exp(logwt), np.exp(logz)]
/home/hemantakumar.phurailatpam/anaconda3/envs/lal2/lib/python3.7/site-packages/dynesty/plotting.py:203: RuntimeWarning: overflow encountered in exp
  zspan = (0., 1.05 * np.exp(logz[-1] + 3. * logzerr[-1]))
05:38 bilby WARNING : Axis limits cannot be NaN or Inf
05:38 bilby WARNING : Failed to create dynesty run plot at checkpoint
05:42 bilby INFO    : Written checkpoint file outdir_taylorf2_lal_binary_black_hole/result/eccn_taylorf2_lal_binary_black_hole_data0_1187008882-4_analysis_H1L1V1_dynesty_resume.pickle
/home/hemantakumar.phurailatpam/anaconda3/envs/lal2/lib/python3.7/site-packages/dynesty/plotting.py:179: RuntimeWarning: overflow encountered in exp
  data = [nlive, np.exp(logl), np.exp(logwt), np.exp(logz)]
/home/hemantakumar.phurailatpam/anaconda3/envs/lal2/lib/python3.7/site-packages/dynesty/plotting.py:203: RuntimeWarning: overflow encountered in exp
  zspan = (0., 1.05 * np.exp(logz[-1] + 3. * logzerr[-1]))
05:43 bilby WARNING : Axis limits cannot be NaN or Inf
05:43 bilby WARNING : Failed to create dynesty run plot at checkpoint
05:43 bilby INFO    : Starting to close worker pool.
05:43 bilby INFO    : Finished closing worker pool.
05:43 bilby INFO    : Sampling time: 1:15:13.251861
05:43 bilby INFO    : Generating sky frame parameters.
05:43 bilby INFO    : Computing SNRs for every sample.
05:43 bilby INFO    : Using a pool with size 8 for nsamples=15023
05:44 bilby INFO    : Summary of results:
nsamples: 15023
ln_noise_evidence: -363113.606
ln_evidence: -361302.425 +/-  0.314
ln_bayes_factor: 1811.181 +/-  0.314

