03:03 bilby_pipe INFO    : Running bilby_pipe version: 1.0.4: (CLEAN) a0f8deb 2021-05-14 15:08:45 +0000
03:03 bilby_pipe INFO    : Running bilby: 1.1.4: (UNCLEAN) 6cf9a859 2021-11-01 03:42:33 +0000
03:03 bilby_pipe INFO    : Command line arguments: Namespace(accounting='ligo.dev.o3.cbc.pe.lalinference', allow_tape=True, analysis_executable=None, calibration_model=None, catch_waveform_errors=False, channel_dict='{H1:GWOSC, L1:GWOSC}', coherence_test=False, condor_job_priority=0, conversion_function=None, convert_to_flat_in_component_mass=False, create_plots=False, create_summary=False, data_dict=None, data_dump_file='outdir_eccn/data/eccn_data0_1126259600-0_generation_data_dump.pickle', data_format=None, default_prior='BBHPriorDict', deltaT=0.2, detectors=['H1', 'L1'], distance_marginalization=False, distance_marginalization_lookup_table=None, duration=8.0, email=None, existing_dir=None, extra_likelihood_kwargs=None, frequency_domain_source_model='lal_eccentric_advancement_of_pariastron', gaussian_noise=False, generation_function=None, generation_seed=None, gps_file=None, gps_tuple=None, idx=0, ignore_gwpy_data_quality_check=True, ini='eccn_config_complete.ini', injection=True, injection_dict="{'mass_1':20.0, 'mass_2':15.0, 'chirp_mass':15.047319552305357, 'mass_ratio':0.75, 'eccentricity':0.1, 'a_1':0., 'a_2':0., 'tilt_1':0., 'tilt_2':0., 'phi_12':0., 'phi_jl':0., 'luminosity_distance':150., 'theta_jn':0.4, 'psi':0.1, 'phase':1.2, 'geocent_time':1126259600.0, 'ra':45.0, 'dec':5.73,}", injection_file=None, injection_numbers=['None'], injection_waveform_approximant=None, jitter_time=True, label='eccn_data0_1126259600-0_analysis_H1L1_dynesty', likelihood_type='GravitationalWaveTransient', local=False, local_generation=False, local_plot=False, log_directory=None, maximum_frequency=None, minimum_frequency='20', mode_array=[None], n_parallel=1, n_simulation=1, notification='Never', numerical_relativity_file=None, online_pe=False, osg=False, outdir='outdir_eccn', overwrite_outdir=False, periodic_restart_time=28800, phase_marginalization=False, plot_calibration=False, plot_corner=False, plot_format='png', plot_marginal=False, plot_skymap=False, plot_waveform=False, pn_amplitude_order=0, pn_phase_order=-1, pn_spin_order=-1, pn_tidal_order=-1, post_trigger_duration=2.0, postprocessing_arguments=None, postprocessing_executable=None, prior_dict="{mass-1: Constraint(name='mass_1', minimum=10.0, maximum=30.0), mass_2 = Constraint(name='mass_2', minimum=10.0, maximum=30.0), chirp_mass = Uniform(name='chirp_mass', minimum=8.705505632961241,maximum=26.11651689888372), mass_ratio = Uniform(name='mass_ratio', minimum=0.1, maximum=1), eccentricity = LogUniform(name='initial_eccentricity', minimum=0.01, maximum=0.2), a_1 = 0., a_2 = 0., tilt_1 = 0., tilt_2 = 0., phi_12 = 0., phi_jl = 0., luminosity_distance = 150., theta_jn = 0.4, psi =  0.1, phase = 1.2, geocent_time = 1126259600.0, ra = 45.0, dec = 5.73, }", prior_file=None, psd_dict=None, psd_fractional_overlap=0.5, psd_length=32, psd_maximum_duration=1024, psd_method='median', psd_start_time=None, reference_frame='sky', reference_frequency=20.0, request_cpus=8, request_memory=4.0, request_memory_generation=None, resampling_method='lal', result_format='json', roq_folder=None, roq_scale_factor=1.0, roq_weights=None, sampler='dynesty', sampler_kwargs="{'nlive': 500, 'npool': 8}", sampling_frequency=1024.0, sampling_seed=None, scheduler='condor', scheduler_analysis_time='7-00:00:00', scheduler_args=None, scheduler_env=None, scheduler_module=[None], single_postprocessing_arguments=None, single_postprocessing_executable=None, singularity_image=None, spline_calibration_amplitude_uncertainty_dict=None, spline_calibration_envelope_dict=None, spline_calibration_nodes=5, spline_calibration_phase_uncertainty_dict=None, submit=False, summarypages_arguments=None, time_marginalization=False, time_reference='geocent', timeslide_dict=None, timeslide_file=None, transfer_files=True, trigger_time='1126259600.0', tukey_roll_off=0.4, verbose=False, waveform_approximant='OSMFD', waveform_arguments_dict=None, waveform_generator='bilby.gw.waveform_generator.WaveformGenerator', webdir=None, zero_noise=False)
03:03 bilby_pipe INFO    : Sampling seed set to 501824
03:03 bilby_pipe INFO    : No maximum frequency given. Setting to sampling frequency / 2 = 512.0
03:03 bilby_pipe INFO    : No calibration_model model provided, calibration marginalization will not be used
03:03 bilby_pipe INFO    : Found data for detectors = ['H1', 'L1']
03:03 bilby_pipe INFO    : Using data for detectors = ['H1', 'L1']
03:03 bilby_pipe INFO    : H1: sampling-frequency=1024.0, segment-start-time=1126259594.0, duration=8.0
03:03 bilby_pipe INFO    : L1: sampling-frequency=1024.0, segment-start-time=1126259594.0, duration=8.0
03:03 bilby_pipe INFO    : Using the lal_eccentric_advancement_of_pariastron source model
03:03 bilby_pipe INFO    : No conversion function
03:03 bilby INFO    : Waveform generator initiated with
  frequency_domain_source_model: bilby.gw.source.lal_eccentric_advancement_of_pariastron
  time_domain_source_model: None
  parameter_conversion: bilby.gw.conversion.convert_to_lal_binary_black_hole_parameters
03:03 bilby_pipe INFO    : No conversion function
03:03 bilby INFO    : Running for label 'eccn_data0_1126259600-0_analysis_H1L1_dynesty', output will be saved to 'outdir_eccn/result'
03:03 bilby INFO    : Using lal version 7.1.4.1
03:03 bilby INFO    : Using lal git version Branch: main;Tag: None;Id: dcd0a82f81f842e9ecfec960b579e67b70378bb9;;Builder: hemantakumar.phurailatpam <hemantaphurailatpam@gmail.com>;Repository status: UNCLEAN: Modified working tree
03:03 bilby INFO    : Using lalsimulation version 3.0.0.1
03:03 bilby INFO    : Using lalsimulation git version Branch: main;Tag: None;Id: dcd0a82f81f842e9ecfec960b579e67b70378bb9;;Builder: hemantakumar.phurailatpam <hemantaphurailatpam@gmail.com>;Repository status: UNCLEAN: Modified working tree
03:03 bilby INFO    : Search parameters:
03:03 bilby INFO    :   chirp_mass = Uniform(minimum=8.705505632961241, maximum=26.11651689888372, name='chirp_mass', latex_label='$\\mathcal{M}$', unit=None, boundary=None)
03:03 bilby INFO    :   mass_ratio = Uniform(minimum=0.1, maximum=1, name='mass_ratio', latex_label='$q$', unit=None, boundary=None)
03:03 bilby INFO    :   eccentricity = LogUniform(minimum=0.01, maximum=0.2, name='initial_eccentricity', latex_label='initial_eccentricity', unit=None, boundary=None)
03:03 bilby INFO    :   mass_1 = Constraint(minimum=10.0, maximum=30.0, name='mass_1', latex_label='$m_1$', unit=None)
03:03 bilby INFO    :   mass_2 = Constraint(minimum=10.0, maximum=30.0, name='mass_2', latex_label='$m_2$', unit=None)
03:03 bilby INFO    :   a_1 = 0.0
03:03 bilby INFO    :   a_2 = 0.0
03:03 bilby INFO    :   tilt_1 = 0.0
03:03 bilby INFO    :   tilt_2 = 0.0
03:03 bilby INFO    :   phi_12 = 0.0
03:03 bilby INFO    :   phi_jl = 0.0
03:03 bilby INFO    :   luminosity_distance = 150.0
03:03 bilby INFO    :   theta_jn = 0.4
03:03 bilby INFO    :   psi = 0.1
03:03 bilby INFO    :   phase = 1.2
03:03 bilby INFO    :   geocent_time = 1126259600.0
03:03 bilby INFO    :   ra = 45.0
03:03 bilby INFO    :   dec = 5.73
03:03 bilby INFO    : Generating frequency domain strain from given time domain strain.
03:03 bilby INFO    : Applying a tukey window with alpha=0.1, roll off=0.4
03:03 bilby INFO    : Generating frequency domain strain from given time domain strain.
03:03 bilby INFO    : Applying a tukey window with alpha=0.1, roll off=0.4
03:03 bilby INFO    : Single likelihood evaluation took 6.181e-02 s
03:03 bilby INFO    : Using sampler Dynesty with kwargs {'bound': 'multi', 'sample': 'rwalk', 'verbose': True, 'periodic': None, 'reflective': None, 'check_point_delta_t': 1800, 'nlive': 500, 'first_update': None, 'walks': 100, 'npdim': None, 'rstate': None, 'queue_size': 8, 'pool': None, 'use_pool': None, 'live_points': None, 'logl_args': None, 'logl_kwargs': None, 'ptform_args': None, 'ptform_kwargs': None, 'enlarge': 1.5, 'bootstrap': None, 'vol_dec': 0.5, 'vol_check': 8.0, 'facc': 0.2, 'slices': 5, 'update_interval': 300, 'print_func': <bound method Dynesty._print_func of <bilby.core.sampler.dynesty.Dynesty object at 0x2b125fdbcdd0>>, 'dlogz': 0.1, 'maxiter': None, 'maxcall': None, 'logl_max': inf, 'add_live': True, 'print_progress': True, 'save_bounds': False, 'n_effective': None, 'maxmcmc': 5000, 'nact': 5, 'print_method': 'tqdm'}
03:03 bilby INFO    : Checkpoint every check_point_delta_t = 600s
03:03 bilby INFO    : Using dynesty version 1.0.1
03:03 bilby INFO    : Using the bilby-implemented rwalk sample method with ACT estimated walks
03:03 bilby INFO    : Setting up multiproccesing pool with 8 processes.
03:03 bilby INFO    : Resume file outdir_eccn/result/eccn_data0_1126259600-0_analysis_H1L1_dynesty_resume.pickle does not exist.
03:03 bilby INFO    : Generating initial points from the prior
03:14 bilby INFO    : Written checkpoint file outdir_eccn/result/eccn_data0_1126259600-0_analysis_H1L1_dynesty_resume.pickle
03:24 bilby INFO    : Written checkpoint file outdir_eccn/result/eccn_data0_1126259600-0_analysis_H1L1_dynesty_resume.pickle
03:34 bilby INFO    : Written checkpoint file outdir_eccn/result/eccn_data0_1126259600-0_analysis_H1L1_dynesty_resume.pickle
03:44 bilby INFO    : Written checkpoint file outdir_eccn/result/eccn_data0_1126259600-0_analysis_H1L1_dynesty_resume.pickle
03:55 bilby INFO    : Written checkpoint file outdir_eccn/result/eccn_data0_1126259600-0_analysis_H1L1_dynesty_resume.pickle
04:05 bilby INFO    : Written checkpoint file outdir_eccn/result/eccn_data0_1126259600-0_analysis_H1L1_dynesty_resume.pickle
04:15 bilby INFO    : Written checkpoint file outdir_eccn/result/eccn_data0_1126259600-0_analysis_H1L1_dynesty_resume.pickle
04:26 bilby INFO    : Written checkpoint file outdir_eccn/result/eccn_data0_1126259600-0_analysis_H1L1_dynesty_resume.pickle
04:36 bilby INFO    : Written checkpoint file outdir_eccn/result/eccn_data0_1126259600-0_analysis_H1L1_dynesty_resume.pickle
04:46 bilby INFO    : Written checkpoint file outdir_eccn/result/eccn_data0_1126259600-0_analysis_H1L1_dynesty_resume.pickle
04:56 bilby INFO    : Written checkpoint file outdir_eccn/result/eccn_data0_1126259600-0_analysis_H1L1_dynesty_resume.pickle
05:07 bilby INFO    : Written checkpoint file outdir_eccn/result/eccn_data0_1126259600-0_analysis_H1L1_dynesty_resume.pickle
05:17 bilby INFO    : Written checkpoint file outdir_eccn/result/eccn_data0_1126259600-0_analysis_H1L1_dynesty_resume.pickle
05:27 bilby INFO    : Written checkpoint file outdir_eccn/result/eccn_data0_1126259600-0_analysis_H1L1_dynesty_resume.pickle
05:37 bilby INFO    : Written checkpoint file outdir_eccn/result/eccn_data0_1126259600-0_analysis_H1L1_dynesty_resume.pickle
05:47 bilby INFO    : Written checkpoint file outdir_eccn/result/eccn_data0_1126259600-0_analysis_H1L1_dynesty_resume.pickle
05:58 bilby INFO    : Written checkpoint file outdir_eccn/result/eccn_data0_1126259600-0_analysis_H1L1_dynesty_resume.pickle
06:08 bilby INFO    : Written checkpoint file outdir_eccn/result/eccn_data0_1126259600-0_analysis_H1L1_dynesty_resume.pickle
06:18 bilby INFO    : Written checkpoint file outdir_eccn/result/eccn_data0_1126259600-0_analysis_H1L1_dynesty_resume.pickle
06:29 bilby INFO    : Written checkpoint file outdir_eccn/result/eccn_data0_1126259600-0_analysis_H1L1_dynesty_resume.pickle
06:39 bilby INFO    : Written checkpoint file outdir_eccn/result/eccn_data0_1126259600-0_analysis_H1L1_dynesty_resume.pickle
06:50 bilby INFO    : Written checkpoint file outdir_eccn/result/eccn_data0_1126259600-0_analysis_H1L1_dynesty_resume.pickle
07:00 bilby INFO    : Written checkpoint file outdir_eccn/result/eccn_data0_1126259600-0_analysis_H1L1_dynesty_resume.pickle
07:10 bilby INFO    : Written checkpoint file outdir_eccn/result/eccn_data0_1126259600-0_analysis_H1L1_dynesty_resume.pickle
07:20 bilby INFO    : Written checkpoint file outdir_eccn/result/eccn_data0_1126259600-0_analysis_H1L1_dynesty_resume.pickle
07:31 bilby INFO    : Written checkpoint file outdir_eccn/result/eccn_data0_1126259600-0_analysis_H1L1_dynesty_resume.pickle
07:41 bilby INFO    : Written checkpoint file outdir_eccn/result/eccn_data0_1126259600-0_analysis_H1L1_dynesty_resume.pickle
07:52 bilby INFO    : Written checkpoint file outdir_eccn/result/eccn_data0_1126259600-0_analysis_H1L1_dynesty_resume.pickle
08:02 bilby INFO    : Written checkpoint file outdir_eccn/result/eccn_data0_1126259600-0_analysis_H1L1_dynesty_resume.pickle
08:12 bilby INFO    : Written checkpoint file outdir_eccn/result/eccn_data0_1126259600-0_analysis_H1L1_dynesty_resume.pickle
08:22 bilby INFO    : Written checkpoint file outdir_eccn/result/eccn_data0_1126259600-0_analysis_H1L1_dynesty_resume.pickle
08:32 bilby INFO    : Written checkpoint file outdir_eccn/result/eccn_data0_1126259600-0_analysis_H1L1_dynesty_resume.pickle
08:42 bilby INFO    : Written checkpoint file outdir_eccn/result/eccn_data0_1126259600-0_analysis_H1L1_dynesty_resume.pickle
08:53 bilby INFO    : Written checkpoint file outdir_eccn/result/eccn_data0_1126259600-0_analysis_H1L1_dynesty_resume.pickle
09:03 bilby INFO    : Written checkpoint file outdir_eccn/result/eccn_data0_1126259600-0_analysis_H1L1_dynesty_resume.pickle
09:10 bilby INFO    : Written checkpoint file outdir_eccn/result/eccn_data0_1126259600-0_analysis_H1L1_dynesty_resume.pickle
09:10 bilby INFO    : Starting to close worker pool.
09:10 bilby INFO    : Finished closing worker pool.
09:10 bilby INFO    : Sampling time: 6:06:21.826950
09:10 bilby INFO    : Summary of results:
nsamples: 8299
ln_noise_evidence: -9093.194
ln_evidence: -8441.460 +/-  0.217
ln_bayes_factor: 651.734 +/-  0.217

