idx=10, freq=100.000000, shft=-0.100000, phi_ref=1.200000, ref_phasing=969.221176, phasing=59.105251 
idx=9, freq=90.000000, shft=-0.100000, phi_ref=1.200000, ref_phasing=969.221176, phasing=62.058889 
idx=8, freq=80.000000, shft=-0.100000, phi_ref=1.200000, ref_phasing=969.221176, phasing=66.250113 
idx=7, freq=70.000000, shft=-0.100000, phi_ref=1.200000, ref_phasing=969.221176, phasing=72.421534 
idx=6, freq=60.000000, shft=-0.100000, phi_ref=1.200000, ref_phasing=969.221176, phasing=81.947994 
idx=5, freq=50.000000, shft=-0.100000, phi_ref=1.200000, ref_phasing=969.221176, phasing=97.609030 
idx=4, freq=40.000000, shft=-0.100000, phi_ref=1.200000, ref_phasing=969.221176, phasing=125.744669 
idx=3, freq=30.000000, shft=-0.100000, phi_ref=1.200000, ref_phasing=969.221176, phasing=183.604306 
idx=2, freq=20.000000, shft=-0.100000, phi_ref=1.200000, ref_phasing=969.221176, phasing=333.598534 
