000 (96397489.000.000) 2022-06-04 09:27:04 Job submitted from host: <10.14.0.51:9618?addrs=10.14.0.51-9618&alias=ldas-pcdev5.ligo.caltech.edu&noUDP&sock=schedd_3504500_162f>
    DAG Node: TaylorF2EccFD20Hz_512HzUniformDNoSpin_data0_1187008882-43_analysis_H1L1V1_arg_0
...
040 (96397489.000.000) 2022-06-04 09:27:43 Started transferring input files
	Transferring to host: <10.14.9.65:9618?addrs=10.14.9.65-9618&alias=node2065.cluster.ldas.cit&noUDP&sock=slot1_19_1701700_57c8_27114>
...
040 (96397489.000.000) 2022-06-04 09:27:43 Finished transferring input files
...
001 (96397489.000.000) 2022-06-04 09:27:43 Job executing on host: <10.14.9.65:9618?addrs=10.14.9.65-9618&alias=node2065.cluster.ldas.cit&noUDP&sock=startd_12128_60b1>
...
006 (96397489.000.000) 2022-06-04 09:27:52 Image size of job updated: 324408
	168  -  MemoryUsage of job (MB)
	171712  -  ResidentSetSize of job (KB)
...
006 (96397489.000.000) 2022-06-04 09:32:53 Image size of job updated: 8481300
	695  -  MemoryUsage of job (MB)
	711332  -  ResidentSetSize of job (KB)
...
006 (96397489.000.000) 2022-06-04 09:37:53 Image size of job updated: 8482324
	703  -  MemoryUsage of job (MB)
	719016  -  ResidentSetSize of job (KB)
...
006 (96397489.000.000) 2022-06-04 09:42:54 Image size of job updated: 8482324
	704  -  MemoryUsage of job (MB)
	720476  -  ResidentSetSize of job (KB)
...
006 (96397489.000.000) 2022-06-04 09:47:54 Image size of job updated: 8482324
	705  -  MemoryUsage of job (MB)
	721696  -  ResidentSetSize of job (KB)
...
006 (96397489.000.000) 2022-06-04 09:52:54 Image size of job updated: 8482324
	706  -  MemoryUsage of job (MB)
	722040  -  ResidentSetSize of job (KB)
...
006 (96397489.000.000) 2022-06-04 09:57:55 Image size of job updated: 8482324
	706  -  MemoryUsage of job (MB)
	722156  -  ResidentSetSize of job (KB)
...
006 (96397489.000.000) 2022-06-04 10:02:56 Image size of job updated: 8521292
	777  -  MemoryUsage of job (MB)
	795588  -  ResidentSetSize of job (KB)
...
006 (96397489.000.000) 2022-06-04 10:07:56 Image size of job updated: 8521292
	778  -  MemoryUsage of job (MB)
	795716  -  ResidentSetSize of job (KB)
...
006 (96397489.000.000) 2022-06-04 10:12:56 Image size of job updated: 8521292
	782  -  MemoryUsage of job (MB)
	799760  -  ResidentSetSize of job (KB)
...
006 (96397489.000.000) 2022-06-04 10:17:56 Image size of job updated: 8521292
	783  -  MemoryUsage of job (MB)
	801076  -  ResidentSetSize of job (KB)
...
006 (96397489.000.000) 2022-06-04 10:22:57 Image size of job updated: 8521292
	784  -  MemoryUsage of job (MB)
	802340  -  ResidentSetSize of job (KB)
...
006 (96397489.000.000) 2022-06-04 10:27:58 Image size of job updated: 8521292
	784  -  MemoryUsage of job (MB)
	802688  -  ResidentSetSize of job (KB)
...
006 (96397489.000.000) 2022-06-04 10:32:58 Image size of job updated: 8547176
	810  -  MemoryUsage of job (MB)
	829060  -  ResidentSetSize of job (KB)
...
006 (96397489.000.000) 2022-06-04 10:37:59 Image size of job updated: 8547176
	810  -  MemoryUsage of job (MB)
	829120  -  ResidentSetSize of job (KB)
...
006 (96397489.000.000) 2022-06-04 10:43:00 Image size of job updated: 8547176
	810  -  MemoryUsage of job (MB)
	829140  -  ResidentSetSize of job (KB)
...
006 (96397489.000.000) 2022-06-04 10:48:01 Image size of job updated: 8547176
	810  -  MemoryUsage of job (MB)
	829148  -  ResidentSetSize of job (KB)
...
006 (96397489.000.000) 2022-06-04 10:53:02 Image size of job updated: 8547176
	810  -  MemoryUsage of job (MB)
	829152  -  ResidentSetSize of job (KB)
...
006 (96397489.000.000) 2022-06-04 10:58:02 Image size of job updated: 8547176
	810  -  MemoryUsage of job (MB)
	829156  -  ResidentSetSize of job (KB)
...
006 (96397489.000.000) 2022-06-04 11:38:05 Image size of job updated: 8564124
	826  -  MemoryUsage of job (MB)
	845748  -  ResidentSetSize of job (KB)
...
006 (96397489.000.000) 2022-06-04 11:43:06 Image size of job updated: 8564124
	826  -  MemoryUsage of job (MB)
	845752  -  ResidentSetSize of job (KB)
...
006 (96397489.000.000) 2022-06-04 11:48:06 Image size of job updated: 8564124
	826  -  MemoryUsage of job (MB)
	845760  -  ResidentSetSize of job (KB)
...
006 (96397489.000.000) 2022-06-04 11:53:07 Image size of job updated: 8564124
	826  -  MemoryUsage of job (MB)
	845772  -  ResidentSetSize of job (KB)
...
006 (96397489.000.000) 2022-06-04 11:58:08 Image size of job updated: 8564124
	826  -  MemoryUsage of job (MB)
	845776  -  ResidentSetSize of job (KB)
...
006 (96397489.000.000) 2022-06-04 12:03:09 Image size of job updated: 8564124
	826  -  MemoryUsage of job (MB)
	845788  -  ResidentSetSize of job (KB)
...
006 (96397489.000.000) 2022-06-04 12:08:10 Image size of job updated: 8569696
	832  -  MemoryUsage of job (MB)
	851764  -  ResidentSetSize of job (KB)
...
006 (96397489.000.000) 2022-06-04 12:13:11 Image size of job updated: 8569696
	832  -  MemoryUsage of job (MB)
	851792  -  ResidentSetSize of job (KB)
...
006 (96397489.000.000) 2022-06-04 12:18:12 Image size of job updated: 8569696
	832  -  MemoryUsage of job (MB)
	851880  -  ResidentSetSize of job (KB)
...
006 (96397489.000.000) 2022-06-04 12:23:13 Image size of job updated: 8569696
	832  -  MemoryUsage of job (MB)
	851892  -  ResidentSetSize of job (KB)
...
006 (96397489.000.000) 2022-06-04 12:28:14 Image size of job updated: 8569696
	832  -  MemoryUsage of job (MB)
	851960  -  ResidentSetSize of job (KB)
...
006 (96397489.000.000) 2022-06-04 12:33:15 Image size of job updated: 8569696
	832  -  MemoryUsage of job (MB)
	851964  -  ResidentSetSize of job (KB)
...
006 (96397489.000.000) 2022-06-04 13:08:19 Image size of job updated: 8576292
	838  -  MemoryUsage of job (MB)
	857952  -  ResidentSetSize of job (KB)
...
006 (96397489.000.000) 2022-06-04 13:13:20 Image size of job updated: 8576292
	838  -  MemoryUsage of job (MB)
	857956  -  ResidentSetSize of job (KB)
...
006 (96397489.000.000) 2022-06-04 13:18:21 Image size of job updated: 8576292
	838  -  MemoryUsage of job (MB)
	857972  -  ResidentSetSize of job (KB)
...
006 (96397489.000.000) 2022-06-04 13:23:21 Image size of job updated: 8576292
	838  -  MemoryUsage of job (MB)
	857976  -  ResidentSetSize of job (KB)
...
006 (96397489.000.000) 2022-06-04 13:28:21 Image size of job updated: 8576292
	838  -  MemoryUsage of job (MB)
	858108  -  ResidentSetSize of job (KB)
...
006 (96397489.000.000) 2022-06-04 13:33:21 Image size of job updated: 8576292
	838  -  MemoryUsage of job (MB)
	858112  -  ResidentSetSize of job (KB)
...
006 (96397489.000.000) 2022-06-04 14:08:22 Image size of job updated: 8586892
	838  -  MemoryUsage of job (MB)
	858112  -  ResidentSetSize of job (KB)
...
006 (96397489.000.000) 2022-06-04 14:38:23 Image size of job updated: 8586892
	844  -  MemoryUsage of job (MB)
	863768  -  ResidentSetSize of job (KB)
...
006 (96397489.000.000) 2022-06-04 14:43:23 Image size of job updated: 8586892
	844  -  MemoryUsage of job (MB)
	863776  -  ResidentSetSize of job (KB)
...
006 (96397489.000.000) 2022-06-04 14:58:25 Image size of job updated: 8586892
	844  -  MemoryUsage of job (MB)
	863868  -  ResidentSetSize of job (KB)
...
006 (96397489.000.000) 2022-06-04 15:03:26 Image size of job updated: 8586892
	844  -  MemoryUsage of job (MB)
	864088  -  ResidentSetSize of job (KB)
...
006 (96397489.000.000) 2022-06-04 15:13:27 Image size of job updated: 8593008
	857  -  MemoryUsage of job (MB)
	876656  -  ResidentSetSize of job (KB)
...
006 (96397489.000.000) 2022-06-04 15:18:28 Image size of job updated: 8593008
	857  -  MemoryUsage of job (MB)
	876704  -  ResidentSetSize of job (KB)
...
006 (96397489.000.000) 2022-06-04 15:23:29 Image size of job updated: 8593008
	857  -  MemoryUsage of job (MB)
	876708  -  ResidentSetSize of job (KB)
...
006 (96397489.000.000) 2022-06-04 15:28:30 Image size of job updated: 8593008
	857  -  MemoryUsage of job (MB)
	876824  -  ResidentSetSize of job (KB)
...
006 (96397489.000.000) 2022-06-04 15:33:31 Image size of job updated: 8593008
	857  -  MemoryUsage of job (MB)
	876932  -  ResidentSetSize of job (KB)
...
006 (96397489.000.000) 2022-06-04 17:18:43 Image size of job updated: 8596112
	860  -  MemoryUsage of job (MB)
	879800  -  ResidentSetSize of job (KB)
...
040 (96397489.000.000) 2022-06-04 17:28:25 Started transferring output files
...
040 (96397489.000.000) 2022-06-04 17:28:25 Finished transferring output files
...
006 (96397489.000.000) 2022-06-04 21:09:09 Image size of job updated: 8603460
	860  -  MemoryUsage of job (MB)
	879800  -  ResidentSetSize of job (KB)
...
006 (96397489.000.000) 2022-06-04 22:14:12 Image size of job updated: 8631780
	881  -  MemoryUsage of job (MB)
	902092  -  ResidentSetSize of job (KB)
...
006 (96397489.000.000) 2022-06-04 22:19:13 Image size of job updated: 8631780
	881  -  MemoryUsage of job (MB)
	902136  -  ResidentSetSize of job (KB)
...
006 (96397489.000.000) 2022-06-04 23:14:17 Image size of job updated: 8647924
	899  -  MemoryUsage of job (MB)
	919812  -  ResidentSetSize of job (KB)
...
006 (96397489.000.000) 2022-06-05 00:14:25 Image size of job updated: 8649972
	901  -  MemoryUsage of job (MB)
	922376  -  ResidentSetSize of job (KB)
...
006 (96397489.000.000) 2022-06-05 01:14:27 Image size of job updated: 8659188
	909  -  MemoryUsage of job (MB)
	930496  -  ResidentSetSize of job (KB)
...
006 (96397489.000.000) 2022-06-05 01:29:28 Image size of job updated: 8659188
	909  -  MemoryUsage of job (MB)
	930652  -  ResidentSetSize of job (KB)
...
040 (96397489.000.000) 2022-06-05 01:29:42 Started transferring output files
...
040 (96397489.000.000) 2022-06-05 01:29:42 Finished transferring output files
...
040 (96397489.000.000) 2022-06-05 02:41:55 Started transferring output files
...
040 (96397489.000.000) 2022-06-05 02:41:55 Finished transferring output files
...
005 (96397489.000.000) 2022-06-05 02:41:55 Job terminated.
	(1) Normal termination (return value 0)
		Usr 9 14:44:07, Sys 0 00:07:16  -  Run Remote Usage
		Usr 0 00:00:00, Sys 0 00:00:00  -  Run Local Usage
		Usr 9 14:44:07, Sys 0 00:07:16  -  Total Remote Usage
		Usr 0 00:00:00, Sys 0 00:00:00  -  Total Local Usage
	25925468  -  Run Bytes Sent By Job
	38083524  -  Run Bytes Received By Job
	25925468  -  Total Bytes Sent By Job
	38083524  -  Total Bytes Received By Job
	Partitionable Resources :    Usage  Request Allocated 
	   Cpus                 :    15.07       16        16 
	   Disk (KB)            : 49995     1048576   1113719 
	   GPUs                 :                           0 
	   Memory (MB)          :   909        4096      4096 

	Job terminated of its own accord at 2022-06-05T09:41:55Z.
...
