000 (96411686.000.000) 2022-06-06 17:56:09 Job submitted from host: <10.14.0.51:9618?addrs=10.14.0.51-9618&alias=ldas-pcdev5.ligo.caltech.edu&noUDP&sock=schedd_3504500_162f>
    DAG Node: TaylorF2EccFD20Hznospin_data0_1187008882-43_generation_arg_0
...
001 (96411686.000.000) 2022-06-06 17:57:55 Job executing on host: <10.14.3.211:9618?addrs=10.14.3.211-9618&alias=node711.cluster.ldas.cit&noUDP&sock=startd_9691_cc64>
...
005 (96411686.000.000) 2022-06-06 17:58:41 Job terminated.
	(1) Normal termination (return value 0)
		Usr 0 00:00:20, Sys 0 00:00:02  -  Run Remote Usage
		Usr 0 00:00:00, Sys 0 00:00:00  -  Run Local Usage
		Usr 0 00:00:20, Sys 0 00:00:02  -  Total Remote Usage
		Usr 0 00:00:00, Sys 0 00:00:00  -  Total Local Usage
	0  -  Run Bytes Sent By Job
	0  -  Run Bytes Received By Job
	0  -  Total Bytes Sent By Job
	0  -  Total Bytes Received By Job
	Partitionable Resources :    Usage  Request Allocated 
	   Cpus                 :     0.38        1         1 
	   Disk (KB)            :     1     1048576   1071516 
	   GPUs                 :                           0 
	   Memory (MB)          :    99        8192      8192 

	Job terminated of its own accord at 2022-06-07T00:58:41Z.
...
000 (96411719.000.000) 2022-06-06 17:58:49 Job submitted from host: <10.14.0.51:9618?addrs=10.14.0.51-9618&alias=ldas-pcdev5.ligo.caltech.edu&noUDP&sock=schedd_3504500_162f>
    DAG Node: TaylorF2EccFD20Hznospin_data0_1187008882-43_analysis_H1L1V1_arg_0
...
001 (96411719.000.000) 2022-06-06 18:12:59 Job executing on host: <10.14.9.140:9618?addrs=10.14.9.140-9618&alias=node2140.cluster.ldas.cit&noUDP&sock=startd_2779_bdc7>
...
001 (96411719.000.000) 2022-06-06 18:23:59 Job executing on host: <10.14.9.140:9618?addrs=10.14.9.140-9618&alias=node2140.cluster.ldas.cit&noUDP&sock=startd_2779_bdc7>
...
001 (96411719.000.000) 2022-06-06 19:37:35 Job executing on host: <10.14.9.94:9618?addrs=10.14.9.94-9618&alias=node2094.cluster.ldas.cit&noUDP&sock=startd_10060_e6d7>
...
001 (96411719.000.000) 2022-06-06 20:44:35 Job executing on host: <10.14.9.115:9618?addrs=10.14.9.115-9618&alias=node2115.cluster.ldas.cit&noUDP&sock=startd_3710_5473>
...
001 (96411719.000.000) 2022-06-06 21:36:29 Job executing on host: <10.14.9.97:9618?addrs=10.14.9.97-9618&alias=node2097.cluster.ldas.cit&noUDP&sock=startd_12301_0a94>
...
001 (96411719.000.000) 2022-06-06 23:39:03 Job executing on host: <10.14.9.63:9618?addrs=10.14.9.63-9618&alias=node2063.cluster.ldas.cit&noUDP&sock=startd_12144_5a35>
...
007 (96411719.000.000) 2022-06-07 00:15:03 Shadow exception!
	Error from slot1_17@node2063.cluster.ldas.cit: StreamHandler: stdout: couldn't write to outdir_TaylorF2EccFD20Hznospin/log_data_analysis/TaylorF2EccFD20Hznospin_data0_1187008882-43_analysis_H1L1V1.out: No space left on device (-1!=100)
	0  -  Run Bytes Sent By Job
	19098384  -  Run Bytes Received By Job
...
009 (96411719.000.000) 2022-06-07 11:11:25 Job was aborted.
	via condor_rm (by user hemantakumar.phurailatpam)
...
