22:14 bilby_pipe INFO    : Running bilby_pipe version: 1.0.6: (CLEAN) 76a4ef2 2022-04-26 12:39:06 +0100
22:14 bilby_pipe INFO    : Running bilby: 1.1.5: (UNCLEAN) f699675c 2022-05-29 02:12:11 +0000
22:14 bilby_pipe INFO    : Command line arguments: Namespace(ini='TaylorF2EccPerAdvFDLeO20Hz_ConstraintD_config_complete.ini', verbose=False, calibration_model=None, spline_calibration_envelope_dict=None, spline_calibration_nodes=10, spline_calibration_amplitude_uncertainty_dict=None, spline_calibration_phase_uncertainty_dict=None, calibration_prior_boundary='reflective', idx=0, data_dump_file='outdir_TaylorF2EccPerAdvFDLeO20Hz_ConstraintD/data/TaylorF2EccPerAdvFDLeO20Hz_ConstraintD_data0_1187008882-43_generation_data_dump.pickle', ignore_gwpy_data_quality_check=True, gps_tuple=None, gps_file=None, timeslide_file=None, timeslide_dict=None, trigger_time='1187008882.43', n_simulation=1, data_dict='{H1:H1_CLN.txt, L1:L1_CLN.txt,  V1:V1_CLN.txt}', data_format=None, allow_tape=True, channel_dict='{H1:H1, L1:L1, V1:V1}', gaussian_noise=False, zero_noise=False, coherence_test=False, detectors=['H1', 'L1', 'V1'], duration=263.0, generation_seed=None, psd_dict=None, psd_fractional_overlap=0.5, post_trigger_duration=1.0, sampling_frequency=512.0, psd_length=32, psd_maximum_duration=1024, psd_method='median', psd_start_time=None, maximum_frequency='256.', minimum_frequency='20.', tukey_roll_off=0.4, resampling_method='lal', injection=False, injection_dict=None, injection_file=None, injection_numbers=[None], injection_waveform_approximant=None, injection_waveform_arguments=None, accounting='ligo.dev.o3.cbc.pe.lalinference', accounting_user=None, label='TaylorF2EccPerAdvFDLeO20Hz_ConstraintD_data0_1187008882-43_analysis_H1L1V1', local=False, local_generation=False, local_plot=False, outdir='outdir_TaylorF2EccPerAdvFDLeO20Hz_ConstraintD', overwrite_outdir=False, periodic_restart_time=28800, request_disk=1.0, request_memory=4.0, request_memory_generation=None, request_cpus=16, conda_env=None, scheduler='condor', scheduler_args=None, scheduler_module=[None], scheduler_env=None, scheduler_analysis_time='7-00:00:00', submit=False, condor_job_priority=0, transfer_files=True, log_directory=None, online_pe=False, osg=False, desired_sites=None, analysis_executable=None, analysis_executable_parser=None, distance_marginalization=False, distance_marginalization_lookup_table=None, phase_marginalization=True, time_marginalization=True, jitter_time=True, reference_frame='sky', time_reference='geocent', likelihood_type='GravitationalWaveTransient', roq_folder=None, roq_weights=None, roq_scale_factor=1.0, extra_likelihood_kwargs=None, plot_trace=False, plot_data=False, plot_injection=False, plot_spectrogram=False, plot_calibration=False, plot_corner=False, plot_marginal=False, plot_skymap=False, plot_waveform=False, plot_format='png', create_summary=False, email=None, notification='Never', existing_dir=None, webdir=None, summarypages_arguments=None, result_format='hdf5', final_result=True, final_result_nsamples=20000, default_prior='BBHPriorDict', deltaT=0.2, prior_file=None, prior_dict="{mass-1: Constraint(name='mass_1', minimum=1.1,maximum=2.0), mass_2 = Constraint(name='mass_2', minimum=1.1,maximum=2.0), chirp_mass = Uniform(name='chirp_mass', minimum=0.9576056196257366,maximum=1.7411011265922482), mass_ratio = Uniform(name='mass_ratio', minimum=0.55, maximum=1.), eccentricity = Uniform(name='e0', minimum=0.0, maximum=0.1), luminosity-distance: 40.7, theta_jn = Sine(name='theta_jn'), psi =  Uniform(name='psi', minimum=0, maximum=6.283185307179586), phase = Uniform(name='phase', minimum=0, maximum=6.283185307179586), geocent_time = Uniform(1187008882.33, 1187008882.53, name='geocent_time', unit='s'), ra = 3.44615914, dec =  -0.40808407, }", enforce_signal_duration=True, postprocessing_executable=None, postprocessing_arguments=None, single_postprocessing_executable=None, single_postprocessing_arguments=None, sampler='dynesty', sampling_seed=None, n_parallel=1, sampler_kwargs="{'nlive': 500, 'walks': 100, 'check_point_plot': True, 'check_point_delta_t': 1800, 'print_method': 'interval-60', 'npool': 16}", waveform_generator='bilby.gw.waveform_generator.WaveformGenerator', reference_frequency=30.0, waveform_approximant='TaylorF2EccPerAdvFDLeO', catch_waveform_errors=True, pn_spin_order=-1, pn_tidal_order=-1, pn_phase_order=-1, pn_amplitude_order=0, numerical_relativity_file=None, waveform_arguments_dict=None, mode_array=[None], frequency_domain_source_model='lal_TaylorF2EccPerAdvFDLeO', conversion_function=None, generation_function=None)
22:14 bilby_pipe INFO    : Unknown command line arguments: []
22:14 bilby_pipe INFO    : Sampling seed set to 554560
22:14 bilby_pipe INFO    : No calibration_model model provided, calibration marginalization will not be used
22:14 bilby_pipe INFO    : Found data for detectors = ['H1', 'L1', 'V1']
22:14 bilby_pipe INFO    : Using data for detectors = ['H1', 'L1', 'V1']
22:14 bilby_pipe INFO    : H1: sampling-frequency=512.0, segment-start-time=1187008620.4299316, duration=263.0
22:14 bilby_pipe INFO    : L1: sampling-frequency=512.0, segment-start-time=1187008620.4299316, duration=263.0
22:14 bilby_pipe INFO    : V1: sampling-frequency=512.0, segment-start-time=1187008620.4299316, duration=263.0
22:14 bilby_pipe INFO    : Using the lal_TaylorF2EccPerAdvFDLeO source model
22:14 bilby_pipe INFO    : No conversion function
22:14 bilby INFO    : Waveform generator initiated with
  frequency_domain_source_model: bilby.gw.source.lal_TaylorF2EccPerAdvFDLeO
  time_domain_source_model: None
  parameter_conversion: bilby.gw.conversion.convert_to_lal_binary_black_hole_parameters
22:14 bilby_pipe INFO    : No conversion function
22:14 bilby INFO    : Running for label 'TaylorF2EccPerAdvFDLeO20Hz_ConstraintD_data0_1187008882-43_analysis_H1L1V1', output will be saved to 'outdir_TaylorF2EccPerAdvFDLeO20Hz_ConstraintD/result'
22:14 bilby INFO    : Using lal version 7.1.7.1
22:14 bilby INFO    : Using lal git version Branch: master;Tag: None;Id: 7eef7079ec7a112132bd11eb292c5535d2ebf6b2;;Builder: Unknown User <>;Repository status: UNCLEAN: Modified working tree
22:14 bilby INFO    : Using lalsimulation version 3.1.2.1
22:14 bilby INFO    : Using lalsimulation git version Branch: master;Tag: None;Id: 7eef7079ec7a112132bd11eb292c5535d2ebf6b2;;Builder: Unknown User <>;Repository status: UNCLEAN: Modified working tree
22:14 bilby INFO    : Search parameters:
22:14 bilby INFO    :   chirp_mass = Uniform(minimum=0.9576056196257366, maximum=1.7411011265922482, name='chirp_mass', latex_label='$\\mathcal{M}$', unit=None, boundary=None)
22:14 bilby INFO    :   mass_ratio = Uniform(minimum=0.55, maximum=1.0, name='mass_ratio', latex_label='$q$', unit=None, boundary=None)
22:14 bilby INFO    :   eccentricity = Uniform(minimum=0.0, maximum=0.1, name='e0', latex_label='e0', unit=None, boundary=None)
22:14 bilby INFO    :   theta_jn = Sine(minimum=0, maximum=3.141592653589793, name='theta_jn', latex_label='$\\theta_{JN}$', unit=None, boundary=None)
22:14 bilby INFO    :   psi = Uniform(minimum=0, maximum=6.283185307179586, name='psi', latex_label='$\\psi$', unit=None, boundary=None)
22:14 bilby INFO    :   time_jitter = Uniform(minimum=-0.001953125, maximum=0.001953125, name='time_jitter', latex_label='$t_j$', unit=None, boundary='periodic')
22:14 bilby INFO    :   mass_1 = Constraint(minimum=1.1, maximum=2.0, name='mass_1', latex_label='$m_1$', unit=None)
22:14 bilby INFO    :   mass_2 = Constraint(minimum=1.1, maximum=2.0, name='mass_2', latex_label='$m_2$', unit=None)
22:14 bilby INFO    :   luminosity_distance = 40.7
22:14 bilby INFO    :   phase = 0.0
22:14 bilby INFO    :   geocent_time = 1187008620.4299316
22:14 bilby INFO    :   ra = 3.44615914
22:14 bilby INFO    :   dec = -0.40808407
22:14 bilby INFO    : Generating frequency domain strain from given time domain strain.
22:14 bilby INFO    : Applying a tukey window with alpha=0.0030418250950570345, roll off=0.4
22:14 bilby INFO    : Generating frequency domain strain from given time domain strain.
22:14 bilby INFO    : Applying a tukey window with alpha=0.0030418250950570345, roll off=0.4
22:14 bilby INFO    : Generating frequency domain strain from given time domain strain.
22:14 bilby INFO    : Applying a tukey window with alpha=0.0030418250950570345, roll off=0.4
22:15 bilby INFO    : Single likelihood evaluation took 6.365e-01 s
22:15 bilby INFO    : Using sampler Dynesty with kwargs {'bound': 'multi', 'sample': 'rwalk', 'periodic': None, 'reflective': None, 'check_point_delta_t': 1800, 'nlive': 500, 'first_update': None, 'walks': 100, 'npdim': None, 'rstate': None, 'queue_size': 16, 'pool': None, 'use_pool': None, 'live_points': None, 'logl_args': None, 'logl_kwargs': None, 'ptform_args': None, 'ptform_kwargs': None, 'enlarge': 1.5, 'bootstrap': None, 'vol_dec': 0.5, 'vol_check': 8.0, 'facc': 0.2, 'slices': 5, 'update_interval': 300, 'print_func': <bound method Dynesty._print_func of <bilby.core.sampler.dynesty.Dynesty object at 0x2ab9aca07c10>>, 'dlogz': 0.1, 'maxiter': None, 'maxcall': None, 'logl_max': inf, 'add_live': True, 'print_progress': True, 'save_bounds': False, 'n_effective': None, 'maxmcmc': 5000, 'nact': 5, 'print_method': 'interval-60'}
22:15 bilby INFO    : Checkpoint every check_point_delta_t = 1800s
22:15 bilby INFO    : Using dynesty version 1.0.1
22:15 bilby INFO    : Using the bilby-implemented rwalk sample method with ACT estimated walks
22:15 bilby INFO    : Setting up multiproccesing pool with 16 processes.
22:15 bilby INFO    : Resume file outdir_TaylorF2EccPerAdvFDLeO20Hz_ConstraintD/result/TaylorF2EccPerAdvFDLeO20Hz_ConstraintD_data0_1187008882-43_analysis_H1L1V1_resume.pickle does not exist.
22:15 bilby INFO    : Generating initial points from the prior
22:55 bilby INFO    : Written checkpoint file outdir_TaylorF2EccPerAdvFDLeO20Hz_ConstraintD/result/TaylorF2EccPerAdvFDLeO20Hz_ConstraintD_data0_1187008882-43_analysis_H1L1V1_resume.pickle
/home/hemantakumar.phurailatpam/anaconda3/envs/lal2/lib/python3.10/site-packages/dynesty/plotting.py:675: UserWarning: Attempting to set identical bottom == top == 0.0 results in singular transformations; automatically expanding.
  ax.set_ylim([0., max(y0) * 1.05])
/home/hemantakumar.phurailatpam/anaconda3/envs/lal2/lib/python3.10/site-packages/dynesty/plotting.py:675: UserWarning: Attempting to set identical bottom == top == 0.0 results in singular transformations; automatically expanding.
  ax.set_ylim([0., max(y0) * 1.05])
23:26 bilby INFO    : Written checkpoint file outdir_TaylorF2EccPerAdvFDLeO20Hz_ConstraintD/result/TaylorF2EccPerAdvFDLeO20Hz_ConstraintD_data0_1187008882-43_analysis_H1L1V1_resume.pickle
/home/hemantakumar.phurailatpam/anaconda3/envs/lal2/lib/python3.10/site-packages/dynesty/plotting.py:675: UserWarning: Attempting to set identical bottom == top == 0.0 results in singular transformations; automatically expanding.
  ax.set_ylim([0., max(y0) * 1.05])
/home/hemantakumar.phurailatpam/anaconda3/envs/lal2/lib/python3.10/site-packages/dynesty/plotting.py:675: UserWarning: Attempting to set identical bottom == top == 0.0 results in singular transformations; automatically expanding.
  ax.set_ylim([0., max(y0) * 1.05])
23:58 bilby INFO    : Written checkpoint file outdir_TaylorF2EccPerAdvFDLeO20Hz_ConstraintD/result/TaylorF2EccPerAdvFDLeO20Hz_ConstraintD_data0_1187008882-43_analysis_H1L1V1_resume.pickle
00:28 bilby INFO    : Written checkpoint file outdir_TaylorF2EccPerAdvFDLeO20Hz_ConstraintD/result/TaylorF2EccPerAdvFDLeO20Hz_ConstraintD_data0_1187008882-43_analysis_H1L1V1_resume.pickle
01:01 bilby INFO    : Written checkpoint file outdir_TaylorF2EccPerAdvFDLeO20Hz_ConstraintD/result/TaylorF2EccPerAdvFDLeO20Hz_ConstraintD_data0_1187008882-43_analysis_H1L1V1_resume.pickle
01:32 bilby INFO    : Written checkpoint file outdir_TaylorF2EccPerAdvFDLeO20Hz_ConstraintD/result/TaylorF2EccPerAdvFDLeO20Hz_ConstraintD_data0_1187008882-43_analysis_H1L1V1_resume.pickle
02:02 bilby INFO    : Written checkpoint file outdir_TaylorF2EccPerAdvFDLeO20Hz_ConstraintD/result/TaylorF2EccPerAdvFDLeO20Hz_ConstraintD_data0_1187008882-43_analysis_H1L1V1_resume.pickle
02:33 bilby INFO    : Written checkpoint file outdir_TaylorF2EccPerAdvFDLeO20Hz_ConstraintD/result/TaylorF2EccPerAdvFDLeO20Hz_ConstraintD_data0_1187008882-43_analysis_H1L1V1_resume.pickle
03:03 bilby INFO    : Written checkpoint file outdir_TaylorF2EccPerAdvFDLeO20Hz_ConstraintD/result/TaylorF2EccPerAdvFDLeO20Hz_ConstraintD_data0_1187008882-43_analysis_H1L1V1_resume.pickle
03:35 bilby INFO    : Written checkpoint file outdir_TaylorF2EccPerAdvFDLeO20Hz_ConstraintD/result/TaylorF2EccPerAdvFDLeO20Hz_ConstraintD_data0_1187008882-43_analysis_H1L1V1_resume.pickle
04:07 bilby INFO    : Written checkpoint file outdir_TaylorF2EccPerAdvFDLeO20Hz_ConstraintD/result/TaylorF2EccPerAdvFDLeO20Hz_ConstraintD_data0_1187008882-43_analysis_H1L1V1_resume.pickle
04:38 bilby INFO    : Written checkpoint file outdir_TaylorF2EccPerAdvFDLeO20Hz_ConstraintD/result/TaylorF2EccPerAdvFDLeO20Hz_ConstraintD_data0_1187008882-43_analysis_H1L1V1_resume.pickle
05:09 bilby INFO    : Written checkpoint file outdir_TaylorF2EccPerAdvFDLeO20Hz_ConstraintD/result/TaylorF2EccPerAdvFDLeO20Hz_ConstraintD_data0_1187008882-43_analysis_H1L1V1_resume.pickle
05:39 bilby INFO    : Written checkpoint file outdir_TaylorF2EccPerAdvFDLeO20Hz_ConstraintD/result/TaylorF2EccPerAdvFDLeO20Hz_ConstraintD_data0_1187008882-43_analysis_H1L1V1_resume.pickle
06:10 bilby INFO    : Written checkpoint file outdir_TaylorF2EccPerAdvFDLeO20Hz_ConstraintD/result/TaylorF2EccPerAdvFDLeO20Hz_ConstraintD_data0_1187008882-43_analysis_H1L1V1_resume.pickle
06:14 bilby INFO    : Run interrupted by alarm signal 14: checkpoint and exit on 77
06:14 bilby INFO    : Written checkpoint file outdir_TaylorF2EccPerAdvFDLeO20Hz_ConstraintD/result/TaylorF2EccPerAdvFDLeO20Hz_ConstraintD_data0_1187008882-43_analysis_H1L1V1_resume.pickle
06:14 bilby INFO    : Starting to close worker pool.
06:17 bilby INFO    : Finished closing worker pool.
06:17 bilby_pipe INFO    : Running bilby_pipe version: 1.0.6: (CLEAN) 76a4ef2 2022-04-26 12:39:06 +0100
06:17 bilby_pipe INFO    : Running bilby: 1.1.5: (UNCLEAN) f699675c 2022-05-29 02:12:11 +0000
06:17 bilby_pipe INFO    : Command line arguments: Namespace(ini='TaylorF2EccPerAdvFDLeO20Hz_ConstraintD_config_complete.ini', verbose=False, calibration_model=None, spline_calibration_envelope_dict=None, spline_calibration_nodes=10, spline_calibration_amplitude_uncertainty_dict=None, spline_calibration_phase_uncertainty_dict=None, calibration_prior_boundary='reflective', idx=0, data_dump_file='outdir_TaylorF2EccPerAdvFDLeO20Hz_ConstraintD/data/TaylorF2EccPerAdvFDLeO20Hz_ConstraintD_data0_1187008882-43_generation_data_dump.pickle', ignore_gwpy_data_quality_check=True, gps_tuple=None, gps_file=None, timeslide_file=None, timeslide_dict=None, trigger_time='1187008882.43', n_simulation=1, data_dict='{H1:H1_CLN.txt, L1:L1_CLN.txt,  V1:V1_CLN.txt}', data_format=None, allow_tape=True, channel_dict='{H1:H1, L1:L1, V1:V1}', gaussian_noise=False, zero_noise=False, coherence_test=False, detectors=['H1', 'L1', 'V1'], duration=263.0, generation_seed=None, psd_dict=None, psd_fractional_overlap=0.5, post_trigger_duration=1.0, sampling_frequency=512.0, psd_length=32, psd_maximum_duration=1024, psd_method='median', psd_start_time=None, maximum_frequency='256.', minimum_frequency='20.', tukey_roll_off=0.4, resampling_method='lal', injection=False, injection_dict=None, injection_file=None, injection_numbers=[None], injection_waveform_approximant=None, injection_waveform_arguments=None, accounting='ligo.dev.o3.cbc.pe.lalinference', accounting_user=None, label='TaylorF2EccPerAdvFDLeO20Hz_ConstraintD_data0_1187008882-43_analysis_H1L1V1', local=False, local_generation=False, local_plot=False, outdir='outdir_TaylorF2EccPerAdvFDLeO20Hz_ConstraintD', overwrite_outdir=False, periodic_restart_time=28800, request_disk=1.0, request_memory=4.0, request_memory_generation=None, request_cpus=16, conda_env=None, scheduler='condor', scheduler_args=None, scheduler_module=[None], scheduler_env=None, scheduler_analysis_time='7-00:00:00', submit=False, condor_job_priority=0, transfer_files=True, log_directory=None, online_pe=False, osg=False, desired_sites=None, analysis_executable=None, analysis_executable_parser=None, distance_marginalization=False, distance_marginalization_lookup_table=None, phase_marginalization=True, time_marginalization=True, jitter_time=True, reference_frame='sky', time_reference='geocent', likelihood_type='GravitationalWaveTransient', roq_folder=None, roq_weights=None, roq_scale_factor=1.0, extra_likelihood_kwargs=None, plot_trace=False, plot_data=False, plot_injection=False, plot_spectrogram=False, plot_calibration=False, plot_corner=False, plot_marginal=False, plot_skymap=False, plot_waveform=False, plot_format='png', create_summary=False, email=None, notification='Never', existing_dir=None, webdir=None, summarypages_arguments=None, result_format='hdf5', final_result=True, final_result_nsamples=20000, default_prior='BBHPriorDict', deltaT=0.2, prior_file=None, prior_dict="{mass-1: Constraint(name='mass_1', minimum=1.1,maximum=2.0), mass_2 = Constraint(name='mass_2', minimum=1.1,maximum=2.0), chirp_mass = Uniform(name='chirp_mass', minimum=0.9576056196257366,maximum=1.7411011265922482), mass_ratio = Uniform(name='mass_ratio', minimum=0.55, maximum=1.), eccentricity = Uniform(name='e0', minimum=0.0, maximum=0.1), luminosity-distance: 40.7, theta_jn = Sine(name='theta_jn'), psi =  Uniform(name='psi', minimum=0, maximum=6.283185307179586), phase = Uniform(name='phase', minimum=0, maximum=6.283185307179586), geocent_time = Uniform(1187008882.33, 1187008882.53, name='geocent_time', unit='s'), ra = 3.44615914, dec =  -0.40808407, }", enforce_signal_duration=True, postprocessing_executable=None, postprocessing_arguments=None, single_postprocessing_executable=None, single_postprocessing_arguments=None, sampler='dynesty', sampling_seed=None, n_parallel=1, sampler_kwargs="{'nlive': 500, 'walks': 100, 'check_point_plot': True, 'check_point_delta_t': 1800, 'print_method': 'interval-60', 'npool': 16}", waveform_generator='bilby.gw.waveform_generator.WaveformGenerator', reference_frequency=30.0, waveform_approximant='TaylorF2EccPerAdvFDLeO', catch_waveform_errors=True, pn_spin_order=-1, pn_tidal_order=-1, pn_phase_order=-1, pn_amplitude_order=0, numerical_relativity_file=None, waveform_arguments_dict=None, mode_array=[None], frequency_domain_source_model='lal_TaylorF2EccPerAdvFDLeO', conversion_function=None, generation_function=None)
06:17 bilby_pipe INFO    : Unknown command line arguments: []
06:17 bilby_pipe INFO    : Sampling seed set to 16647
06:17 bilby_pipe INFO    : No calibration_model model provided, calibration marginalization will not be used
06:17 bilby_pipe INFO    : Found data for detectors = ['H1', 'L1', 'V1']
06:17 bilby_pipe INFO    : Using data for detectors = ['H1', 'L1', 'V1']
06:17 bilby_pipe INFO    : H1: sampling-frequency=512.0, segment-start-time=1187008620.4299316, duration=263.0
06:17 bilby_pipe INFO    : L1: sampling-frequency=512.0, segment-start-time=1187008620.4299316, duration=263.0
06:17 bilby_pipe INFO    : V1: sampling-frequency=512.0, segment-start-time=1187008620.4299316, duration=263.0
06:17 bilby_pipe INFO    : Using the lal_TaylorF2EccPerAdvFDLeO source model
06:17 bilby_pipe INFO    : No conversion function
06:17 bilby INFO    : Waveform generator initiated with
  frequency_domain_source_model: bilby.gw.source.lal_TaylorF2EccPerAdvFDLeO
  time_domain_source_model: None
  parameter_conversion: bilby.gw.conversion.convert_to_lal_binary_black_hole_parameters
06:17 bilby_pipe INFO    : No conversion function
06:17 bilby INFO    : Running for label 'TaylorF2EccPerAdvFDLeO20Hz_ConstraintD_data0_1187008882-43_analysis_H1L1V1', output will be saved to 'outdir_TaylorF2EccPerAdvFDLeO20Hz_ConstraintD/result'
06:17 bilby INFO    : Using lal version 7.1.7.1
06:17 bilby INFO    : Using lal git version Branch: master;Tag: None;Id: 7eef7079ec7a112132bd11eb292c5535d2ebf6b2;;Builder: Unknown User <>;Repository status: UNCLEAN: Modified working tree
06:17 bilby INFO    : Using lalsimulation version 3.1.2.1
06:17 bilby INFO    : Using lalsimulation git version Branch: master;Tag: None;Id: 7eef7079ec7a112132bd11eb292c5535d2ebf6b2;;Builder: Unknown User <>;Repository status: UNCLEAN: Modified working tree
06:17 bilby INFO    : Search parameters:
06:17 bilby INFO    :   chirp_mass = Uniform(minimum=0.9576056196257366, maximum=1.7411011265922482, name='chirp_mass', latex_label='$\\mathcal{M}$', unit=None, boundary=None)
06:17 bilby INFO    :   mass_ratio = Uniform(minimum=0.55, maximum=1.0, name='mass_ratio', latex_label='$q$', unit=None, boundary=None)
06:17 bilby INFO    :   eccentricity = Uniform(minimum=0.0, maximum=0.1, name='e0', latex_label='e0', unit=None, boundary=None)
06:17 bilby INFO    :   theta_jn = Sine(minimum=0, maximum=3.141592653589793, name='theta_jn', latex_label='$\\theta_{JN}$', unit=None, boundary=None)
06:17 bilby INFO    :   psi = Uniform(minimum=0, maximum=6.283185307179586, name='psi', latex_label='$\\psi$', unit=None, boundary=None)
06:17 bilby INFO    :   time_jitter = Uniform(minimum=-0.001953125, maximum=0.001953125, name='time_jitter', latex_label='$t_j$', unit=None, boundary='periodic')
06:17 bilby INFO    :   mass_1 = Constraint(minimum=1.1, maximum=2.0, name='mass_1', latex_label='$m_1$', unit=None)
06:17 bilby INFO    :   mass_2 = Constraint(minimum=1.1, maximum=2.0, name='mass_2', latex_label='$m_2$', unit=None)
06:17 bilby INFO    :   luminosity_distance = 40.7
06:17 bilby INFO    :   phase = 0.0
06:17 bilby INFO    :   geocent_time = 1187008620.4299316
06:17 bilby INFO    :   ra = 3.44615914
06:17 bilby INFO    :   dec = -0.40808407
06:17 bilby INFO    : Generating frequency domain strain from given time domain strain.
06:17 bilby INFO    : Applying a tukey window with alpha=0.0030418250950570345, roll off=0.4
06:17 bilby INFO    : Generating frequency domain strain from given time domain strain.
06:17 bilby INFO    : Applying a tukey window with alpha=0.0030418250950570345, roll off=0.4
06:17 bilby INFO    : Generating frequency domain strain from given time domain strain.
06:17 bilby INFO    : Applying a tukey window with alpha=0.0030418250950570345, roll off=0.4
06:18 bilby INFO    : Single likelihood evaluation took 5.968e-01 s
06:18 bilby INFO    : Using sampler Dynesty with kwargs {'bound': 'multi', 'sample': 'rwalk', 'periodic': None, 'reflective': None, 'check_point_delta_t': 1800, 'nlive': 500, 'first_update': None, 'walks': 100, 'npdim': None, 'rstate': None, 'queue_size': 16, 'pool': None, 'use_pool': None, 'live_points': None, 'logl_args': None, 'logl_kwargs': None, 'ptform_args': None, 'ptform_kwargs': None, 'enlarge': 1.5, 'bootstrap': None, 'vol_dec': 0.5, 'vol_check': 8.0, 'facc': 0.2, 'slices': 5, 'update_interval': 300, 'print_func': <bound method Dynesty._print_func of <bilby.core.sampler.dynesty.Dynesty object at 0x2ad861327c40>>, 'dlogz': 0.1, 'maxiter': None, 'maxcall': None, 'logl_max': inf, 'add_live': True, 'print_progress': True, 'save_bounds': False, 'n_effective': None, 'maxmcmc': 5000, 'nact': 5, 'print_method': 'interval-60'}
06:18 bilby INFO    : Checkpoint every check_point_delta_t = 1800s
06:18 bilby INFO    : Using dynesty version 1.0.1
06:18 bilby INFO    : Using the bilby-implemented rwalk sample method with ACT estimated walks
06:18 bilby INFO    : Setting up multiproccesing pool with 16 processes.
06:18 bilby INFO    : Reading resume file outdir_TaylorF2EccPerAdvFDLeO20Hz_ConstraintD/result/TaylorF2EccPerAdvFDLeO20Hz_ConstraintD_data0_1187008882-43_analysis_H1L1V1_resume.pickle
06:18 bilby INFO    : Resume file successfully loaded.
06:45 bilby INFO    : Written checkpoint file outdir_TaylorF2EccPerAdvFDLeO20Hz_ConstraintD/result/TaylorF2EccPerAdvFDLeO20Hz_ConstraintD_data0_1187008882-43_analysis_H1L1V1_resume.pickle
07:16 bilby INFO    : Written checkpoint file outdir_TaylorF2EccPerAdvFDLeO20Hz_ConstraintD/result/TaylorF2EccPerAdvFDLeO20Hz_ConstraintD_data0_1187008882-43_analysis_H1L1V1_resume.pickle
07:48 bilby INFO    : Written checkpoint file outdir_TaylorF2EccPerAdvFDLeO20Hz_ConstraintD/result/TaylorF2EccPerAdvFDLeO20Hz_ConstraintD_data0_1187008882-43_analysis_H1L1V1_resume.pickle
08:19 bilby INFO    : Written checkpoint file outdir_TaylorF2EccPerAdvFDLeO20Hz_ConstraintD/result/TaylorF2EccPerAdvFDLeO20Hz_ConstraintD_data0_1187008882-43_analysis_H1L1V1_resume.pickle
08:52 bilby INFO    : Written checkpoint file outdir_TaylorF2EccPerAdvFDLeO20Hz_ConstraintD/result/TaylorF2EccPerAdvFDLeO20Hz_ConstraintD_data0_1187008882-43_analysis_H1L1V1_resume.pickle
09:25 bilby INFO    : Written checkpoint file outdir_TaylorF2EccPerAdvFDLeO20Hz_ConstraintD/result/TaylorF2EccPerAdvFDLeO20Hz_ConstraintD_data0_1187008882-43_analysis_H1L1V1_resume.pickle
09:59 bilby INFO    : Written checkpoint file outdir_TaylorF2EccPerAdvFDLeO20Hz_ConstraintD/result/TaylorF2EccPerAdvFDLeO20Hz_ConstraintD_data0_1187008882-43_analysis_H1L1V1_resume.pickle
10:32 bilby INFO    : Written checkpoint file outdir_TaylorF2EccPerAdvFDLeO20Hz_ConstraintD/result/TaylorF2EccPerAdvFDLeO20Hz_ConstraintD_data0_1187008882-43_analysis_H1L1V1_resume.pickle
11:02 bilby INFO    : Written checkpoint file outdir_TaylorF2EccPerAdvFDLeO20Hz_ConstraintD/result/TaylorF2EccPerAdvFDLeO20Hz_ConstraintD_data0_1187008882-43_analysis_H1L1V1_resume.pickle
11:35 bilby INFO    : Written checkpoint file outdir_TaylorF2EccPerAdvFDLeO20Hz_ConstraintD/result/TaylorF2EccPerAdvFDLeO20Hz_ConstraintD_data0_1187008882-43_analysis_H1L1V1_resume.pickle
12:10 bilby INFO    : Written checkpoint file outdir_TaylorF2EccPerAdvFDLeO20Hz_ConstraintD/result/TaylorF2EccPerAdvFDLeO20Hz_ConstraintD_data0_1187008882-43_analysis_H1L1V1_resume.pickle
12:42 bilby INFO    : Written checkpoint file outdir_TaylorF2EccPerAdvFDLeO20Hz_ConstraintD/result/TaylorF2EccPerAdvFDLeO20Hz_ConstraintD_data0_1187008882-43_analysis_H1L1V1_resume.pickle
13:15 bilby INFO    : Written checkpoint file outdir_TaylorF2EccPerAdvFDLeO20Hz_ConstraintD/result/TaylorF2EccPerAdvFDLeO20Hz_ConstraintD_data0_1187008882-43_analysis_H1L1V1_resume.pickle
13:50 bilby INFO    : Written checkpoint file outdir_TaylorF2EccPerAdvFDLeO20Hz_ConstraintD/result/TaylorF2EccPerAdvFDLeO20Hz_ConstraintD_data0_1187008882-43_analysis_H1L1V1_resume.pickle
14:17 bilby INFO    : Run interrupted by alarm signal 14: checkpoint and exit on 77
14:17 bilby INFO    : Written checkpoint file outdir_TaylorF2EccPerAdvFDLeO20Hz_ConstraintD/result/TaylorF2EccPerAdvFDLeO20Hz_ConstraintD_data0_1187008882-43_analysis_H1L1V1_resume.pickle
14:17 bilby INFO    : Starting to close worker pool.
14:22 bilby INFO    : Finished closing worker pool.
14:22 bilby_pipe INFO    : Running bilby_pipe version: 1.0.6: (CLEAN) 76a4ef2 2022-04-26 12:39:06 +0100
14:22 bilby_pipe INFO    : Running bilby: 1.1.5: (UNCLEAN) f699675c 2022-05-29 02:12:11 +0000
14:22 bilby_pipe INFO    : Command line arguments: Namespace(ini='TaylorF2EccPerAdvFDLeO20Hz_ConstraintD_config_complete.ini', verbose=False, calibration_model=None, spline_calibration_envelope_dict=None, spline_calibration_nodes=10, spline_calibration_amplitude_uncertainty_dict=None, spline_calibration_phase_uncertainty_dict=None, calibration_prior_boundary='reflective', idx=0, data_dump_file='outdir_TaylorF2EccPerAdvFDLeO20Hz_ConstraintD/data/TaylorF2EccPerAdvFDLeO20Hz_ConstraintD_data0_1187008882-43_generation_data_dump.pickle', ignore_gwpy_data_quality_check=True, gps_tuple=None, gps_file=None, timeslide_file=None, timeslide_dict=None, trigger_time='1187008882.43', n_simulation=1, data_dict='{H1:H1_CLN.txt, L1:L1_CLN.txt,  V1:V1_CLN.txt}', data_format=None, allow_tape=True, channel_dict='{H1:H1, L1:L1, V1:V1}', gaussian_noise=False, zero_noise=False, coherence_test=False, detectors=['H1', 'L1', 'V1'], duration=263.0, generation_seed=None, psd_dict=None, psd_fractional_overlap=0.5, post_trigger_duration=1.0, sampling_frequency=512.0, psd_length=32, psd_maximum_duration=1024, psd_method='median', psd_start_time=None, maximum_frequency='256.', minimum_frequency='20.', tukey_roll_off=0.4, resampling_method='lal', injection=False, injection_dict=None, injection_file=None, injection_numbers=[None], injection_waveform_approximant=None, injection_waveform_arguments=None, accounting='ligo.dev.o3.cbc.pe.lalinference', accounting_user=None, label='TaylorF2EccPerAdvFDLeO20Hz_ConstraintD_data0_1187008882-43_analysis_H1L1V1', local=False, local_generation=False, local_plot=False, outdir='outdir_TaylorF2EccPerAdvFDLeO20Hz_ConstraintD', overwrite_outdir=False, periodic_restart_time=28800, request_disk=1.0, request_memory=4.0, request_memory_generation=None, request_cpus=16, conda_env=None, scheduler='condor', scheduler_args=None, scheduler_module=[None], scheduler_env=None, scheduler_analysis_time='7-00:00:00', submit=False, condor_job_priority=0, transfer_files=True, log_directory=None, online_pe=False, osg=False, desired_sites=None, analysis_executable=None, analysis_executable_parser=None, distance_marginalization=False, distance_marginalization_lookup_table=None, phase_marginalization=True, time_marginalization=True, jitter_time=True, reference_frame='sky', time_reference='geocent', likelihood_type='GravitationalWaveTransient', roq_folder=None, roq_weights=None, roq_scale_factor=1.0, extra_likelihood_kwargs=None, plot_trace=False, plot_data=False, plot_injection=False, plot_spectrogram=False, plot_calibration=False, plot_corner=False, plot_marginal=False, plot_skymap=False, plot_waveform=False, plot_format='png', create_summary=False, email=None, notification='Never', existing_dir=None, webdir=None, summarypages_arguments=None, result_format='hdf5', final_result=True, final_result_nsamples=20000, default_prior='BBHPriorDict', deltaT=0.2, prior_file=None, prior_dict="{mass-1: Constraint(name='mass_1', minimum=1.1,maximum=2.0), mass_2 = Constraint(name='mass_2', minimum=1.1,maximum=2.0), chirp_mass = Uniform(name='chirp_mass', minimum=0.9576056196257366,maximum=1.7411011265922482), mass_ratio = Uniform(name='mass_ratio', minimum=0.55, maximum=1.), eccentricity = Uniform(name='e0', minimum=0.0, maximum=0.1), luminosity-distance: 40.7, theta_jn = Sine(name='theta_jn'), psi =  Uniform(name='psi', minimum=0, maximum=6.283185307179586), phase = Uniform(name='phase', minimum=0, maximum=6.283185307179586), geocent_time = Uniform(1187008882.33, 1187008882.53, name='geocent_time', unit='s'), ra = 3.44615914, dec =  -0.40808407, }", enforce_signal_duration=True, postprocessing_executable=None, postprocessing_arguments=None, single_postprocessing_executable=None, single_postprocessing_arguments=None, sampler='dynesty', sampling_seed=None, n_parallel=1, sampler_kwargs="{'nlive': 500, 'walks': 100, 'check_point_plot': True, 'check_point_delta_t': 1800, 'print_method': 'interval-60', 'npool': 16}", waveform_generator='bilby.gw.waveform_generator.WaveformGenerator', reference_frequency=30.0, waveform_approximant='TaylorF2EccPerAdvFDLeO', catch_waveform_errors=True, pn_spin_order=-1, pn_tidal_order=-1, pn_phase_order=-1, pn_amplitude_order=0, numerical_relativity_file=None, waveform_arguments_dict=None, mode_array=[None], frequency_domain_source_model='lal_TaylorF2EccPerAdvFDLeO', conversion_function=None, generation_function=None)
14:22 bilby_pipe INFO    : Unknown command line arguments: []
14:22 bilby_pipe INFO    : Sampling seed set to 914624
14:22 bilby_pipe INFO    : No calibration_model model provided, calibration marginalization will not be used
14:22 bilby_pipe INFO    : Found data for detectors = ['H1', 'L1', 'V1']
14:22 bilby_pipe INFO    : Using data for detectors = ['H1', 'L1', 'V1']
14:22 bilby_pipe INFO    : H1: sampling-frequency=512.0, segment-start-time=1187008620.4299316, duration=263.0
14:22 bilby_pipe INFO    : L1: sampling-frequency=512.0, segment-start-time=1187008620.4299316, duration=263.0
14:22 bilby_pipe INFO    : V1: sampling-frequency=512.0, segment-start-time=1187008620.4299316, duration=263.0
14:22 bilby_pipe INFO    : Using the lal_TaylorF2EccPerAdvFDLeO source model
14:22 bilby_pipe INFO    : No conversion function
14:22 bilby INFO    : Waveform generator initiated with
  frequency_domain_source_model: bilby.gw.source.lal_TaylorF2EccPerAdvFDLeO
  time_domain_source_model: None
  parameter_conversion: bilby.gw.conversion.convert_to_lal_binary_black_hole_parameters
14:22 bilby_pipe INFO    : No conversion function
14:22 bilby INFO    : Running for label 'TaylorF2EccPerAdvFDLeO20Hz_ConstraintD_data0_1187008882-43_analysis_H1L1V1', output will be saved to 'outdir_TaylorF2EccPerAdvFDLeO20Hz_ConstraintD/result'
14:22 bilby INFO    : Using lal version 7.1.7.1
14:22 bilby INFO    : Using lal git version Branch: master;Tag: None;Id: 7eef7079ec7a112132bd11eb292c5535d2ebf6b2;;Builder: Unknown User <>;Repository status: UNCLEAN: Modified working tree
14:22 bilby INFO    : Using lalsimulation version 3.1.2.1
14:22 bilby INFO    : Using lalsimulation git version Branch: master;Tag: None;Id: 7eef7079ec7a112132bd11eb292c5535d2ebf6b2;;Builder: Unknown User <>;Repository status: UNCLEAN: Modified working tree
14:22 bilby INFO    : Search parameters:
14:22 bilby INFO    :   chirp_mass = Uniform(minimum=0.9576056196257366, maximum=1.7411011265922482, name='chirp_mass', latex_label='$\\mathcal{M}$', unit=None, boundary=None)
14:22 bilby INFO    :   mass_ratio = Uniform(minimum=0.55, maximum=1.0, name='mass_ratio', latex_label='$q$', unit=None, boundary=None)
14:22 bilby INFO    :   eccentricity = Uniform(minimum=0.0, maximum=0.1, name='e0', latex_label='e0', unit=None, boundary=None)
14:22 bilby INFO    :   theta_jn = Sine(minimum=0, maximum=3.141592653589793, name='theta_jn', latex_label='$\\theta_{JN}$', unit=None, boundary=None)
14:22 bilby INFO    :   psi = Uniform(minimum=0, maximum=6.283185307179586, name='psi', latex_label='$\\psi$', unit=None, boundary=None)
14:22 bilby INFO    :   time_jitter = Uniform(minimum=-0.001953125, maximum=0.001953125, name='time_jitter', latex_label='$t_j$', unit=None, boundary='periodic')
14:22 bilby INFO    :   mass_1 = Constraint(minimum=1.1, maximum=2.0, name='mass_1', latex_label='$m_1$', unit=None)
14:22 bilby INFO    :   mass_2 = Constraint(minimum=1.1, maximum=2.0, name='mass_2', latex_label='$m_2$', unit=None)
14:22 bilby INFO    :   luminosity_distance = 40.7
14:22 bilby INFO    :   phase = 0.0
14:22 bilby INFO    :   geocent_time = 1187008620.4299316
14:22 bilby INFO    :   ra = 3.44615914
14:22 bilby INFO    :   dec = -0.40808407
14:22 bilby INFO    : Generating frequency domain strain from given time domain strain.
14:22 bilby INFO    : Applying a tukey window with alpha=0.0030418250950570345, roll off=0.4
14:22 bilby INFO    : Generating frequency domain strain from given time domain strain.
14:22 bilby INFO    : Applying a tukey window with alpha=0.0030418250950570345, roll off=0.4
14:22 bilby INFO    : Generating frequency domain strain from given time domain strain.
14:22 bilby INFO    : Applying a tukey window with alpha=0.0030418250950570345, roll off=0.4
14:23 bilby INFO    : Single likelihood evaluation took 6.083e-01 s
14:23 bilby INFO    : Using sampler Dynesty with kwargs {'bound': 'multi', 'sample': 'rwalk', 'periodic': None, 'reflective': None, 'check_point_delta_t': 1800, 'nlive': 500, 'first_update': None, 'walks': 100, 'npdim': None, 'rstate': None, 'queue_size': 16, 'pool': None, 'use_pool': None, 'live_points': None, 'logl_args': None, 'logl_kwargs': None, 'ptform_args': None, 'ptform_kwargs': None, 'enlarge': 1.5, 'bootstrap': None, 'vol_dec': 0.5, 'vol_check': 8.0, 'facc': 0.2, 'slices': 5, 'update_interval': 300, 'print_func': <bound method Dynesty._print_func of <bilby.core.sampler.dynesty.Dynesty object at 0x2b2ed82bbc40>>, 'dlogz': 0.1, 'maxiter': None, 'maxcall': None, 'logl_max': inf, 'add_live': True, 'print_progress': True, 'save_bounds': False, 'n_effective': None, 'maxmcmc': 5000, 'nact': 5, 'print_method': 'interval-60'}
14:23 bilby INFO    : Checkpoint every check_point_delta_t = 1800s
14:23 bilby INFO    : Using dynesty version 1.0.1
14:23 bilby INFO    : Using the bilby-implemented rwalk sample method with ACT estimated walks
14:23 bilby INFO    : Setting up multiproccesing pool with 16 processes.
14:23 bilby INFO    : Reading resume file outdir_TaylorF2EccPerAdvFDLeO20Hz_ConstraintD/result/TaylorF2EccPerAdvFDLeO20Hz_ConstraintD_data0_1187008882-43_analysis_H1L1V1_resume.pickle
14:23 bilby INFO    : Resume file successfully loaded.
