10:57 bilby_pipe INFO    : Running bilby_pipe version: 1.0.6: (CLEAN) 76a4ef2 2022-04-26 12:39:06 +0100
10:57 bilby_pipe INFO    : Running bilby: 1.1.4: (UNCLEAN) 51d1f35 2022-05-05 11:06:10 -0700
10:57 bilby_pipe INFO    : Command line arguments: Namespace(ini='outdir_TaylorF2EccFD20Hz/TaylorF2EccFD20Hz_config_complete.ini', verbose=False, calibration_model=None, spline_calibration_envelope_dict=None, spline_calibration_nodes=10, spline_calibration_amplitude_uncertainty_dict=None, spline_calibration_phase_uncertainty_dict=None, calibration_prior_boundary='reflective', idx=0, data_dump_file=None, ignore_gwpy_data_quality_check=True, gps_tuple=None, gps_file=None, timeslide_file=None, timeslide_dict=None, trigger_time='1187008882.43', n_simulation=1, data_dict=None, data_format=None, allow_tape=True, channel_dict='{H1:GWOSC, L1:GWOSC, V1:GWOSC}', gaussian_noise=False, zero_noise=False, coherence_test=False, detectors=['H1', 'L1', 'V1'], duration=309.0, generation_seed=None, psd_dict=None, psd_fractional_overlap=0.5, post_trigger_duration=1.0, sampling_frequency=512.0, psd_length=32, psd_maximum_duration=1024, psd_method='median', psd_start_time=None, maximum_frequency='256.', minimum_frequency='20.', tukey_roll_off=0.4, resampling_method='lal', injection=False, injection_dict=None, injection_file=None, injection_numbers=[None], injection_waveform_approximant=None, injection_waveform_arguments=None, accounting='ligo.dev.o3.cbc.pe.lalinference', accounting_user=None, label='TaylorF2EccFD20Hz_data0_1187008882-43_generation', local=False, local_generation=False, local_plot=False, outdir='/home/hemantakumar.phurailatpam/eccn3pn/test/realGW170817/outdir_TaylorF2EccFD20Hz', overwrite_outdir=False, periodic_restart_time=28800, request_disk=1.0, request_memory=4.0, request_memory_generation=None, request_cpus=8, conda_env=None, scheduler='condor', scheduler_args=None, scheduler_module=[None], scheduler_env=None, scheduler_analysis_time='7-00:00:00', submit=False, condor_job_priority=0, transfer_files=True, log_directory=None, online_pe=False, osg=False, desired_sites=None, analysis_executable=None, analysis_executable_parser=None, distance_marginalization=False, distance_marginalization_lookup_table=None, phase_marginalization=True, time_marginalization=True, jitter_time=True, reference_frame='sky', time_reference='geocent', likelihood_type='GravitationalWaveTransient', roq_folder=None, roq_weights=None, roq_scale_factor=1.0, extra_likelihood_kwargs=None, plot_trace=False, plot_data=False, plot_injection=False, plot_spectrogram=False, plot_calibration=False, plot_corner=False, plot_marginal=False, plot_skymap=False, plot_waveform=False, plot_format='png', create_summary=False, email=None, notification='Never', existing_dir=None, webdir=None, summarypages_arguments=None, result_format='hdf5', final_result=True, final_result_nsamples=20000, default_prior='BBHPriorDict', deltaT=0.2, prior_file=None, prior_dict="{chirp-mass: Uniform(name='chirp_mass', minimum=0.8705505632961241,maximum=2.611651689888372), mass_ratio = Uniform(name='mass_ratio', minimum=0.3333333333333333, maximum=1), eccentricity = Uniform(name='e0', minimum=0.0, maximum=0.1), luminosity_distance = 40.7, a_1 = Uniform(name='a_1', minimum=-0.5, maximum=0.5), a_2 = Uniform(name='a_1', minimum=-0.5, maximum=0.5), theta_jn = Sine(name='theta_jn'), psi =  Uniform(name='psi', minimum=0, maximum=3.141592653589793), phase = Uniform(name='phase', minimum=0, maximum=6.283185307179586), geocent_time = Uniform(1187008882.33, 1187008882.53, name='geocent_time', unit='s'), ra = 3.44615914, dec =  -0.40808407, }", enforce_signal_duration=True, postprocessing_executable=None, postprocessing_arguments=None, single_postprocessing_executable=None, single_postprocessing_arguments=None, sampler='dynesty', sampling_seed=None, n_parallel=1, sampler_kwargs="{'nlive': 500, 'walks': 100, 'check_point_plot': True, 'check_point_delta_t': 1800, 'print_method': 'interval-60', 'npool': 8}", waveform_generator='bilby.gw.waveform_generator.WaveformGenerator', reference_frequency=30.0, waveform_approximant='TaylorF2Ecc', catch_waveform_errors=True, pn_spin_order=-1, pn_tidal_order=-1, pn_phase_order=-1, pn_amplitude_order=0, numerical_relativity_file=None, waveform_arguments_dict=None, mode_array=[None], frequency_domain_source_model='lal_taylorF2Ecc_fd', conversion_function=None, generation_function=None)
10:57 bilby_pipe INFO    : Unknown command line arguments: []
10:57 bilby_pipe INFO    : Generation seed set to 764293
10:57 bilby_pipe INFO    : Setting trigger time 1187008882.43
10:57 bilby_pipe INFO    : Setting prior-file to None
10:57 bilby_pipe INFO    : Setting segment duration 309.0s
10:57 bilby_pipe INFO    : Requested PSD duration 9888.0=32x309.0 exceeds allowed maximum 1024. Setting psd_duration = 1024
10:57 bilby_pipe INFO    : No calibration_model model provided, calibration marginalization will not be used
10:57 bilby_pipe INFO    : Setting PSD for H1 from data
10:57 bilby_pipe INFO    : Using default PSD start time -1024 relative to start time
10:57 bilby_pipe INFO    : Getting psd-segment data for H1
10:57 bilby_pipe INFO    : Attempting to download data from GWOSC
10:57 bilby_pipe INFO    : Calling TimeSeries.fetch_open_data('H1', start=1187007550.43, end=1187008574.43)
10:57 bilby_pipe INFO    : Resampling data to sampling_frequency 512.0 using lal
10:57 bilby_pipe INFO    : PSD settings: window=Tukey, Tukey-alpha=0.0025889967637540453 roll-off=0.4, overlap=154.5, method=median
10:57 bilby_pipe INFO    : Getting analysis-segment data for H1
10:57 bilby_pipe INFO    : Attempting to download data from GWOSC
10:57 bilby_pipe INFO    : Calling TimeSeries.fetch_open_data('H1', start=1187008574.43, end=1187008883.43)
10:57 bilby_pipe INFO    : Resampling data to sampling_frequency 512.0 using lal
10:57 bilby_pipe INFO    : Setting PSD for L1 from data
10:57 bilby_pipe INFO    : Using default PSD start time -1024 relative to start time
10:57 bilby_pipe INFO    : Getting psd-segment data for L1
10:57 bilby_pipe INFO    : Attempting to download data from GWOSC
10:57 bilby_pipe INFO    : Calling TimeSeries.fetch_open_data('L1', start=1187007550.43, end=1187008574.43)
10:57 bilby_pipe INFO    : Resampling data to sampling_frequency 512.0 using lal
10:57 bilby_pipe INFO    : PSD settings: window=Tukey, Tukey-alpha=0.0025889967637540453 roll-off=0.4, overlap=154.5, method=median
10:57 bilby_pipe INFO    : Getting analysis-segment data for L1
10:57 bilby_pipe INFO    : Attempting to download data from GWOSC
10:57 bilby_pipe INFO    : Calling TimeSeries.fetch_open_data('L1', start=1187008574.43, end=1187008883.43)
10:57 bilby_pipe INFO    : Resampling data to sampling_frequency 512.0 using lal
10:57 bilby_pipe INFO    : Setting PSD for V1 from data
10:57 bilby_pipe INFO    : Using default PSD start time -1024 relative to start time
10:57 bilby_pipe INFO    : Getting psd-segment data for V1
10:57 bilby_pipe INFO    : Attempting to download data from GWOSC
10:57 bilby_pipe INFO    : Calling TimeSeries.fetch_open_data('V1', start=1187007550.43, end=1187008574.43)
10:57 bilby_pipe INFO    : Resampling data to sampling_frequency 512.0 using lal
10:57 bilby_pipe INFO    : PSD settings: window=Tukey, Tukey-alpha=0.0025889967637540453 roll-off=0.4, overlap=154.5, method=median
10:57 bilby_pipe INFO    : Getting analysis-segment data for V1
10:57 bilby_pipe INFO    : Attempting to download data from GWOSC
10:57 bilby_pipe INFO    : Calling TimeSeries.fetch_open_data('V1', start=1187008574.43, end=1187008883.43)
10:57 bilby_pipe INFO    : Resampling data to sampling_frequency 512.0 using lal
10:57 bilby INFO    : Generation of spin parameters failed with message 'spin_1z'
10:57 bilby_pipe INFO    : Using the lal_taylorF2Ecc_fd source model
10:57 bilby INFO    : Waveform generator initiated with
  frequency_domain_source_model: bilby.gw.source.lal_taylorF2Ecc_fd
  time_domain_source_model: None
  parameter_conversion: bilby.gw.conversion.convert_to_lal_binary_black_hole_parameters
10:57 bilby_pipe INFO    : Completed data generation
