10:36 bilby_pipe INFO    : Running bilby_pipe version: 1.0.6: (CLEAN) 76a4ef2 2022-04-26 12:39:06 +0100
10:36 bilby_pipe INFO    : Running bilby: 1.1.5: (UNCLEAN) f699675c 2022-05-29 02:12:11 +0000
10:36 bilby_pipe INFO    : Command line arguments: Namespace(ini='TaylorF2EccFD20Hz_1024HzSpinFixed_config_complete.ini', verbose=False, calibration_model=None, spline_calibration_envelope_dict=None, spline_calibration_nodes=10, spline_calibration_amplitude_uncertainty_dict=None, spline_calibration_phase_uncertainty_dict=None, calibration_prior_boundary='reflective', idx=0, data_dump_file='outdir_TaylorF2EccFD20Hz_1024HzSpinFixed/data/TaylorF2EccFD20Hz_1024HzSpinFixed_data0_1187008882-43_generation_data_dump.pickle', ignore_gwpy_data_quality_check=True, gps_tuple=None, gps_file=None, timeslide_file=None, timeslide_dict=None, trigger_time='1187008882.43', n_simulation=1, data_dict='{H1:H1_CLN.txt, L1:L1_CLN.txt,  V1:V1_CLN.txt}', data_format=None, allow_tape=True, channel_dict='{H1:H1, L1:L1, V1:V1}', gaussian_noise=False, zero_noise=False, coherence_test=False, detectors=['H1', 'L1', 'V1'], duration=309.0, generation_seed=None, psd_dict=None, psd_fractional_overlap=0.5, post_trigger_duration=1.0, sampling_frequency=1024.0, psd_length=32, psd_maximum_duration=1024, psd_method='median', psd_start_time=None, maximum_frequency='512.', minimum_frequency='20.', tukey_roll_off=0.4, resampling_method='lal', injection=False, injection_dict=None, injection_file=None, injection_numbers=[None], injection_waveform_approximant=None, injection_waveform_arguments=None, accounting='ligo.dev.o3.cbc.pe.lalinference', accounting_user=None, label='TaylorF2EccFD20Hz_1024HzSpinFixed_data0_1187008882-43_analysis_H1L1V1', local=False, local_generation=False, local_plot=False, outdir='outdir_TaylorF2EccFD20Hz_1024HzSpinFixed', overwrite_outdir=False, periodic_restart_time=28800, request_disk=1.0, request_memory=4.0, request_memory_generation=None, request_cpus=16, conda_env=None, scheduler='condor', scheduler_args=None, scheduler_module=[None], scheduler_env=None, scheduler_analysis_time='7-00:00:00', submit=False, condor_job_priority=0, transfer_files=True, log_directory=None, online_pe=False, osg=False, desired_sites=None, analysis_executable=None, analysis_executable_parser=None, distance_marginalization=False, distance_marginalization_lookup_table=None, phase_marginalization=True, time_marginalization=True, jitter_time=True, reference_frame='sky', time_reference='geocent', likelihood_type='GravitationalWaveTransient', roq_folder=None, roq_weights=None, roq_scale_factor=1.0, extra_likelihood_kwargs=None, plot_trace=False, plot_data=False, plot_injection=False, plot_spectrogram=False, plot_calibration=False, plot_corner=False, plot_marginal=False, plot_skymap=False, plot_waveform=False, plot_format='png', create_summary=False, email=None, notification='Never', existing_dir=None, webdir=None, summarypages_arguments=None, result_format='hdf5', final_result=True, final_result_nsamples=20000, default_prior='BBHPriorDict', deltaT=0.2, prior_file=None, prior_dict="{mass-1: Constraint(name='mass_1', minimum=1.0,maximum=2.0), mass_2 = Constraint(name='mass_2', minimum=1.0,maximum=2.0), chirp_mass = Uniform(name='chirp_mass', minimum=0.8705505632961241,maximum=1.7411011265922482), mass_ratio = Uniform(name='mass_ratio', minimum=0.5, maximum=1.), eccentricity = Uniform(name='e0', minimum=0.0, maximum=0.1), luminosity-distance: Gaussian(mu=40.7, sigma=5.57, name='luminosity_distance', unit='Mpc', boundary='reflective'), a-1: 0., a_2 = 0., theta-jn: Sine(name='theta_jn'), psi =  Uniform(name='psi', minimum=0, maximum=6.283185307179586), phase = Uniform(name='phase', minimum=0, maximum=6.283185307179586), geocent_time = Uniform(1187008882.33, 1187008882.53, name='geocent_time', unit='s'), ra = 3.44615914, dec =  -0.40808407, }", enforce_signal_duration=True, postprocessing_executable=None, postprocessing_arguments=None, single_postprocessing_executable=None, single_postprocessing_arguments=None, sampler='dynesty', sampling_seed=None, n_parallel=1, sampler_kwargs="{'nlive': 500, 'walks': 100, 'check_point_plot': True, 'check_point_delta_t': 1800, 'print_method': 'interval-60', 'npool': 16}", waveform_generator='bilby.gw.waveform_generator.WaveformGenerator', reference_frequency=30.0, waveform_approximant='TaylorF2Ecc', catch_waveform_errors=True, pn_spin_order=-1, pn_tidal_order=-1, pn_phase_order=-1, pn_amplitude_order=0, numerical_relativity_file=None, waveform_arguments_dict=None, mode_array=[None], frequency_domain_source_model='lal_taylorF2Ecc_fd', conversion_function=None, generation_function=None)
10:36 bilby_pipe INFO    : Unknown command line arguments: []
10:36 bilby_pipe INFO    : Sampling seed set to 421443
10:36 bilby_pipe INFO    : No calibration_model model provided, calibration marginalization will not be used
10:36 bilby_pipe INFO    : Found data for detectors = ['H1', 'L1', 'V1']
10:36 bilby_pipe INFO    : Using data for detectors = ['H1', 'L1', 'V1']
10:36 bilby_pipe INFO    : H1: sampling-frequency=1024.0, segment-start-time=1187008574.4299316, duration=309.0
10:36 bilby_pipe INFO    : L1: sampling-frequency=1024.0, segment-start-time=1187008574.4299316, duration=309.0
10:36 bilby_pipe INFO    : V1: sampling-frequency=1024.0, segment-start-time=1187008574.4299316, duration=309.0
10:36 bilby_pipe INFO    : Using the lal_taylorF2Ecc_fd source model
10:36 bilby_pipe INFO    : No conversion function
10:36 bilby INFO    : Waveform generator initiated with
  frequency_domain_source_model: bilby.gw.source.lal_taylorF2Ecc_fd
  time_domain_source_model: None
  parameter_conversion: bilby.gw.conversion.convert_to_lal_binary_black_hole_parameters
10:36 bilby_pipe INFO    : No conversion function
10:36 bilby INFO    : Running for label 'TaylorF2EccFD20Hz_1024HzSpinFixed_data0_1187008882-43_analysis_H1L1V1', output will be saved to 'outdir_TaylorF2EccFD20Hz_1024HzSpinFixed/result'
10:36 bilby INFO    : Using lal version 7.1.7.1
10:36 bilby INFO    : Using lal git version Branch: master;Tag: None;Id: 7eef7079ec7a112132bd11eb292c5535d2ebf6b2;;Builder: Unknown User <>;Repository status: UNCLEAN: Modified working tree
10:36 bilby INFO    : Using lalsimulation version 3.1.2.1
10:36 bilby INFO    : Using lalsimulation git version Branch: master;Tag: None;Id: 7eef7079ec7a112132bd11eb292c5535d2ebf6b2;;Builder: Unknown User <>;Repository status: UNCLEAN: Modified working tree
10:36 bilby INFO    : Search parameters:
10:36 bilby INFO    :   chirp_mass = Uniform(minimum=0.8705505632961241, maximum=1.7411011265922482, name='chirp_mass', latex_label='$\\mathcal{M}$', unit=None, boundary=None)
10:36 bilby INFO    :   mass_ratio = Uniform(minimum=0.5, maximum=1.0, name='mass_ratio', latex_label='$q$', unit=None, boundary=None)
10:36 bilby INFO    :   eccentricity = Uniform(minimum=0.0, maximum=0.1, name='e0', latex_label='e0', unit=None, boundary=None)
10:36 bilby INFO    :   luminosity_distance = Gaussian(mu=40.7, sigma=5.57, name='luminosity_distance', latex_label='$d_L$', unit='Mpc', boundary='reflective')
10:36 bilby INFO    :   theta_jn = Sine(minimum=0, maximum=3.141592653589793, name='theta_jn', latex_label='$\\theta_{JN}$', unit=None, boundary=None)
10:36 bilby INFO    :   psi = Uniform(minimum=0, maximum=6.283185307179586, name='psi', latex_label='$\\psi$', unit=None, boundary=None)
10:36 bilby INFO    :   time_jitter = Uniform(minimum=-0.0009765625, maximum=0.0009765625, name='time_jitter', latex_label='$t_j$', unit=None, boundary='periodic')
10:36 bilby INFO    :   mass_1 = Constraint(minimum=1.0, maximum=2.0, name='mass_1', latex_label='$m_1$', unit=None)
10:36 bilby INFO    :   mass_2 = Constraint(minimum=1.0, maximum=2.0, name='mass_2', latex_label='$m_2$', unit=None)
10:36 bilby INFO    :   a_1 = 0.0
10:36 bilby INFO    :   a_2 = 0.0
10:36 bilby INFO    :   phase = 0.0
10:36 bilby INFO    :   geocent_time = 1187008574.4299316
10:36 bilby INFO    :   ra = 3.44615914
10:36 bilby INFO    :   dec = -0.40808407
10:36 bilby INFO    : Generating frequency domain strain from given time domain strain.
10:36 bilby INFO    : Applying a tukey window with alpha=0.0025889967637540453, roll off=0.4
10:36 bilby INFO    : Generating frequency domain strain from given time domain strain.
10:36 bilby INFO    : Applying a tukey window with alpha=0.0025889967637540453, roll off=0.4
10:36 bilby INFO    : Generating frequency domain strain from given time domain strain.
10:36 bilby INFO    : Applying a tukey window with alpha=0.0025889967637540453, roll off=0.4
10:36 bilby INFO    : Single likelihood evaluation took 2.211e-01 s
10:36 bilby INFO    : Using sampler Dynesty with kwargs {'bound': 'multi', 'sample': 'rwalk', 'periodic': None, 'reflective': None, 'check_point_delta_t': 1800, 'nlive': 500, 'first_update': None, 'walks': 100, 'npdim': None, 'rstate': None, 'queue_size': 16, 'pool': None, 'use_pool': None, 'live_points': None, 'logl_args': None, 'logl_kwargs': None, 'ptform_args': None, 'ptform_kwargs': None, 'enlarge': 1.5, 'bootstrap': None, 'vol_dec': 0.5, 'vol_check': 8.0, 'facc': 0.2, 'slices': 5, 'update_interval': 300, 'print_func': <bound method Dynesty._print_func of <bilby.core.sampler.dynesty.Dynesty object at 0x2b56b078fa90>>, 'dlogz': 0.1, 'maxiter': None, 'maxcall': None, 'logl_max': inf, 'add_live': True, 'print_progress': True, 'save_bounds': False, 'n_effective': None, 'maxmcmc': 5000, 'nact': 5, 'print_method': 'interval-60'}
10:36 bilby INFO    : Checkpoint every check_point_delta_t = 1800s
10:36 bilby INFO    : Using dynesty version 1.0.1
10:36 bilby INFO    : Using the bilby-implemented rwalk sample method with ACT estimated walks
10:36 bilby INFO    : Setting up multiproccesing pool with 16 processes.
10:36 bilby INFO    : Resume file outdir_TaylorF2EccFD20Hz_1024HzSpinFixed/result/TaylorF2EccFD20Hz_1024HzSpinFixed_data0_1187008882-43_analysis_H1L1V1_resume.pickle does not exist.
10:36 bilby INFO    : Generating initial points from the prior
11:10 bilby INFO    : Written checkpoint file outdir_TaylorF2EccFD20Hz_1024HzSpinFixed/result/TaylorF2EccFD20Hz_1024HzSpinFixed_data0_1187008882-43_analysis_H1L1V1_resume.pickle
11:40 bilby INFO    : Written checkpoint file outdir_TaylorF2EccFD20Hz_1024HzSpinFixed/result/TaylorF2EccFD20Hz_1024HzSpinFixed_data0_1187008882-43_analysis_H1L1V1_resume.pickle
12:10 bilby INFO    : Written checkpoint file outdir_TaylorF2EccFD20Hz_1024HzSpinFixed/result/TaylorF2EccFD20Hz_1024HzSpinFixed_data0_1187008882-43_analysis_H1L1V1_resume.pickle
12:10 bilby WARNING : singular matrix
12:10 bilby WARNING : Failed to create dynesty state plot at checkpoint
12:10 bilby WARNING : singular matrix
12:10 bilby WARNING : Failed to create dynesty unit state plot at checkpoint
12:10 bilby WARNING : singular matrix
12:10 bilby WARNING : Failed to create dynesty run plot at checkpoint
12:41 bilby INFO    : Written checkpoint file outdir_TaylorF2EccFD20Hz_1024HzSpinFixed/result/TaylorF2EccFD20Hz_1024HzSpinFixed_data0_1187008882-43_analysis_H1L1V1_resume.pickle
13:11 bilby INFO    : Written checkpoint file outdir_TaylorF2EccFD20Hz_1024HzSpinFixed/result/TaylorF2EccFD20Hz_1024HzSpinFixed_data0_1187008882-43_analysis_H1L1V1_resume.pickle
13:42 bilby INFO    : Written checkpoint file outdir_TaylorF2EccFD20Hz_1024HzSpinFixed/result/TaylorF2EccFD20Hz_1024HzSpinFixed_data0_1187008882-43_analysis_H1L1V1_resume.pickle
14:13 bilby INFO    : Written checkpoint file outdir_TaylorF2EccFD20Hz_1024HzSpinFixed/result/TaylorF2EccFD20Hz_1024HzSpinFixed_data0_1187008882-43_analysis_H1L1V1_resume.pickle
14:44 bilby INFO    : Written checkpoint file outdir_TaylorF2EccFD20Hz_1024HzSpinFixed/result/TaylorF2EccFD20Hz_1024HzSpinFixed_data0_1187008882-43_analysis_H1L1V1_resume.pickle
15:15 bilby INFO    : Written checkpoint file outdir_TaylorF2EccFD20Hz_1024HzSpinFixed/result/TaylorF2EccFD20Hz_1024HzSpinFixed_data0_1187008882-43_analysis_H1L1V1_resume.pickle
15:46 bilby INFO    : Written checkpoint file outdir_TaylorF2EccFD20Hz_1024HzSpinFixed/result/TaylorF2EccFD20Hz_1024HzSpinFixed_data0_1187008882-43_analysis_H1L1V1_resume.pickle
16:17 bilby INFO    : Written checkpoint file outdir_TaylorF2EccFD20Hz_1024HzSpinFixed/result/TaylorF2EccFD20Hz_1024HzSpinFixed_data0_1187008882-43_analysis_H1L1V1_resume.pickle
16:49 bilby INFO    : Written checkpoint file outdir_TaylorF2EccFD20Hz_1024HzSpinFixed/result/TaylorF2EccFD20Hz_1024HzSpinFixed_data0_1187008882-43_analysis_H1L1V1_resume.pickle
17:20 bilby INFO    : Written checkpoint file outdir_TaylorF2EccFD20Hz_1024HzSpinFixed/result/TaylorF2EccFD20Hz_1024HzSpinFixed_data0_1187008882-43_analysis_H1L1V1_resume.pickle
17:51 bilby INFO    : Written checkpoint file outdir_TaylorF2EccFD20Hz_1024HzSpinFixed/result/TaylorF2EccFD20Hz_1024HzSpinFixed_data0_1187008882-43_analysis_H1L1V1_resume.pickle
18:22 bilby INFO    : Written checkpoint file outdir_TaylorF2EccFD20Hz_1024HzSpinFixed/result/TaylorF2EccFD20Hz_1024HzSpinFixed_data0_1187008882-43_analysis_H1L1V1_resume.pickle
18:36 bilby INFO    : Run interrupted by alarm signal 14: checkpoint and exit on 77
18:36 bilby INFO    : Written checkpoint file outdir_TaylorF2EccFD20Hz_1024HzSpinFixed/result/TaylorF2EccFD20Hz_1024HzSpinFixed_data0_1187008882-43_analysis_H1L1V1_resume.pickle
18:36 bilby INFO    : Starting to close worker pool.
18:36 bilby INFO    : Finished closing worker pool.
18:36 bilby_pipe INFO    : Running bilby_pipe version: 1.0.6: (CLEAN) 76a4ef2 2022-04-26 12:39:06 +0100
18:36 bilby_pipe INFO    : Running bilby: 1.1.5: (UNCLEAN) f699675c 2022-05-29 02:12:11 +0000
18:36 bilby_pipe INFO    : Command line arguments: Namespace(ini='TaylorF2EccFD20Hz_1024HzSpinFixed_config_complete.ini', verbose=False, calibration_model=None, spline_calibration_envelope_dict=None, spline_calibration_nodes=10, spline_calibration_amplitude_uncertainty_dict=None, spline_calibration_phase_uncertainty_dict=None, calibration_prior_boundary='reflective', idx=0, data_dump_file='outdir_TaylorF2EccFD20Hz_1024HzSpinFixed/data/TaylorF2EccFD20Hz_1024HzSpinFixed_data0_1187008882-43_generation_data_dump.pickle', ignore_gwpy_data_quality_check=True, gps_tuple=None, gps_file=None, timeslide_file=None, timeslide_dict=None, trigger_time='1187008882.43', n_simulation=1, data_dict='{H1:H1_CLN.txt, L1:L1_CLN.txt,  V1:V1_CLN.txt}', data_format=None, allow_tape=True, channel_dict='{H1:H1, L1:L1, V1:V1}', gaussian_noise=False, zero_noise=False, coherence_test=False, detectors=['H1', 'L1', 'V1'], duration=309.0, generation_seed=None, psd_dict=None, psd_fractional_overlap=0.5, post_trigger_duration=1.0, sampling_frequency=1024.0, psd_length=32, psd_maximum_duration=1024, psd_method='median', psd_start_time=None, maximum_frequency='512.', minimum_frequency='20.', tukey_roll_off=0.4, resampling_method='lal', injection=False, injection_dict=None, injection_file=None, injection_numbers=[None], injection_waveform_approximant=None, injection_waveform_arguments=None, accounting='ligo.dev.o3.cbc.pe.lalinference', accounting_user=None, label='TaylorF2EccFD20Hz_1024HzSpinFixed_data0_1187008882-43_analysis_H1L1V1', local=False, local_generation=False, local_plot=False, outdir='outdir_TaylorF2EccFD20Hz_1024HzSpinFixed', overwrite_outdir=False, periodic_restart_time=28800, request_disk=1.0, request_memory=4.0, request_memory_generation=None, request_cpus=16, conda_env=None, scheduler='condor', scheduler_args=None, scheduler_module=[None], scheduler_env=None, scheduler_analysis_time='7-00:00:00', submit=False, condor_job_priority=0, transfer_files=True, log_directory=None, online_pe=False, osg=False, desired_sites=None, analysis_executable=None, analysis_executable_parser=None, distance_marginalization=False, distance_marginalization_lookup_table=None, phase_marginalization=True, time_marginalization=True, jitter_time=True, reference_frame='sky', time_reference='geocent', likelihood_type='GravitationalWaveTransient', roq_folder=None, roq_weights=None, roq_scale_factor=1.0, extra_likelihood_kwargs=None, plot_trace=False, plot_data=False, plot_injection=False, plot_spectrogram=False, plot_calibration=False, plot_corner=False, plot_marginal=False, plot_skymap=False, plot_waveform=False, plot_format='png', create_summary=False, email=None, notification='Never', existing_dir=None, webdir=None, summarypages_arguments=None, result_format='hdf5', final_result=True, final_result_nsamples=20000, default_prior='BBHPriorDict', deltaT=0.2, prior_file=None, prior_dict="{mass-1: Constraint(name='mass_1', minimum=1.0,maximum=2.0), mass_2 = Constraint(name='mass_2', minimum=1.0,maximum=2.0), chirp_mass = Uniform(name='chirp_mass', minimum=0.8705505632961241,maximum=1.7411011265922482), mass_ratio = Uniform(name='mass_ratio', minimum=0.5, maximum=1.), eccentricity = Uniform(name='e0', minimum=0.0, maximum=0.1), luminosity-distance: Gaussian(mu=40.7, sigma=5.57, name='luminosity_distance', unit='Mpc', boundary='reflective'), a-1: 0., a_2 = 0., theta-jn: Sine(name='theta_jn'), psi =  Uniform(name='psi', minimum=0, maximum=6.283185307179586), phase = Uniform(name='phase', minimum=0, maximum=6.283185307179586), geocent_time = Uniform(1187008882.33, 1187008882.53, name='geocent_time', unit='s'), ra = 3.44615914, dec =  -0.40808407, }", enforce_signal_duration=True, postprocessing_executable=None, postprocessing_arguments=None, single_postprocessing_executable=None, single_postprocessing_arguments=None, sampler='dynesty', sampling_seed=None, n_parallel=1, sampler_kwargs="{'nlive': 500, 'walks': 100, 'check_point_plot': True, 'check_point_delta_t': 1800, 'print_method': 'interval-60', 'npool': 16}", waveform_generator='bilby.gw.waveform_generator.WaveformGenerator', reference_frequency=30.0, waveform_approximant='TaylorF2Ecc', catch_waveform_errors=True, pn_spin_order=-1, pn_tidal_order=-1, pn_phase_order=-1, pn_amplitude_order=0, numerical_relativity_file=None, waveform_arguments_dict=None, mode_array=[None], frequency_domain_source_model='lal_taylorF2Ecc_fd', conversion_function=None, generation_function=None)
18:36 bilby_pipe INFO    : Unknown command line arguments: []
18:36 bilby_pipe INFO    : Sampling seed set to 483279
18:36 bilby_pipe INFO    : No calibration_model model provided, calibration marginalization will not be used
18:36 bilby_pipe INFO    : Found data for detectors = ['H1', 'L1', 'V1']
18:36 bilby_pipe INFO    : Using data for detectors = ['H1', 'L1', 'V1']
18:36 bilby_pipe INFO    : H1: sampling-frequency=1024.0, segment-start-time=1187008574.4299316, duration=309.0
18:36 bilby_pipe INFO    : L1: sampling-frequency=1024.0, segment-start-time=1187008574.4299316, duration=309.0
18:36 bilby_pipe INFO    : V1: sampling-frequency=1024.0, segment-start-time=1187008574.4299316, duration=309.0
18:36 bilby_pipe INFO    : Using the lal_taylorF2Ecc_fd source model
18:36 bilby_pipe INFO    : No conversion function
18:36 bilby INFO    : Waveform generator initiated with
  frequency_domain_source_model: bilby.gw.source.lal_taylorF2Ecc_fd
  time_domain_source_model: None
  parameter_conversion: bilby.gw.conversion.convert_to_lal_binary_black_hole_parameters
18:36 bilby_pipe INFO    : No conversion function
18:36 bilby INFO    : Running for label 'TaylorF2EccFD20Hz_1024HzSpinFixed_data0_1187008882-43_analysis_H1L1V1', output will be saved to 'outdir_TaylorF2EccFD20Hz_1024HzSpinFixed/result'
18:36 bilby INFO    : Using lal version 7.1.7.1
18:36 bilby INFO    : Using lal git version Branch: master;Tag: None;Id: 7eef7079ec7a112132bd11eb292c5535d2ebf6b2;;Builder: Unknown User <>;Repository status: UNCLEAN: Modified working tree
18:36 bilby INFO    : Using lalsimulation version 3.1.2.1
18:36 bilby INFO    : Using lalsimulation git version Branch: master;Tag: None;Id: 7eef7079ec7a112132bd11eb292c5535d2ebf6b2;;Builder: Unknown User <>;Repository status: UNCLEAN: Modified working tree
18:36 bilby INFO    : Search parameters:
18:36 bilby INFO    :   chirp_mass = Uniform(minimum=0.8705505632961241, maximum=1.7411011265922482, name='chirp_mass', latex_label='$\\mathcal{M}$', unit=None, boundary=None)
18:36 bilby INFO    :   mass_ratio = Uniform(minimum=0.5, maximum=1.0, name='mass_ratio', latex_label='$q$', unit=None, boundary=None)
18:36 bilby INFO    :   eccentricity = Uniform(minimum=0.0, maximum=0.1, name='e0', latex_label='e0', unit=None, boundary=None)
18:36 bilby INFO    :   luminosity_distance = Gaussian(mu=40.7, sigma=5.57, name='luminosity_distance', latex_label='$d_L$', unit='Mpc', boundary='reflective')
18:36 bilby INFO    :   theta_jn = Sine(minimum=0, maximum=3.141592653589793, name='theta_jn', latex_label='$\\theta_{JN}$', unit=None, boundary=None)
18:36 bilby INFO    :   psi = Uniform(minimum=0, maximum=6.283185307179586, name='psi', latex_label='$\\psi$', unit=None, boundary=None)
18:36 bilby INFO    :   time_jitter = Uniform(minimum=-0.0009765625, maximum=0.0009765625, name='time_jitter', latex_label='$t_j$', unit=None, boundary='periodic')
18:36 bilby INFO    :   mass_1 = Constraint(minimum=1.0, maximum=2.0, name='mass_1', latex_label='$m_1$', unit=None)
18:36 bilby INFO    :   mass_2 = Constraint(minimum=1.0, maximum=2.0, name='mass_2', latex_label='$m_2$', unit=None)
18:36 bilby INFO    :   a_1 = 0.0
18:36 bilby INFO    :   a_2 = 0.0
18:36 bilby INFO    :   phase = 0.0
18:36 bilby INFO    :   geocent_time = 1187008574.4299316
18:36 bilby INFO    :   ra = 3.44615914
18:36 bilby INFO    :   dec = -0.40808407
18:36 bilby INFO    : Generating frequency domain strain from given time domain strain.
18:36 bilby INFO    : Applying a tukey window with alpha=0.0025889967637540453, roll off=0.4
18:36 bilby INFO    : Generating frequency domain strain from given time domain strain.
18:36 bilby INFO    : Applying a tukey window with alpha=0.0025889967637540453, roll off=0.4
18:36 bilby INFO    : Generating frequency domain strain from given time domain strain.
18:36 bilby INFO    : Applying a tukey window with alpha=0.0025889967637540453, roll off=0.4
18:37 bilby INFO    : Single likelihood evaluation took 1.981e-01 s
18:37 bilby INFO    : Using sampler Dynesty with kwargs {'bound': 'multi', 'sample': 'rwalk', 'periodic': None, 'reflective': None, 'check_point_delta_t': 1800, 'nlive': 500, 'first_update': None, 'walks': 100, 'npdim': None, 'rstate': None, 'queue_size': 16, 'pool': None, 'use_pool': None, 'live_points': None, 'logl_args': None, 'logl_kwargs': None, 'ptform_args': None, 'ptform_kwargs': None, 'enlarge': 1.5, 'bootstrap': None, 'vol_dec': 0.5, 'vol_check': 8.0, 'facc': 0.2, 'slices': 5, 'update_interval': 300, 'print_func': <bound method Dynesty._print_func of <bilby.core.sampler.dynesty.Dynesty object at 0x2ac047d6bee0>>, 'dlogz': 0.1, 'maxiter': None, 'maxcall': None, 'logl_max': inf, 'add_live': True, 'print_progress': True, 'save_bounds': False, 'n_effective': None, 'maxmcmc': 5000, 'nact': 5, 'print_method': 'interval-60'}
18:37 bilby INFO    : Checkpoint every check_point_delta_t = 1800s
18:37 bilby INFO    : Using dynesty version 1.0.1
18:37 bilby INFO    : Using the bilby-implemented rwalk sample method with ACT estimated walks
18:37 bilby INFO    : Setting up multiproccesing pool with 16 processes.
18:37 bilby INFO    : Reading resume file outdir_TaylorF2EccFD20Hz_1024HzSpinFixed/result/TaylorF2EccFD20Hz_1024HzSpinFixed_data0_1187008882-43_analysis_H1L1V1_resume.pickle
18:37 bilby INFO    : Resume file successfully loaded.
19:07 bilby INFO    : Written checkpoint file outdir_TaylorF2EccFD20Hz_1024HzSpinFixed/result/TaylorF2EccFD20Hz_1024HzSpinFixed_data0_1187008882-43_analysis_H1L1V1_resume.pickle
19:37 bilby INFO    : Written checkpoint file outdir_TaylorF2EccFD20Hz_1024HzSpinFixed/result/TaylorF2EccFD20Hz_1024HzSpinFixed_data0_1187008882-43_analysis_H1L1V1_resume.pickle
20:09 bilby INFO    : Written checkpoint file outdir_TaylorF2EccFD20Hz_1024HzSpinFixed/result/TaylorF2EccFD20Hz_1024HzSpinFixed_data0_1187008882-43_analysis_H1L1V1_resume.pickle
20:39 bilby INFO    : Written checkpoint file outdir_TaylorF2EccFD20Hz_1024HzSpinFixed/result/TaylorF2EccFD20Hz_1024HzSpinFixed_data0_1187008882-43_analysis_H1L1V1_resume.pickle
21:10 bilby INFO    : Written checkpoint file outdir_TaylorF2EccFD20Hz_1024HzSpinFixed/result/TaylorF2EccFD20Hz_1024HzSpinFixed_data0_1187008882-43_analysis_H1L1V1_resume.pickle
21:40 bilby INFO    : Written checkpoint file outdir_TaylorF2EccFD20Hz_1024HzSpinFixed/result/TaylorF2EccFD20Hz_1024HzSpinFixed_data0_1187008882-43_analysis_H1L1V1_resume.pickle
22:10 bilby INFO    : Written checkpoint file outdir_TaylorF2EccFD20Hz_1024HzSpinFixed/result/TaylorF2EccFD20Hz_1024HzSpinFixed_data0_1187008882-43_analysis_H1L1V1_resume.pickle
22:42 bilby INFO    : Written checkpoint file outdir_TaylorF2EccFD20Hz_1024HzSpinFixed/result/TaylorF2EccFD20Hz_1024HzSpinFixed_data0_1187008882-43_analysis_H1L1V1_resume.pickle
23:14 bilby INFO    : Written checkpoint file outdir_TaylorF2EccFD20Hz_1024HzSpinFixed/result/TaylorF2EccFD20Hz_1024HzSpinFixed_data0_1187008882-43_analysis_H1L1V1_resume.pickle
23:45 bilby INFO    : Written checkpoint file outdir_TaylorF2EccFD20Hz_1024HzSpinFixed/result/TaylorF2EccFD20Hz_1024HzSpinFixed_data0_1187008882-43_analysis_H1L1V1_resume.pickle
00:17 bilby INFO    : Written checkpoint file outdir_TaylorF2EccFD20Hz_1024HzSpinFixed/result/TaylorF2EccFD20Hz_1024HzSpinFixed_data0_1187008882-43_analysis_H1L1V1_resume.pickle
00:48 bilby INFO    : Written checkpoint file outdir_TaylorF2EccFD20Hz_1024HzSpinFixed/result/TaylorF2EccFD20Hz_1024HzSpinFixed_data0_1187008882-43_analysis_H1L1V1_resume.pickle
01:19 bilby INFO    : Written checkpoint file outdir_TaylorF2EccFD20Hz_1024HzSpinFixed/result/TaylorF2EccFD20Hz_1024HzSpinFixed_data0_1187008882-43_analysis_H1L1V1_resume.pickle
01:50 bilby INFO    : Written checkpoint file outdir_TaylorF2EccFD20Hz_1024HzSpinFixed/result/TaylorF2EccFD20Hz_1024HzSpinFixed_data0_1187008882-43_analysis_H1L1V1_resume.pickle
02:22 bilby INFO    : Written checkpoint file outdir_TaylorF2EccFD20Hz_1024HzSpinFixed/result/TaylorF2EccFD20Hz_1024HzSpinFixed_data0_1187008882-43_analysis_H1L1V1_resume.pickle
02:36 bilby INFO    : Run interrupted by alarm signal 14: checkpoint and exit on 77
02:37 bilby INFO    : Written checkpoint file outdir_TaylorF2EccFD20Hz_1024HzSpinFixed/result/TaylorF2EccFD20Hz_1024HzSpinFixed_data0_1187008882-43_analysis_H1L1V1_resume.pickle
02:37 bilby INFO    : Starting to close worker pool.
02:38 bilby INFO    : Finished closing worker pool.
02:38 bilby_pipe INFO    : Running bilby_pipe version: 1.0.6: (CLEAN) 76a4ef2 2022-04-26 12:39:06 +0100
02:38 bilby_pipe INFO    : Running bilby: 1.1.5: (UNCLEAN) f699675c 2022-05-29 02:12:11 +0000
02:38 bilby_pipe INFO    : Command line arguments: Namespace(ini='TaylorF2EccFD20Hz_1024HzSpinFixed_config_complete.ini', verbose=False, calibration_model=None, spline_calibration_envelope_dict=None, spline_calibration_nodes=10, spline_calibration_amplitude_uncertainty_dict=None, spline_calibration_phase_uncertainty_dict=None, calibration_prior_boundary='reflective', idx=0, data_dump_file='outdir_TaylorF2EccFD20Hz_1024HzSpinFixed/data/TaylorF2EccFD20Hz_1024HzSpinFixed_data0_1187008882-43_generation_data_dump.pickle', ignore_gwpy_data_quality_check=True, gps_tuple=None, gps_file=None, timeslide_file=None, timeslide_dict=None, trigger_time='1187008882.43', n_simulation=1, data_dict='{H1:H1_CLN.txt, L1:L1_CLN.txt,  V1:V1_CLN.txt}', data_format=None, allow_tape=True, channel_dict='{H1:H1, L1:L1, V1:V1}', gaussian_noise=False, zero_noise=False, coherence_test=False, detectors=['H1', 'L1', 'V1'], duration=309.0, generation_seed=None, psd_dict=None, psd_fractional_overlap=0.5, post_trigger_duration=1.0, sampling_frequency=1024.0, psd_length=32, psd_maximum_duration=1024, psd_method='median', psd_start_time=None, maximum_frequency='512.', minimum_frequency='20.', tukey_roll_off=0.4, resampling_method='lal', injection=False, injection_dict=None, injection_file=None, injection_numbers=[None], injection_waveform_approximant=None, injection_waveform_arguments=None, accounting='ligo.dev.o3.cbc.pe.lalinference', accounting_user=None, label='TaylorF2EccFD20Hz_1024HzSpinFixed_data0_1187008882-43_analysis_H1L1V1', local=False, local_generation=False, local_plot=False, outdir='outdir_TaylorF2EccFD20Hz_1024HzSpinFixed', overwrite_outdir=False, periodic_restart_time=28800, request_disk=1.0, request_memory=4.0, request_memory_generation=None, request_cpus=16, conda_env=None, scheduler='condor', scheduler_args=None, scheduler_module=[None], scheduler_env=None, scheduler_analysis_time='7-00:00:00', submit=False, condor_job_priority=0, transfer_files=True, log_directory=None, online_pe=False, osg=False, desired_sites=None, analysis_executable=None, analysis_executable_parser=None, distance_marginalization=False, distance_marginalization_lookup_table=None, phase_marginalization=True, time_marginalization=True, jitter_time=True, reference_frame='sky', time_reference='geocent', likelihood_type='GravitationalWaveTransient', roq_folder=None, roq_weights=None, roq_scale_factor=1.0, extra_likelihood_kwargs=None, plot_trace=False, plot_data=False, plot_injection=False, plot_spectrogram=False, plot_calibration=False, plot_corner=False, plot_marginal=False, plot_skymap=False, plot_waveform=False, plot_format='png', create_summary=False, email=None, notification='Never', existing_dir=None, webdir=None, summarypages_arguments=None, result_format='hdf5', final_result=True, final_result_nsamples=20000, default_prior='BBHPriorDict', deltaT=0.2, prior_file=None, prior_dict="{mass-1: Constraint(name='mass_1', minimum=1.0,maximum=2.0), mass_2 = Constraint(name='mass_2', minimum=1.0,maximum=2.0), chirp_mass = Uniform(name='chirp_mass', minimum=0.8705505632961241,maximum=1.7411011265922482), mass_ratio = Uniform(name='mass_ratio', minimum=0.5, maximum=1.), eccentricity = Uniform(name='e0', minimum=0.0, maximum=0.1), luminosity-distance: Gaussian(mu=40.7, sigma=5.57, name='luminosity_distance', unit='Mpc', boundary='reflective'), a-1: 0., a_2 = 0., theta-jn: Sine(name='theta_jn'), psi =  Uniform(name='psi', minimum=0, maximum=6.283185307179586), phase = Uniform(name='phase', minimum=0, maximum=6.283185307179586), geocent_time = Uniform(1187008882.33, 1187008882.53, name='geocent_time', unit='s'), ra = 3.44615914, dec =  -0.40808407, }", enforce_signal_duration=True, postprocessing_executable=None, postprocessing_arguments=None, single_postprocessing_executable=None, single_postprocessing_arguments=None, sampler='dynesty', sampling_seed=None, n_parallel=1, sampler_kwargs="{'nlive': 500, 'walks': 100, 'check_point_plot': True, 'check_point_delta_t': 1800, 'print_method': 'interval-60', 'npool': 16}", waveform_generator='bilby.gw.waveform_generator.WaveformGenerator', reference_frequency=30.0, waveform_approximant='TaylorF2Ecc', catch_waveform_errors=True, pn_spin_order=-1, pn_tidal_order=-1, pn_phase_order=-1, pn_amplitude_order=0, numerical_relativity_file=None, waveform_arguments_dict=None, mode_array=[None], frequency_domain_source_model='lal_taylorF2Ecc_fd', conversion_function=None, generation_function=None)
02:38 bilby_pipe INFO    : Unknown command line arguments: []
02:38 bilby_pipe INFO    : Sampling seed set to 257444
02:38 bilby_pipe INFO    : No calibration_model model provided, calibration marginalization will not be used
02:38 bilby_pipe INFO    : Found data for detectors = ['H1', 'L1', 'V1']
02:38 bilby_pipe INFO    : Using data for detectors = ['H1', 'L1', 'V1']
02:38 bilby_pipe INFO    : H1: sampling-frequency=1024.0, segment-start-time=1187008574.4299316, duration=309.0
02:38 bilby_pipe INFO    : L1: sampling-frequency=1024.0, segment-start-time=1187008574.4299316, duration=309.0
02:38 bilby_pipe INFO    : V1: sampling-frequency=1024.0, segment-start-time=1187008574.4299316, duration=309.0
02:38 bilby_pipe INFO    : Using the lal_taylorF2Ecc_fd source model
02:38 bilby_pipe INFO    : No conversion function
02:38 bilby INFO    : Waveform generator initiated with
  frequency_domain_source_model: bilby.gw.source.lal_taylorF2Ecc_fd
  time_domain_source_model: None
  parameter_conversion: bilby.gw.conversion.convert_to_lal_binary_black_hole_parameters
02:38 bilby_pipe INFO    : No conversion function
02:38 bilby INFO    : Running for label 'TaylorF2EccFD20Hz_1024HzSpinFixed_data0_1187008882-43_analysis_H1L1V1', output will be saved to 'outdir_TaylorF2EccFD20Hz_1024HzSpinFixed/result'
02:38 bilby INFO    : Using lal version 7.1.7.1
02:38 bilby INFO    : Using lal git version Branch: master;Tag: None;Id: 7eef7079ec7a112132bd11eb292c5535d2ebf6b2;;Builder: Unknown User <>;Repository status: UNCLEAN: Modified working tree
02:38 bilby INFO    : Using lalsimulation version 3.1.2.1
02:38 bilby INFO    : Using lalsimulation git version Branch: master;Tag: None;Id: 7eef7079ec7a112132bd11eb292c5535d2ebf6b2;;Builder: Unknown User <>;Repository status: UNCLEAN: Modified working tree
02:38 bilby INFO    : Search parameters:
02:38 bilby INFO    :   chirp_mass = Uniform(minimum=0.8705505632961241, maximum=1.7411011265922482, name='chirp_mass', latex_label='$\\mathcal{M}$', unit=None, boundary=None)
02:38 bilby INFO    :   mass_ratio = Uniform(minimum=0.5, maximum=1.0, name='mass_ratio', latex_label='$q$', unit=None, boundary=None)
02:38 bilby INFO    :   eccentricity = Uniform(minimum=0.0, maximum=0.1, name='e0', latex_label='e0', unit=None, boundary=None)
02:38 bilby INFO    :   luminosity_distance = Gaussian(mu=40.7, sigma=5.57, name='luminosity_distance', latex_label='$d_L$', unit='Mpc', boundary='reflective')
02:38 bilby INFO    :   theta_jn = Sine(minimum=0, maximum=3.141592653589793, name='theta_jn', latex_label='$\\theta_{JN}$', unit=None, boundary=None)
02:38 bilby INFO    :   psi = Uniform(minimum=0, maximum=6.283185307179586, name='psi', latex_label='$\\psi$', unit=None, boundary=None)
02:38 bilby INFO    :   time_jitter = Uniform(minimum=-0.0009765625, maximum=0.0009765625, name='time_jitter', latex_label='$t_j$', unit=None, boundary='periodic')
02:38 bilby INFO    :   mass_1 = Constraint(minimum=1.0, maximum=2.0, name='mass_1', latex_label='$m_1$', unit=None)
02:38 bilby INFO    :   mass_2 = Constraint(minimum=1.0, maximum=2.0, name='mass_2', latex_label='$m_2$', unit=None)
02:38 bilby INFO    :   a_1 = 0.0
02:38 bilby INFO    :   a_2 = 0.0
02:38 bilby INFO    :   phase = 0.0
02:38 bilby INFO    :   geocent_time = 1187008574.4299316
02:38 bilby INFO    :   ra = 3.44615914
02:38 bilby INFO    :   dec = -0.40808407
02:38 bilby INFO    : Generating frequency domain strain from given time domain strain.
02:38 bilby INFO    : Applying a tukey window with alpha=0.0025889967637540453, roll off=0.4
02:38 bilby INFO    : Generating frequency domain strain from given time domain strain.
02:38 bilby INFO    : Applying a tukey window with alpha=0.0025889967637540453, roll off=0.4
02:38 bilby INFO    : Generating frequency domain strain from given time domain strain.
02:38 bilby INFO    : Applying a tukey window with alpha=0.0025889967637540453, roll off=0.4
02:38 bilby INFO    : Single likelihood evaluation took 2.370e-01 s
02:38 bilby INFO    : Using sampler Dynesty with kwargs {'bound': 'multi', 'sample': 'rwalk', 'periodic': None, 'reflective': None, 'check_point_delta_t': 1800, 'nlive': 500, 'first_update': None, 'walks': 100, 'npdim': None, 'rstate': None, 'queue_size': 16, 'pool': None, 'use_pool': None, 'live_points': None, 'logl_args': None, 'logl_kwargs': None, 'ptform_args': None, 'ptform_kwargs': None, 'enlarge': 1.5, 'bootstrap': None, 'vol_dec': 0.5, 'vol_check': 8.0, 'facc': 0.2, 'slices': 5, 'update_interval': 300, 'print_func': <bound method Dynesty._print_func of <bilby.core.sampler.dynesty.Dynesty object at 0x2b461cbafee0>>, 'dlogz': 0.1, 'maxiter': None, 'maxcall': None, 'logl_max': inf, 'add_live': True, 'print_progress': True, 'save_bounds': False, 'n_effective': None, 'maxmcmc': 5000, 'nact': 5, 'print_method': 'interval-60'}
02:38 bilby INFO    : Checkpoint every check_point_delta_t = 1800s
02:38 bilby INFO    : Using dynesty version 1.0.1
02:38 bilby INFO    : Using the bilby-implemented rwalk sample method with ACT estimated walks
02:38 bilby INFO    : Setting up multiproccesing pool with 16 processes.
02:38 bilby INFO    : Reading resume file outdir_TaylorF2EccFD20Hz_1024HzSpinFixed/result/TaylorF2EccFD20Hz_1024HzSpinFixed_data0_1187008882-43_analysis_H1L1V1_resume.pickle
02:38 bilby INFO    : Resume file successfully loaded.
03:09 bilby INFO    : Written checkpoint file outdir_TaylorF2EccFD20Hz_1024HzSpinFixed/result/TaylorF2EccFD20Hz_1024HzSpinFixed_data0_1187008882-43_analysis_H1L1V1_resume.pickle
03:39 bilby INFO    : Written checkpoint file outdir_TaylorF2EccFD20Hz_1024HzSpinFixed/result/TaylorF2EccFD20Hz_1024HzSpinFixed_data0_1187008882-43_analysis_H1L1V1_resume.pickle
04:10 bilby INFO    : Written checkpoint file outdir_TaylorF2EccFD20Hz_1024HzSpinFixed/result/TaylorF2EccFD20Hz_1024HzSpinFixed_data0_1187008882-43_analysis_H1L1V1_resume.pickle
04:41 bilby INFO    : Written checkpoint file outdir_TaylorF2EccFD20Hz_1024HzSpinFixed/result/TaylorF2EccFD20Hz_1024HzSpinFixed_data0_1187008882-43_analysis_H1L1V1_resume.pickle
05:13 bilby INFO    : Written checkpoint file outdir_TaylorF2EccFD20Hz_1024HzSpinFixed/result/TaylorF2EccFD20Hz_1024HzSpinFixed_data0_1187008882-43_analysis_H1L1V1_resume.pickle
05:45 bilby INFO    : Written checkpoint file outdir_TaylorF2EccFD20Hz_1024HzSpinFixed/result/TaylorF2EccFD20Hz_1024HzSpinFixed_data0_1187008882-43_analysis_H1L1V1_resume.pickle
06:16 bilby INFO    : Written checkpoint file outdir_TaylorF2EccFD20Hz_1024HzSpinFixed/result/TaylorF2EccFD20Hz_1024HzSpinFixed_data0_1187008882-43_analysis_H1L1V1_resume.pickle
06:49 bilby INFO    : Written checkpoint file outdir_TaylorF2EccFD20Hz_1024HzSpinFixed/result/TaylorF2EccFD20Hz_1024HzSpinFixed_data0_1187008882-43_analysis_H1L1V1_resume.pickle
07:20 bilby INFO    : Written checkpoint file outdir_TaylorF2EccFD20Hz_1024HzSpinFixed/result/TaylorF2EccFD20Hz_1024HzSpinFixed_data0_1187008882-43_analysis_H1L1V1_resume.pickle
07:46 bilby INFO    : Written checkpoint file outdir_TaylorF2EccFD20Hz_1024HzSpinFixed/result/TaylorF2EccFD20Hz_1024HzSpinFixed_data0_1187008882-43_analysis_H1L1V1_resume.pickle
07:46 bilby INFO    : Starting to close worker pool.
07:46 bilby INFO    : Finished closing worker pool.
07:46 bilby INFO    : Sampling time: 21:04:18.846047
07:46 bilby INFO    : Summary of results:
nsamples: 13325
ln_noise_evidence: -721569.575
ln_evidence: -721240.294 +/-  0.278
ln_bayes_factor: 329.281 +/-  0.278

