20:19 bilby_pipe INFO    : Running bilby_pipe version: 1.0.6: (CLEAN) 283d26d 2022-07-12 12:57:11 +0100
20:19 bilby_pipe INFO    : Running bilby: 1.1.5: (UNCLEAN) 45d6aac1 2022-06-24 14:16:44 +0000
20:19 bilby_pipe INFO    : Command line arguments: Namespace(ini='outdir_TaylorF2EccPerAdvFDLeO20Hz_fmax512Hz/TaylorF2EccPerAdvFDLeO20Hz_fmax512Hz_config_complete.ini', verbose=False, calibration_model=None, spline_calibration_envelope_dict=None, spline_calibration_nodes=10, spline_calibration_amplitude_uncertainty_dict=None, spline_calibration_phase_uncertainty_dict=None, calibration_prior_boundary='reflective', idx=0, data_dump_file=None, ignore_gwpy_data_quality_check=True, gps_tuple=None, gps_file=None, timeslide_file=None, timeslide_dict=None, trigger_time='1240215503.017', n_simulation=1, data_dict=None, data_format=None, allow_tape=True, channel_dict='{L1:DCS-CALIB_STRAIN_CLEAN_SUB60HZ_C01, V1:Hrec_hoft_16384Hz}', gaussian_noise=False, zero_noise=False, coherence_test=False, detectors=['L1', 'V1'], duration=160.0, generation_seed=None, psd_dict=None, psd_fractional_overlap=0.5, post_trigger_duration=1.0, sampling_frequency=2048.0, psd_length=32, psd_maximum_duration=1024, psd_method='median', psd_start_time=None, maximum_frequency='512.', minimum_frequency='20.', tukey_roll_off=0.4, resampling_method='lal', injection=False, injection_dict=None, injection_file=None, injection_numbers=[None], injection_waveform_approximant=None, injection_waveform_arguments=None, accounting='ligo.dev.o3.cbc.pe.lalinference', accounting_user=None, label='TaylorF2EccPerAdvFDLeO20Hz_fmax512Hz_data0_1240215503-017_generation', local=False, local_generation=False, local_plot=False, outdir='/home/hemantakumar.phurailatpam/GW190425/outdir_TaylorF2EccPerAdvFDLeO20Hz_fmax512Hz', overwrite_outdir=False, periodic_restart_time=28800, request_disk=1.0, request_memory=8.0, request_memory_generation=None, request_cpus=16, conda_env=None, scheduler='condor', scheduler_args=None, scheduler_module=[None], scheduler_env=None, scheduler_analysis_time='7-00:00:00', submit=False, condor_job_priority=0, transfer_files=True, log_directory=None, online_pe=False, osg=False, desired_sites=None, analysis_executable=None, analysis_executable_parser=None, distance_marginalization=False, distance_marginalization_lookup_table=None, phase_marginalization=True, time_marginalization=True, jitter_time=True, reference_frame='sky', time_reference='geocent', likelihood_type='GravitationalWaveTransient', roq_folder=None, roq_weights=None, roq_scale_factor=1.0, extra_likelihood_kwargs=None, plot_trace=False, plot_data=False, plot_injection=False, plot_spectrogram=False, plot_calibration=False, plot_corner=False, plot_marginal=False, plot_skymap=False, plot_waveform=False, plot_format='png', create_summary=False, email=None, notification='Never', existing_dir=None, webdir=None, summarypages_arguments=None, result_format='hdf5', final_result=True, final_result_nsamples=20000, default_prior='BBHPriorDict', deltaT=0.2, prior_file=None, prior_dict="{chirp-mass: bilby.gw.prior.UniformInComponentsChirpMass(name='chirp_mass', minimum=1.3,maximum=1.8), mass_ratio = bilby.gw.prior.UniformInComponentsMassRatio(name='mass_ratio', minimum=0.1, maximum=1.), eccentricity = Uniform(name='e0', minimum=0.0, maximum=0.1), luminosity_distance =  PowerLaw(alpha=2, name='luminosity_distance', minimum=10.0, maximum=1000.0, unit='Mpc'), theta_jn = Sine(name='theta_jn'), psi =  Uniform(name='psi', minimum=0, maximum=6.283185307179586), phase = Uniform(name='phase', minimum=0, maximum=6.283185307179586), ra = Uniform(name='ra', minimum=0, maximum=6.283185307179586, boundary='periodic'), dec = Cosine(name='dec'), }", enforce_signal_duration=True, postprocessing_executable=None, postprocessing_arguments=None, single_postprocessing_executable=None, single_postprocessing_arguments=None, sampler='dynesty', sampling_seed=None, n_parallel=1, sampler_kwargs="{'nlive': 1000, 'walks': 100, 'check_point_plot': True, 'check_point_delta_t': 1800, 'print_method': 'interval-60', 'resume': True, 'npool': 16}", waveform_generator='bilby.gw.waveform_generator.WaveformGenerator', reference_frequency=30.0, waveform_approximant='TaylorF2EccPerAdvFDLeO', catch_waveform_errors=True, pn_spin_order=-1, pn_tidal_order=-1, pn_phase_order=-1, pn_amplitude_order=0, numerical_relativity_file=None, waveform_arguments_dict=None, mode_array=[None], frequency_domain_source_model='lal_TaylorF2EccPerAdvFDLeO', conversion_function=None, generation_function=None)
20:19 bilby_pipe INFO    : Unknown command line arguments: []
20:19 bilby_pipe INFO    : Generation seed set to 283273
20:19 bilby_pipe INFO    : Setting trigger time 1240215503.017
20:19 bilby_pipe INFO    : Setting prior-file to None
20:19 bilby_pipe INFO    : Setting segment duration 160.0s
20:19 bilby_pipe INFO    : Requested PSD duration 5120.0=32x160.0 exceeds allowed maximum 1024. Setting psd_duration = 1024
20:19 bilby_pipe INFO    : No calibration_model model provided, calibration marginalization will not be used
20:19 bilby_pipe INFO    : Setting PSD for L1 from data
20:19 bilby_pipe INFO    : Using default PSD start time -1024 relative to start time
20:19 bilby_pipe INFO    : Getting psd-segment data for L1
20:19 bilby_pipe INFO    : Calling TimeSeries.get('L1:DCS-CALIB_STRAIN_CLEAN_SUB60HZ_C01', start=1240214320.017, end=1240215344.017, verbose=False, allow_tape=True, ).astype(dtype=float64, subok=True, copy=False, )
20:19 bilby_pipe INFO    : Resampling data to sampling_frequency 2048.0 using lal
20:20 bilby_pipe INFO    : PSD settings: window=Tukey, Tukey-alpha=0.005 roll-off=0.4, overlap=80.0, method=median
20:20 bilby_pipe INFO    : Getting analysis-segment data for L1
20:20 bilby_pipe INFO    : Calling TimeSeries.get('L1:DCS-CALIB_STRAIN_CLEAN_SUB60HZ_C01', start=1240215344.017, end=1240215504.017, verbose=False, allow_tape=True, ).astype(dtype=float64, subok=True, copy=False, )
20:20 bilby_pipe INFO    : Resampling data to sampling_frequency 2048.0 using lal
20:20 bilby_pipe INFO    : Setting PSD for V1 from data
20:20 bilby_pipe INFO    : Using default PSD start time -1024 relative to start time
20:20 bilby_pipe INFO    : Getting psd-segment data for V1
20:20 bilby_pipe INFO    : Calling TimeSeries.get('V1:Hrec_hoft_16384Hz', start=1240214320.017, end=1240215344.017, verbose=False, allow_tape=True, ).astype(dtype=float64, subok=True, copy=False, )
20:20 bilby_pipe INFO    : Resampling data to sampling_frequency 2048.0 using lal
20:20 bilby_pipe INFO    : PSD settings: window=Tukey, Tukey-alpha=0.005 roll-off=0.4, overlap=80.0, method=median
20:20 bilby_pipe INFO    : Getting analysis-segment data for V1
20:20 bilby_pipe INFO    : Calling TimeSeries.get('V1:Hrec_hoft_16384Hz', start=1240215344.017, end=1240215504.017, verbose=False, allow_tape=True, ).astype(dtype=float64, subok=True, copy=False, )
20:20 bilby_pipe INFO    : Resampling data to sampling_frequency 2048.0 using lal
20:20 bilby INFO    : Generation of spin parameters failed with message 'spin_1z'
20:20 bilby_pipe INFO    : Using the lal_TaylorF2EccPerAdvFDLeO source model
20:20 bilby INFO    : Waveform generator initiated with
  frequency_domain_source_model: bilby.gw.source.lal_TaylorF2EccPerAdvFDLeO
  time_domain_source_model: None
  parameter_conversion: bilby.gw.conversion.convert_to_lal_binary_black_hole_parameters
20:20 bilby_pipe INFO    : Completed data generation
