1it [0:00:00 bound:0 nc:  2 ncall:1.0e+03 eff:0.1% logz-ratio=-4299.32+/-0.12 dlogz:inf>0.1]
661it [0:01:00 bound:0 nc:  6 ncall:3.1e+03 eff:21.3% logz-ratio=-457.43+/-0.11 dlogz:1081.729>0.1]
1082it [0:02:00 bound:0 nc:  6 ncall:5.3e+03 eff:20.3% logz-ratio=-271.45+/-0.11 dlogz:895.121>0.1]
1410it [0:03:00 bound:0 nc:  6 ncall:7.5e+03 eff:18.7% logz-ratio=-184.38+/-0.11 dlogz:807.639>0.1]
1636it [0:04:01 bound:0 nc: 10 ncall:9.7e+03 eff:16.8% logz-ratio=-141.31+/-0.11 dlogz:868.266>0.1]
1805it [0:05:02 bound:0 nc: 46 ncall:1.2e+04 eff:15.1% logz-ratio=-111.84+/-0.11 dlogz:838.539>0.1]
1939it [0:06:03 bound:0 nc: 67 ncall:1.4e+04 eff:13.6% logz-ratio=-92.03+/-0.11 dlogz:818.664>0.1]
2070it [0:07:03 bound:0 nc: 18 ncall:1.7e+04 eff:12.5% logz-ratio=-78.43+/-0.11 dlogz:804.891>0.1]
2187it [0:08:04 bound:0 nc: 51 ncall:1.9e+04 eff:11.7% logz-ratio=-65.38+/-0.11 dlogz:791.678>0.1]
2286it [0:09:04 bound:0 nc: 65 ncall:2.1e+04 eff:10.9% logz-ratio=-56.35+/-0.11 dlogz:782.580>0.1]
2385it [0:10:04 bound:0 nc: 34 ncall:2.3e+04 eff:10.2% logz-ratio=-47.75+/-0.11 dlogz:845.004>0.1]
2429it [0:12:46 bound:1 nc:264 ncall:2.5e+04 eff:9.9% logz-ratio=-44.39+/-0.11 dlogz:841.573>0.1]
2445it [0:14:52 bound:9 nc:336 ncall:3.0e+04 eff:8.1% logz-ratio=-43.51+/-0.11 dlogz:840.674>0.1]
2461it [0:16:48 bound:16 nc:291 ncall:3.6e+04 eff:6.9% logz-ratio=-42.52+/-0.11 dlogz:839.678>0.1]
2477it [0:18:58 bound:22 nc:338 ncall:4.1e+04 eff:6.1% logz-ratio=-41.28+/-0.11 dlogz:838.431>0.1]
2493it [0:21:21 bound:30 nc:323 ncall:4.6e+04 eff:5.4% logz-ratio=-39.98+/-0.11 dlogz:837.103>0.1]
2508it [0:23:40 bound:38 nc:391 ncall:5.2e+04 eff:4.9% logz-ratio=-38.95+/-0.11 dlogz:836.059>0.1]
2524it [0:25:48 bound:45 nc:346 ncall:5.7e+04 eff:4.4% logz-ratio=-37.87+/-0.11 dlogz:834.960>0.1]
2540it [0:27:51 bound:53 nc:345 ncall:6.3e+04 eff:4.1% logz-ratio=-36.80+/-0.11 dlogz:833.894>0.1]
2556it [0:30:02 bound:60 nc:377 ncall:6.8e+04 eff:3.8% logz-ratio=-35.56+/-0.11 dlogz:832.630>0.1]
2572it [0:32:19 bound:67 nc:247 ncall:7.3e+04 eff:3.5% logz-ratio=-34.58+/-0.11 dlogz:831.613>0.1]
2586it [0:34:29 bound:74 nc:691 ncall:7.9e+04 eff:3.3% logz-ratio=-33.60+/-0.11 dlogz:830.635>0.1]
2602it [0:36:42 bound:82 nc:224 ncall:8.4e+04 eff:3.1% logz-ratio=-32.47+/-0.11 dlogz:829.478>0.1]
2618it [0:38:49 bound:90 nc:376 ncall:9.0e+04 eff:2.9% logz-ratio=-31.17+/-0.11 dlogz:828.195>0.1]
2634it [0:41:06 bound:98 nc:334 ncall:9.6e+04 eff:2.8% logz-ratio=-29.73+/-0.11 dlogz:826.722>0.1]
2650it [0:43:28 bound:106 nc:402 ncall:1.0e+05 eff:2.6% logz-ratio=-28.79+/-0.11 dlogz:825.746>0.1]
2666it [0:45:41 bound:113 nc:354 ncall:1.1e+05 eff:2.5% logz-ratio=-27.94+/-0.11 dlogz:824.882>0.1]
2682it [0:48:06 bound:120 nc:403 ncall:1.1e+05 eff:2.4% logz-ratio=-27.05+/-0.11 dlogz:823.975>0.1]
2698it [0:50:23 bound:128 nc:294 ncall:1.2e+05 eff:2.3% logz-ratio=-26.06+/-0.11 dlogz:822.974>0.1]
2714it [0:52:32 bound:136 nc:251 ncall:1.2e+05 eff:2.2% logz-ratio=-24.85+/-0.11 dlogz:821.770>0.1]
2730it [0:54:56 bound:143 nc:369 ncall:1.3e+05 eff:2.1% logz-ratio=-23.77+/-0.11 dlogz:820.660>0.1]
2746it [0:57:04 bound:151 nc:288 ncall:1.3e+05 eff:2.0% logz-ratio=-22.65+/-0.11 dlogz:819.521>0.1]
2762it [0:59:19 bound:158 nc:384 ncall:1.4e+05 eff:2.0% logz-ratio=-21.72+/-0.11 dlogz:818.567>0.1]
2778it [1:01:39 bound:166 nc:393 ncall:1.5e+05 eff:1.9% logz-ratio=-20.88+/-0.11 dlogz:817.696>0.1]
2794it [1:04:01 bound:174 nc:279 ncall:1.5e+05 eff:1.8% logz-ratio=-20.18+/-0.11 dlogz:816.974>0.1]
2809it [1:06:27 bound:182 nc:390 ncall:1.6e+05 eff:1.8% logz-ratio=-19.53+/-0.11 dlogz:816.318>0.1]
2825it [1:08:50 bound:189 nc:351 ncall:1.6e+05 eff:1.7% logz-ratio=-18.75+/-0.11 dlogz:815.517>0.1]
2841it [1:11:25 bound:197 nc:305 ncall:1.7e+05 eff:1.7% logz-ratio=-18.04+/-0.11 dlogz:814.787>0.1]
2857it [1:13:40 bound:204 nc:305 ncall:1.7e+05 eff:1.6% logz-ratio=-17.32+/-0.11 dlogz:814.058>0.1]
2872it [1:16:08 bound:212 nc:325 ncall:1.8e+05 eff:1.6% logz-ratio=-16.64+/-0.11 dlogz:813.360>0.1]
2888it [1:18:45 bound:220 nc:461 ncall:1.9e+05 eff:1.6% logz-ratio=-15.75+/-0.11 dlogz:812.478>0.1]
2904it [1:21:10 bound:228 nc:377 ncall:1.9e+05 eff:1.5% logz-ratio=-14.87+/-0.11 dlogz:811.566>0.1]
2920it [1:23:33 bound:236 nc:396 ncall:2.0e+05 eff:1.5% logz-ratio=-14.05+/-0.11 dlogz:810.737>0.1]
2936it [1:25:46 bound:244 nc:414 ncall:2.0e+05 eff:1.4% logz-ratio=-13.29+/-0.11 dlogz:809.949>0.1]
2952it [1:28:09 bound:252 nc:375 ncall:2.1e+05 eff:1.4% logz-ratio=-12.71+/-0.11 dlogz:809.344>0.1]
2968it [1:30:51 bound:260 nc:387 ncall:2.2e+05 eff:1.4% logz-ratio=-12.18+/-0.11 dlogz:808.796>0.1]
2984it [1:33:48 bound:268 nc:298 ncall:2.2e+05 eff:1.3% logz-ratio=-11.67+/-0.11 dlogz:808.265>0.1]
3000it [1:36:25 bound:276 nc:435 ncall:2.3e+05 eff:1.3% logz-ratio=-11.11+/-0.11 dlogz:807.692>0.1]
3016it [1:39:05 bound:284 nc:373 ncall:2.3e+05 eff:1.3% logz-ratio=-10.61+/-0.10 dlogz:807.168>0.1]
3032it [1:41:21 bound:292 nc:391 ncall:2.4e+05 eff:1.3% logz-ratio=-10.16+/-0.10 dlogz:806.711>0.1]
3047it [1:43:57 bound:299 nc:394 ncall:2.5e+05 eff:1.2% logz-ratio=-9.68+/-0.10 dlogz:806.212>0.1]
3063it [1:46:30 bound:307 nc:429 ncall:2.5e+05 eff:1.2% logz-ratio=-9.20+/-0.10 dlogz:805.714>0.1]
3079it [1:49:04 bound:315 nc:307 ncall:2.6e+05 eff:1.2% logz-ratio=-8.72+/-0.10 dlogz:805.216>0.1]
3095it [1:51:52 bound:323 nc:483 ncall:2.6e+05 eff:1.2% logz-ratio=-8.22+/-0.10 dlogz:804.705>0.1]
3111it [1:54:24 bound:331 nc:328 ncall:2.7e+05 eff:1.1% logz-ratio=-7.74+/-0.10 dlogz:804.201>0.1]
3127it [1:57:05 bound:339 nc:432 ncall:2.8e+05 eff:1.1% logz-ratio=-7.27+/-0.10 dlogz:803.728>0.1]
3143it [1:59:35 bound:347 nc:344 ncall:2.8e+05 eff:1.1% logz-ratio=-6.79+/-0.10 dlogz:803.231>0.1]
3159it [2:02:25 bound:354 nc:434 ncall:2.9e+05 eff:1.1% logz-ratio=-6.29+/-0.11 dlogz:802.713>0.1]
3175it [2:04:49 bound:362 nc:438 ncall:3.0e+05 eff:1.1% logz-ratio=-5.80+/-0.11 dlogz:802.201>0.1]
3191it [2:07:37 bound:369 nc:419 ncall:3.0e+05 eff:1.1% logz-ratio=-5.33+/-0.11 dlogz:801.722>0.1]
3207it [2:10:15 bound:377 nc:377 ncall:3.1e+05 eff:1.0% logz-ratio=-4.90+/-0.11 dlogz:801.265>0.1]
3222it [2:13:02 bound:384 nc:441 ncall:3.1e+05 eff:1.0% logz-ratio=-4.52+/-0.10 dlogz:800.873>0.1]
3237it [2:15:50 bound:392 nc:403 ncall:3.2e+05 eff:1.0% logz-ratio=-4.07+/-0.11 dlogz:800.408>0.1]
3253it [2:18:33 bound:399 nc:238 ncall:3.2e+05 eff:1.0% logz-ratio=-3.63+/-0.11 dlogz:799.949>0.1]
3269it [2:21:05 bound:407 nc:321 ncall:3.3e+05 eff:1.0% logz-ratio=-3.21+/-0.11 dlogz:799.514>0.1]
3285it [2:23:35 bound:415 nc:424 ncall:3.4e+05 eff:1.0% logz-ratio=-2.81+/-0.11 dlogz:799.094>0.1]
3301it [2:26:06 bound:423 nc:347 ncall:3.4e+05 eff:1.0% logz-ratio=-2.43+/-0.10 dlogz:798.703>0.1]
3317it [2:28:32 bound:431 nc:397 ncall:3.5e+05 eff:1.0% logz-ratio=-2.05+/-0.10 dlogz:798.309>0.1]
3333it [2:31:09 bound:439 nc:436 ncall:3.5e+05 eff:0.9% logz-ratio=-1.66+/-0.10 dlogz:797.899>0.1]
3349it [2:33:39 bound:447 nc:400 ncall:3.6e+05 eff:0.9% logz-ratio=-1.28+/-0.10 dlogz:797.498>0.1]
3365it [2:36:26 bound:455 nc:467 ncall:3.7e+05 eff:0.9% logz-ratio=-0.92+/-0.10 dlogz:797.130>0.1]
3381it [2:39:07 bound:463 nc:265 ncall:3.7e+05 eff:0.9% logz-ratio=-0.58+/-0.10 dlogz:796.771>0.1]
3397it [2:41:59 bound:471 nc:340 ncall:3.8e+05 eff:0.9% logz-ratio=-0.26+/-0.10 dlogz:796.436>0.1]
3413it [2:44:42 bound:479 nc:397 ncall:3.8e+05 eff:0.9% logz-ratio=0.02+/-0.10 dlogz:796.133>0.1]
3429it [2:47:42 bound:487 nc:327 ncall:3.9e+05 eff:0.9% logz-ratio=0.28+/-0.10 dlogz:795.856>0.1]
3445it [2:50:25 bound:495 nc:342 ncall:4.0e+05 eff:0.9% logz-ratio=0.56+/-0.10 dlogz:795.563>0.1]
3461it [2:52:59 bound:502 nc:390 ncall:4.0e+05 eff:0.9% logz-ratio=0.83+/-0.10 dlogz:795.273>0.1]
3477it [2:55:47 bound:510 nc:353 ncall:4.1e+05 eff:0.8% logz-ratio=1.09+/-0.10 dlogz:794.996>0.1]
3493it [2:58:36 bound:518 nc:432 ncall:4.2e+05 eff:0.8% logz-ratio=1.35+/-0.10 dlogz:794.721>0.1]
3509it [3:01:23 bound:526 nc:495 ncall:4.2e+05 eff:0.8% logz-ratio=1.59+/-0.10 dlogz:794.468>0.1]
3525it [3:04:06 bound:534 nc:467 ncall:4.3e+05 eff:0.8% logz-ratio=1.81+/-0.10 dlogz:794.229>0.1]
3540it [3:06:52 bound:542 nc:254 ncall:4.4e+05 eff:0.8% logz-ratio=2.03+/-0.10 dlogz:793.998>0.1]
3556it [3:09:52 bound:550 nc:385 ncall:4.4e+05 eff:0.8% logz-ratio=2.25+/-0.10 dlogz:793.752>0.1]
3572it [3:12:42 bound:558 nc:423 ncall:4.5e+05 eff:0.8% logz-ratio=2.49+/-0.10 dlogz:793.503>0.1]
3588it [3:15:38 bound:566 nc:409 ncall:4.6e+05 eff:0.8% logz-ratio=2.71+/-0.10 dlogz:793.262>0.1]
3604it [3:18:31 bound:574 nc:411 ncall:4.6e+05 eff:0.8% logz-ratio=2.92+/-0.10 dlogz:793.034>0.1]
3619it [3:21:31 bound:582 nc:482 ncall:4.7e+05 eff:0.8% logz-ratio=3.13+/-0.10 dlogz:792.811>0.1]
3635it [3:24:25 bound:590 nc:460 ncall:4.8e+05 eff:0.8% logz-ratio=3.35+/-0.10 dlogz:792.574>0.1]
3651it [3:27:18 bound:598 nc:426 ncall:4.8e+05 eff:0.8% logz-ratio=3.57+/-0.10 dlogz:792.340>0.1]
3667it [3:30:13 bound:606 nc:373 ncall:4.9e+05 eff:0.7% logz-ratio=3.77+/-0.10 dlogz:792.124>0.1]
3682it [3:33:13 bound:613 nc:285 ncall:5.0e+05 eff:0.7% logz-ratio=3.96+/-0.10 dlogz:847.201>0.1]
3698it [3:36:07 bound:621 nc:321 ncall:5.0e+05 eff:0.7% logz-ratio=4.16+/-0.10 dlogz:846.982>0.1]
3714it [3:39:01 bound:629 nc:387 ncall:5.1e+05 eff:0.7% logz-ratio=4.37+/-0.10 dlogz:846.765>0.1]
3730it [3:41:53 bound:637 nc:492 ncall:5.2e+05 eff:0.7% logz-ratio=4.57+/-0.10 dlogz:846.545>0.1]
3746it [3:44:57 bound:645 nc:380 ncall:5.2e+05 eff:0.7% logz-ratio=4.77+/-0.10 dlogz:846.326>0.1]
3762it [3:47:47 bound:653 nc:373 ncall:5.3e+05 eff:0.7% logz-ratio=4.97+/-0.10 dlogz:846.110>0.1]
3778it [3:50:38 bound:660 nc:441 ncall:5.4e+05 eff:0.7% logz-ratio=5.16+/-0.10 dlogz:845.906>0.1]
3794it [3:53:34 bound:668 nc:320 ncall:5.4e+05 eff:0.7% logz-ratio=5.35+/-0.10 dlogz:845.700>0.1]
3810it [3:56:33 bound:676 nc:500 ncall:5.5e+05 eff:0.7% logz-ratio=5.53+/-0.10 dlogz:845.499>0.1]
3826it [3:59:27 bound:684 nc:372 ncall:5.6e+05 eff:0.7% logz-ratio=5.71+/-0.10 dlogz:845.306>0.1]
3842it [4:02:29 bound:692 nc:430 ncall:5.6e+05 eff:0.7% logz-ratio=5.88+/-0.10 dlogz:845.121>0.1]
3858it [4:05:35 bound:700 nc:417 ncall:5.7e+05 eff:0.7% logz-ratio=6.04+/-0.10 dlogz:844.942>0.1]
3874it [4:08:37 bound:708 nc:490 ncall:5.8e+05 eff:0.7% logz-ratio=6.21+/-0.10 dlogz:844.759>0.1]
3890it [4:11:29 bound:716 nc:458 ncall:5.8e+05 eff:0.7% logz-ratio=6.38+/-0.10 dlogz:844.572>0.1]
3906it [4:14:18 bound:723 nc:432 ncall:5.9e+05 eff:0.7% logz-ratio=6.56+/-0.10 dlogz:844.382>0.1]
3922it [4:16:59 bound:731 nc:395 ncall:6.0e+05 eff:0.7% logz-ratio=6.72+/-0.10 dlogz:844.200>0.1]
3938it [4:20:03 bound:739 nc:495 ncall:6.0e+05 eff:0.7% logz-ratio=6.88+/-0.10 dlogz:844.023>0.1]
3954it [4:23:10 bound:747 nc:424 ncall:6.1e+05 eff:0.6% logz-ratio=7.04+/-0.10 dlogz:843.851>0.1]
3970it [4:26:08 bound:755 nc:495 ncall:6.2e+05 eff:0.6% logz-ratio=7.20+/-0.10 dlogz:843.674>0.1]
3986it [4:29:14 bound:763 nc:410 ncall:6.2e+05 eff:0.6% logz-ratio=7.35+/-0.10 dlogz:843.507>0.1]
4002it [4:32:17 bound:771 nc:493 ncall:6.3e+05 eff:0.6% logz-ratio=7.50+/-0.10 dlogz:843.342>0.1]
4018it [4:35:12 bound:779 nc:487 ncall:6.4e+05 eff:0.6% logz-ratio=7.66+/-0.10 dlogz:843.169>0.1]
4034it [4:38:13 bound:787 nc:418 ncall:6.4e+05 eff:0.6% logz-ratio=7.82+/-0.10 dlogz:842.987>0.1]
4049it [4:41:22 bound:795 nc:456 ncall:6.5e+05 eff:0.6% logz-ratio=7.98+/-0.10 dlogz:842.815>0.1]
4064it [4:44:35 bound:803 nc:498 ncall:6.6e+05 eff:0.6% logz-ratio=8.14+/-0.10 dlogz:842.642>0.1]
4080it [4:47:53 bound:811 nc:495 ncall:6.7e+05 eff:0.6% logz-ratio=8.31+/-0.10 dlogz:842.458>0.1]
4096it [4:51:09 bound:819 nc:480 ncall:6.7e+05 eff:0.6% logz-ratio=8.47+/-0.10 dlogz:842.278>0.1]
4112it [4:54:07 bound:827 nc:404 ncall:6.8e+05 eff:0.6% logz-ratio=8.63+/-0.10 dlogz:842.100>0.1]
4128it [4:57:03 bound:835 nc:462 ncall:6.9e+05 eff:0.6% logz-ratio=8.78+/-0.10 dlogz:841.930>0.1]
4144it [5:00:03 bound:843 nc:462 ncall:6.9e+05 eff:0.6% logz-ratio=8.95+/-0.10 dlogz:841.751>0.1]
4160it [5:03:14 bound:851 nc:433 ncall:7.0e+05 eff:0.6% logz-ratio=9.12+/-0.10 dlogz:841.565>0.1]
4176it [5:06:20 bound:859 nc:470 ncall:7.1e+05 eff:0.6% logz-ratio=9.30+/-0.10 dlogz:841.369>0.1]
4192it [5:09:33 bound:867 nc:928 ncall:7.2e+05 eff:0.6% logz-ratio=9.49+/-0.10 dlogz:841.165>0.1]
4207it [5:12:36 bound:875 nc:429 ncall:7.2e+05 eff:0.6% logz-ratio=9.67+/-0.10 dlogz:840.968>0.1]
4223it [5:15:47 bound:883 nc:384 ncall:7.3e+05 eff:0.6% logz-ratio=9.86+/-0.11 dlogz:840.758>0.1]
4238it [5:18:54 bound:891 nc:369 ncall:7.4e+05 eff:0.6% logz-ratio=10.05+/-0.11 dlogz:840.561>0.1]
4254it [5:21:59 bound:899 nc:478 ncall:7.4e+05 eff:0.6% logz-ratio=10.25+/-0.11 dlogz:840.339>0.1]
4270it [5:25:18 bound:907 nc:488 ncall:7.5e+05 eff:0.6% logz-ratio=10.47+/-0.11 dlogz:840.104>0.1]
4286it [5:28:25 bound:915 nc:463 ncall:7.6e+05 eff:0.6% logz-ratio=10.68+/-0.11 dlogz:839.877>0.1]
4302it [5:31:35 bound:923 nc:451 ncall:7.6e+05 eff:0.6% logz-ratio=10.91+/-0.11 dlogz:839.634>0.1]
4318it [5:34:44 bound:931 nc:358 ncall:7.7e+05 eff:0.6% logz-ratio=11.16+/-0.11 dlogz:839.373>0.1]
4334it [5:37:53 bound:938 nc:434 ncall:7.8e+05 eff:0.6% logz-ratio=11.40+/-0.11 dlogz:839.110>0.1]
4350it [5:40:55 bound:946 nc:429 ncall:7.9e+05 eff:0.6% logz-ratio=11.65+/-0.11 dlogz:838.852>0.1]
4366it [5:43:55 bound:954 nc:492 ncall:7.9e+05 eff:0.6% logz-ratio=11.90+/-0.11 dlogz:838.585>0.1]
4382it [5:46:52 bound:962 nc:435 ncall:8.0e+05 eff:0.5% logz-ratio=12.15+/-0.11 dlogz:838.315>0.1]
4397it [5:50:08 bound:970 nc:487 ncall:8.1e+05 eff:0.5% logz-ratio=12.42+/-0.11 dlogz:838.037>0.1]
4413it [5:53:28 bound:978 nc:500 ncall:8.2e+05 eff:0.5% logz-ratio=12.73+/-0.11 dlogz:837.713>0.1]
4429it [5:56:34 bound:986 nc:410 ncall:8.2e+05 eff:0.5% logz-ratio=13.05+/-0.11 dlogz:837.374>0.1]
4445it [5:59:43 bound:994 nc:422 ncall:8.3e+05 eff:0.5% logz-ratio=13.35+/-0.11 dlogz:837.055>0.1]
4461it [6:02:43 bound:1002 nc:445 ncall:8.4e+05 eff:0.5% logz-ratio=13.65+/-0.11 dlogz:836.741>0.1]
4477it [6:05:44 bound:1010 nc:405 ncall:8.4e+05 eff:0.5% logz-ratio=13.94+/-0.11 dlogz:836.428>0.1]
4493it [6:08:53 bound:1018 nc:420 ncall:8.5e+05 eff:0.5% logz-ratio=14.22+/-0.11 dlogz:836.137>0.1]
4509it [6:11:57 bound:1026 nc:491 ncall:8.6e+05 eff:0.5% logz-ratio=14.50+/-0.11 dlogz:835.836>0.1]
4525it [6:14:53 bound:1034 nc:415 ncall:8.6e+05 eff:0.5% logz-ratio=14.77+/-0.11 dlogz:835.553>0.1]
4540it [6:18:01 bound:1042 nc:475 ncall:8.7e+05 eff:0.5% logz-ratio=15.04+/-0.11 dlogz:835.272>0.1]
4556it [6:20:59 bound:1050 nc:402 ncall:8.8e+05 eff:0.5% logz-ratio=15.35+/-0.11 dlogz:834.948>0.1]
4572it [6:24:13 bound:1058 nc:452 ncall:8.8e+05 eff:0.5% logz-ratio=15.67+/-0.11 dlogz:834.613>0.1]
4585it [6:27:16 bound:1066 nc:441 ncall:8.9e+05 eff:0.5% logz-ratio=15.93+/-0.11 dlogz:834.339>0.1]
4601it [6:30:14 bound:1074 nc:463 ncall:9.0e+05 eff:0.5% logz-ratio=16.29+/-0.11 dlogz:833.962>0.1]
4617it [6:32:59 bound:1082 nc:423 ncall:9.1e+05 eff:0.5% logz-ratio=16.68+/-0.12 dlogz:833.562>0.1]
4633it [6:35:58 bound:1090 nc:470 ncall:9.1e+05 eff:0.5% logz-ratio=17.06+/-0.12 dlogz:833.162>0.1]
4649it [6:39:02 bound:1098 nc:399 ncall:9.2e+05 eff:0.5% logz-ratio=17.43+/-0.12 dlogz:832.775>0.1]
4663it [6:41:58 bound:1106 nc:433 ncall:9.3e+05 eff:0.5% logz-ratio=17.81+/-0.12 dlogz:832.384>0.1]
4679it [6:44:45 bound:1114 nc:452 ncall:9.3e+05 eff:0.5% logz-ratio=18.25+/-0.12 dlogz:831.928>0.1]
4694it [6:47:30 bound:1122 nc:412 ncall:9.4e+05 eff:0.5% logz-ratio=18.69+/-0.12 dlogz:831.479>0.1]
4710it [6:50:23 bound:1130 nc:436 ncall:9.4e+05 eff:0.5% logz-ratio=19.17+/-0.12 dlogz:830.986>0.1]
4726it [6:53:09 bound:1138 nc:375 ncall:9.5e+05 eff:0.5% logz-ratio=19.66+/-0.12 dlogz:830.483>0.1]
4742it [6:56:07 bound:1146 nc:427 ncall:9.6e+05 eff:0.5% logz-ratio=20.21+/-0.12 dlogz:829.917>0.1]
4758it [6:58:56 bound:1154 nc:391 ncall:9.6e+05 eff:0.5% logz-ratio=20.82+/-0.12 dlogz:829.300>0.1]
4774it [7:01:45 bound:1162 nc:405 ncall:9.7e+05 eff:0.5% logz-ratio=21.52+/-0.12 dlogz:828.578>0.1]
4789it [7:04:43 bound:1170 nc:410 ncall:9.8e+05 eff:0.5% logz-ratio=22.12+/-0.12 dlogz:827.960>0.1]
4805it [7:07:29 bound:1178 nc:385 ncall:9.8e+05 eff:0.5% logz-ratio=22.74+/-0.12 dlogz:827.319>0.1]
4821it [7:10:20 bound:1186 nc:396 ncall:9.9e+05 eff:0.5% logz-ratio=23.30+/-0.12 dlogz:826.748>0.1]
4837it [7:13:08 bound:1194 nc:396 ncall:1.0e+06 eff:0.5% logz-ratio=23.86+/-0.12 dlogz:826.166>0.1]
4853it [7:15:40 bound:1202 nc:319 ncall:1.0e+06 eff:0.5% logz-ratio=24.39+/-0.12 dlogz:825.621>0.1]
4869it [7:18:58 bound:1210 nc:394 ncall:1.0e+06 eff:0.5% logz-ratio=24.96+/-0.12 dlogz:825.043>0.1]
4885it [7:21:47 bound:1218 nc:399 ncall:1.0e+06 eff:0.5% logz-ratio=25.51+/-0.12 dlogz:824.476>0.1]
4901it [7:24:29 bound:1226 nc:299 ncall:1.0e+06 eff:0.5% logz-ratio=26.14+/-0.12 dlogz:823.830>0.1]
4917it [7:26:52 bound:1234 nc:326 ncall:1.0e+06 eff:0.5% logz-ratio=26.68+/-0.12 dlogz:823.267>0.1]
4933it [7:29:23 bound:1242 nc:262 ncall:1.0e+06 eff:0.5% logz-ratio=27.30+/-0.12 dlogz:822.641>0.1]
4949it [7:31:48 bound:1250 nc:322 ncall:1.0e+06 eff:0.5% logz-ratio=27.98+/-0.12 dlogz:821.949>0.1]
4965it [7:34:18 bound:1257 nc:342 ncall:1.0e+06 eff:0.5% logz-ratio=28.73+/-0.12 dlogz:821.186>0.1]
4980it [7:36:50 bound:1265 nc:354 ncall:1.0e+06 eff:0.5% logz-ratio=29.47+/-0.12 dlogz:820.426>0.1]
4996it [7:39:09 bound:1273 nc:327 ncall:1.1e+06 eff:0.5% logz-ratio=30.15+/-0.12 dlogz:819.727>0.1]
5012it [7:41:41 bound:1280 nc:394 ncall:1.1e+06 eff:0.5% logz-ratio=30.84+/-0.12 dlogz:819.028>0.1]
5028it [7:44:08 bound:1288 nc:297 ncall:1.1e+06 eff:0.5% logz-ratio=31.55+/-0.12 dlogz:818.300>0.1]
5044it [7:46:32 bound:1296 nc:342 ncall:1.1e+06 eff:0.5% logz-ratio=32.32+/-0.13 dlogz:817.509>0.1]
5059it [7:48:37 bound:1303 nc:640 ncall:1.1e+06 eff:0.5% logz-ratio=32.91+/-0.12 dlogz:816.899>0.1]
5074it [7:51:41 bound:1309 nc:370 ncall:1.1e+06 eff:0.5% logz-ratio=33.57+/-0.13 dlogz:816.245>0.1]
5089it [7:53:56 bound:1317 nc:317 ncall:1.1e+06 eff:0.5% logz-ratio=34.33+/-0.13 dlogz:815.467>0.1]
5105it [7:56:10 bound:1325 nc:367 ncall:1.1e+06 eff:0.5% logz-ratio=35.18+/-0.13 dlogz:814.599>0.1]
5121it [7:58:13 bound:1332 nc:213 ncall:1.1e+06 eff:0.5% logz-ratio=35.89+/-0.13 dlogz:813.871>0.1]
5137it [8:00:14 bound:1338 nc:248 ncall:1.1e+06 eff:0.5% logz-ratio=36.68+/-0.13 dlogz:813.073>0.1]
5153it [8:02:22 bound:1343 nc:208 ncall:1.1e+06 eff:0.5% logz-ratio=37.48+/-0.13 dlogz:812.246>0.1]
5169it [8:04:15 bound:1350 nc:180 ncall:1.1e+06 eff:0.5% logz-ratio=38.28+/-0.13 dlogz:811.437>0.1]
5185it [8:06:14 bound:1355 nc:274 ncall:1.1e+06 eff:0.5% logz-ratio=39.26+/-0.13 dlogz:810.448>0.1]
5201it [8:08:11 bound:1361 nc:195 ncall:1.1e+06 eff:0.5% logz-ratio=40.13+/-0.13 dlogz:809.556>0.1]
5217it [8:09:58 bound:1367 nc:186 ncall:1.1e+06 eff:0.5% logz-ratio=40.94+/-0.13 dlogz:808.734>0.1]
5233it [8:11:52 bound:1372 nc:144 ncall:1.1e+06 eff:0.5% logz-ratio=41.91+/-0.13 dlogz:807.771>0.1]
5249it [8:13:43 bound:1377 nc:322 ncall:1.1e+06 eff:0.5% logz-ratio=43.23+/-0.13 dlogz:806.442>0.1]
5265it [8:15:22 bound:1383 nc:258 ncall:1.1e+06 eff:0.5% logz-ratio=44.58+/-0.13 dlogz:805.065>0.1]
5281it [8:17:26 bound:1388 nc:265 ncall:1.1e+06 eff:0.5% logz-ratio=46.08+/-0.13 dlogz:803.567>0.1]
5296it [8:19:31 bound:1394 nc:332 ncall:1.1e+06 eff:0.5% logz-ratio=47.44+/-0.13 dlogz:802.188>0.1]
5312it [8:21:04 bound:1400 nc:199 ncall:1.2e+06 eff:0.5% logz-ratio=48.86+/-0.13 dlogz:800.757>0.1]
5328it [8:22:55 bound:1405 nc:350 ncall:1.2e+06 eff:0.5% logz-ratio=50.31+/-0.13 dlogz:799.300>0.1]
5344it [8:24:29 bound:1410 nc:317 ncall:1.2e+06 eff:0.5% logz-ratio=51.91+/-0.13 dlogz:797.690>0.1]
5360it [8:26:00 bound:1415 nc:144 ncall:1.2e+06 eff:0.5% logz-ratio=53.39+/-0.13 dlogz:796.173>0.1]
5376it [8:27:40 bound:1420 nc:230 ncall:1.2e+06 eff:0.5% logz-ratio=55.29+/-0.13 dlogz:794.296>0.1]
5391it [8:29:17 bound:1424 nc:156 ncall:1.2e+06 eff:0.5% logz-ratio=56.67+/-0.13 dlogz:792.893>0.1]
5407it [8:30:31 bound:1429 nc:138 ncall:1.2e+06 eff:0.5% logz-ratio=58.81+/-0.14 dlogz:790.717>0.1]
5423it [8:32:05 bound:1433 nc:143 ncall:1.2e+06 eff:0.5% logz-ratio=60.25+/-0.13 dlogz:789.230>0.1]
5455it [8:33:05 bound:1439 nc:101 ncall:1.2e+06 eff:0.5% logz-ratio=63.00+/-0.13 dlogz:786.459>0.1]
5486it [8:34:16 bound:1445 nc:101 ncall:1.2e+06 eff:0.5% logz-ratio=66.42+/-0.14 dlogz:783.047>0.1]
5534it [8:35:47 bound:1453 nc:101 ncall:1.2e+06 eff:0.5% logz-ratio=71.08+/-0.14 dlogz:778.343>0.1]
5582it [8:37:21 bound:1461 nc:101 ncall:1.2e+06 eff:0.5% logz-ratio=76.35+/-0.14 dlogz:773.005>0.1]
5614it [8:38:23 bound:1466 nc:101 ncall:1.2e+06 eff:0.5% logz-ratio=79.89+/-0.14 dlogz:769.456>0.1]
5646it [8:39:28 bound:1471 nc:101 ncall:1.2e+06 eff:0.5% logz-ratio=84.06+/-0.14 dlogz:765.267>0.1]
5678it [8:40:28 bound:1477 nc:101 ncall:1.2e+06 eff:0.5% logz-ratio=88.06+/-0.14 dlogz:761.207>0.1]
5726it [8:42:01 bound:1485 nc:101 ncall:1.2e+06 eff:0.5% logz-ratio=93.68+/-0.14 dlogz:755.531>0.1]
5757it [8:43:04 bound:1490 nc:104 ncall:1.2e+06 eff:0.5% logz-ratio=97.85+/-0.14 dlogz:751.362>0.1]
5789it [8:44:10 bound:1495 nc:103 ncall:1.2e+06 eff:0.5% logz-ratio=102.85+/-0.14 dlogz:746.336>0.1]
5820it [8:45:14 bound:1501 nc:102 ncall:1.2e+06 eff:0.5% logz-ratio=107.11+/-0.14 dlogz:742.125>0.1]
5868it [8:46:44 bound:1509 nc:110 ncall:1.2e+06 eff:0.5% logz-ratio=114.35+/-0.14 dlogz:734.722>0.1]
5899it [8:47:49 bound:1514 nc:107 ncall:1.2e+06 eff:0.5% logz-ratio=118.36+/-0.14 dlogz:730.727>0.1]
5931it [8:49:00 bound:1519 nc:105 ncall:1.2e+06 eff:0.5% logz-ratio=123.29+/-0.14 dlogz:725.771>0.1]
5963it [8:50:04 bound:1525 nc:113 ncall:1.2e+06 eff:0.5% logz-ratio=127.85+/-0.14 dlogz:721.147>0.1]
6010it [8:51:39 bound:1533 nc:101 ncall:1.2e+06 eff:0.5% logz-ratio=135.14+/-0.14 dlogz:713.810>0.1]
6058it [8:53:04 bound:1541 nc:101 ncall:1.2e+06 eff:0.5% logz-ratio=142.90+/-0.14 dlogz:706.030>0.1]
6090it [8:54:04 bound:1546 nc:101 ncall:1.2e+06 eff:0.5% logz-ratio=147.69+/-0.14 dlogz:701.203>0.1]
6136it [8:55:04 bound:1554 nc:  1 ncall:1.2e+06 eff:0.5% logz-ratio=289.49+/-0.16 dlogz:558.476>0.1]
6170it [8:56:38 bound:1559 nc:101 ncall:1.3e+06 eff:0.5% logz-ratio=161.40+/-0.14 dlogz:687.415>0.1]
6218it [8:58:10 bound:1567 nc:101 ncall:1.3e+06 eff:0.5% logz-ratio=168.79+/-0.14 dlogz:679.937>0.1]
6266it [8:59:37 bound:1575 nc:101 ncall:1.3e+06 eff:0.5% logz-ratio=174.81+/-0.14 dlogz:673.885>0.1]
6313it [9:01:06 bound:1583 nc:101 ncall:1.3e+06 eff:0.5% logz-ratio=179.89+/-0.14 dlogz:668.725>0.1]
6353it [9:02:06 bound:1590 nc:  1 ncall:1.3e+06 eff:0.5% logz-ratio=213.70+/-0.15 dlogz:634.561>0.1]
6374it [9:03:10 bound:1594 nc:101 ncall:1.3e+06 eff:0.5% logz-ratio=186.73+/-0.14 dlogz:661.848>0.1]
6422it [9:04:36 bound:1602 nc:101 ncall:1.3e+06 eff:0.5% logz-ratio=193.05+/-0.14 dlogz:655.488>0.1]
6470it [9:06:08 bound:1610 nc:101 ncall:1.3e+06 eff:0.5% logz-ratio=199.18+/-0.14 dlogz:649.292>0.1]
6517it [9:07:36 bound:1618 nc:101 ncall:1.3e+06 eff:0.5% logz-ratio=205.53+/-0.14 dlogz:643.398>0.1]
6565it [9:09:07 bound:1626 nc:101 ncall:1.3e+06 eff:0.5% logz-ratio=212.88+/-0.15 dlogz:636.258>0.1]
6597it [9:10:07 bound:1631 nc:101 ncall:1.3e+06 eff:0.5% logz-ratio=218.78+/-0.15 dlogz:630.171>0.1]
6629it [9:11:11 bound:1637 nc:101 ncall:1.3e+06 eff:0.5% logz-ratio=225.41+/-0.15 dlogz:623.685>0.1]
6661it [9:12:13 bound:1642 nc:101 ncall:1.3e+06 eff:0.5% logz-ratio=232.82+/-0.15 dlogz:616.017>0.1]
6709it [9:13:45 bound:1650 nc:101 ncall:1.3e+06 eff:0.5% logz-ratio=243.25+/-0.15 dlogz:605.536>0.1]
6757it [9:15:16 bound:1658 nc:101 ncall:1.3e+06 eff:0.5% logz-ratio=254.74+/-0.15 dlogz:594.073>0.1]
6805it [9:16:45 bound:1666 nc:101 ncall:1.3e+06 eff:0.5% logz-ratio=267.27+/-0.15 dlogz:581.393>0.1]
6837it [9:17:45 bound:1671 nc:101 ncall:1.3e+06 eff:0.5% logz-ratio=276.67+/-0.15 dlogz:572.229>0.1]
6885it [9:19:05 bound:1679 nc:101 ncall:1.3e+06 eff:0.5% logz-ratio=292.03+/-0.15 dlogz:556.696>0.1]
6933it [9:20:35 bound:1687 nc:101 ncall:1.3e+06 eff:0.5% logz-ratio=303.88+/-0.15 dlogz:544.788>0.1]
6978it [9:22:02 bound:1695 nc:101 ncall:1.3e+06 eff:0.5% logz-ratio=316.50+/-0.15 dlogz:532.391>0.1]
7025it [9:23:32 bound:1703 nc:202 ncall:1.3e+06 eff:0.5% logz-ratio=329.20+/-0.15 dlogz:519.316>0.1]
7072it [9:25:03 bound:1711 nc:202 ncall:1.3e+06 eff:0.5% logz-ratio=338.89+/-0.15 dlogz:509.579>0.1]
7120it [9:26:32 bound:1719 nc:101 ncall:1.3e+06 eff:0.5% logz-ratio=349.23+/-0.15 dlogz:499.263>0.1]
7168it [9:28:01 bound:1727 nc:101 ncall:1.4e+06 eff:0.5% logz-ratio=359.59+/-0.15 dlogz:488.817>0.1]
7216it [9:29:32 bound:1735 nc:101 ncall:1.4e+06 eff:0.5% logz-ratio=368.06+/-0.15 dlogz:486.594>0.1]
7264it [9:30:54 bound:1743 nc:101 ncall:1.4e+06 eff:0.5% logz-ratio=379.35+/-0.15 dlogz:475.446>0.1]
7312it [9:32:19 bound:1751 nc:101 ncall:1.4e+06 eff:0.5% logz-ratio=393.05+/-0.16 dlogz:461.745>0.1]
7359it [9:33:47 bound:1759 nc:101 ncall:1.4e+06 eff:0.5% logz-ratio=407.72+/-0.16 dlogz:447.044>0.1]
7391it [9:34:47 bound:1764 nc:101 ncall:1.4e+06 eff:0.5% logz-ratio=415.18+/-0.15 dlogz:439.422>0.1]
7422it [9:35:48 bound:1770 nc:101 ncall:1.4e+06 eff:0.5% logz-ratio=424.10+/-0.16 dlogz:430.457>0.1]
7470it [9:37:19 bound:1778 nc:101 ncall:1.4e+06 eff:0.5% logz-ratio=435.08+/-0.15 dlogz:419.351>0.1]
7502it [9:38:21 bound:1783 nc:101 ncall:1.4e+06 eff:0.5% logz-ratio=444.34+/-0.16 dlogz:410.250>0.1]
7549it [9:39:48 bound:1791 nc:101 ncall:1.4e+06 eff:0.5% logz-ratio=457.10+/-0.15 dlogz:397.341>0.1]
7581it [9:40:48 bound:1796 nc:101 ncall:1.4e+06 eff:0.5% logz-ratio=463.69+/-0.15 dlogz:390.626>0.1]
7613it [9:41:53 bound:1802 nc:101 ncall:1.4e+06 eff:0.5% logz-ratio=470.45+/-0.16 dlogz:383.934>0.1]
7661it [9:43:23 bound:1810 nc:101 ncall:1.4e+06 eff:0.5% logz-ratio=481.56+/-0.16 dlogz:372.704>0.1]
7693it [9:44:25 bound:1815 nc:101 ncall:1.4e+06 eff:0.5% logz-ratio=486.65+/-0.15 dlogz:367.568>0.1]
7741it [9:45:53 bound:1823 nc:101 ncall:1.4e+06 eff:0.5% logz-ratio=497.74+/-0.16 dlogz:356.568>0.1]
7773it [9:46:54 bound:1828 nc:101 ncall:1.4e+06 eff:0.5% logz-ratio=504.93+/-0.16 dlogz:349.340>0.1]
7804it [9:47:55 bound:1834 nc:101 ncall:1.4e+06 eff:0.5% logz-ratio=512.79+/-0.16 dlogz:341.409>0.1]
7835it [9:49:08 bound:1839 nc:101 ncall:1.4e+06 eff:0.6% logz-ratio=519.72+/-0.16 dlogz:334.692>0.1]
7883it [9:50:37 bound:1847 nc:101 ncall:1.4e+06 eff:0.6% logz-ratio=530.09+/-0.15 dlogz:323.890>0.1]
7931it [9:52:17 bound:1855 nc:104 ncall:1.4e+06 eff:0.6% logz-ratio=538.72+/-0.16 dlogz:315.321>0.1]
7963it [9:53:25 bound:1860 nc:114 ncall:1.4e+06 eff:0.6% logz-ratio=544.18+/-0.16 dlogz:309.848>0.1]
7995it [9:54:34 bound:1866 nc:101 ncall:1.4e+06 eff:0.6% logz-ratio=549.71+/-0.16 dlogz:304.223>0.1]
8027it [9:55:34 bound:1871 nc:101 ncall:1.4e+06 eff:0.6% logz-ratio=554.52+/-0.15 dlogz:299.360>0.1]
8075it [9:57:06 bound:1879 nc:101 ncall:1.4e+06 eff:0.6% logz-ratio=562.20+/-0.16 dlogz:291.683>0.1]
8107it [9:58:06 bound:1884 nc:101 ncall:1.5e+06 eff:0.6% logz-ratio=568.57+/-0.16 dlogz:285.197>0.1]
8139it [9:59:57 bound:1890 nc:133 ncall:1.5e+06 eff:0.6% logz-ratio=574.20+/-0.16 dlogz:282.852>0.1]
8155it [10:01:14 bound:1894 nc:242 ncall:1.5e+06 eff:0.6% logz-ratio=576.80+/-0.16 dlogz:280.218>0.1]
8187it [10:03:13 bound:1902 nc:151 ncall:1.5e+06 eff:0.6% logz-ratio=582.25+/-0.16 dlogz:274.710>0.1]
8203it [10:04:28 bound:1906 nc:128 ncall:1.5e+06 eff:0.6% logz-ratio=584.96+/-0.16 dlogz:271.981>0.1]
8219it [10:05:57 bound:1909 nc:190 ncall:1.5e+06 eff:0.6% logz-ratio=587.52+/-0.16 dlogz:269.455>0.1]
8251it [10:07:54 bound:1917 nc:133 ncall:1.5e+06 eff:0.6% logz-ratio=591.99+/-0.16 dlogz:264.882>0.1]
8283it [10:08:59 bound:1923 nc:101 ncall:1.5e+06 eff:0.6% logz-ratio=595.88+/-0.15 dlogz:260.980>0.1]
8314it [10:10:29 bound:1928 nc:228 ncall:1.5e+06 eff:0.6% logz-ratio=599.95+/-0.16 dlogz:256.886>0.1]
8330it [10:11:33 bound:1932 nc:158 ncall:1.5e+06 eff:0.6% logz-ratio=602.84+/-0.16 dlogz:254.027>0.1]
8362it [10:13:20 bound:1939 nc:152 ncall:1.5e+06 eff:0.6% logz-ratio=607.61+/-0.16 dlogz:249.187>0.1]
8377it [10:14:37 bound:1943 nc:137 ncall:1.5e+06 eff:0.6% logz-ratio=609.69+/-0.16 dlogz:247.115>0.1]
8392it [10:15:51 bound:1946 nc:146 ncall:1.5e+06 eff:0.6% logz-ratio=611.88+/-0.16 dlogz:244.851>0.1]
8408it [10:17:03 bound:1950 nc:121 ncall:1.5e+06 eff:0.6% logz-ratio=613.59+/-0.16 dlogz:243.136>0.1]
8424it [10:18:07 bound:1953 nc:123 ncall:1.5e+06 eff:0.6% logz-ratio=615.57+/-0.16 dlogz:241.138>0.1]
8440it [10:19:41 bound:1957 nc:184 ncall:1.5e+06 eff:0.6% logz-ratio=617.60+/-0.16 dlogz:239.087>0.1]
8472it [10:21:17 bound:1963 nc:126 ncall:1.5e+06 eff:0.6% logz-ratio=620.55+/-0.15 dlogz:236.092>0.1]
8504it [10:22:35 bound:1970 nc:152 ncall:1.5e+06 eff:0.6% logz-ratio=623.78+/-0.16 dlogz:232.837>0.1]
8535it [10:24:10 bound:1977 nc:124 ncall:1.5e+06 eff:0.6% logz-ratio=627.72+/-0.16 dlogz:229.055>0.1]
8567it [10:26:03 bound:1984 nc:158 ncall:1.5e+06 eff:0.6% logz-ratio=632.18+/-0.16 dlogz:224.381>0.1]
8599it [10:27:48 bound:1991 nc:162 ncall:1.5e+06 eff:0.6% logz-ratio=635.86+/-0.16 dlogz:220.712>0.1]
8631it [10:29:27 bound:1998 nc:140 ncall:1.5e+06 eff:0.6% logz-ratio=638.96+/-0.16 dlogz:217.539>0.1]
8663it [10:31:25 bound:2005 nc:160 ncall:1.5e+06 eff:0.6% logz-ratio=642.11+/-0.16 dlogz:214.341>0.1]
8679it [10:32:35 bound:2008 nc:130 ncall:1.5e+06 eff:0.6% logz-ratio=644.24+/-0.16 dlogz:212.238>0.1]
8695it [10:34:23 bound:2012 nc:145 ncall:1.5e+06 eff:0.6% logz-ratio=646.09+/-0.16 dlogz:210.358>0.1]
8711it [10:35:24 bound:2015 nc:172 ncall:1.5e+06 eff:0.6% logz-ratio=647.76+/-0.16 dlogz:208.642>0.1]
8727it [10:36:58 bound:2019 nc:186 ncall:1.5e+06 eff:0.6% logz-ratio=649.72+/-0.16 dlogz:206.697>0.1]
8758it [10:38:46 bound:2027 nc:178 ncall:1.5e+06 eff:0.6% logz-ratio=653.28+/-0.16 dlogz:203.114>0.1]
8790it [10:40:35 bound:2034 nc:165 ncall:1.6e+06 eff:0.6% logz-ratio=657.06+/-0.16 dlogz:199.309>0.1]
8822it [10:42:04 bound:2041 nc:101 ncall:1.6e+06 eff:0.6% logz-ratio=661.36+/-0.16 dlogz:195.000>0.1]
8854it [10:43:35 bound:2046 nc:147 ncall:1.6e+06 eff:0.6% logz-ratio=665.63+/-0.16 dlogz:190.656>0.1]
8885it [10:45:23 bound:2054 nc:168 ncall:1.6e+06 eff:0.6% logz-ratio=669.65+/-0.16 dlogz:186.624>0.1]
8917it [10:46:58 bound:2061 nc:109 ncall:1.6e+06 eff:0.6% logz-ratio=673.53+/-0.16 dlogz:184.279>0.1]
8949it [10:48:13 bound:2067 nc:104 ncall:1.6e+06 eff:0.6% logz-ratio=677.13+/-0.16 dlogz:180.682>0.1]
8981it [10:49:27 bound:2072 nc:101 ncall:1.6e+06 eff:0.6% logz-ratio=681.12+/-0.16 dlogz:176.591>0.1]
9012it [10:50:51 bound:2077 nc:101 ncall:1.6e+06 eff:0.6% logz-ratio=684.20+/-0.16 dlogz:173.505>0.1]
9044it [10:52:07 bound:2083 nc:101 ncall:1.6e+06 eff:0.6% logz-ratio=686.96+/-0.16 dlogz:170.705>0.1]
9076it [10:53:22 bound:2088 nc:101 ncall:1.6e+06 eff:0.6% logz-ratio=689.49+/-0.16 dlogz:168.116>0.1]
9108it [10:54:41 bound:2093 nc:101 ncall:1.6e+06 eff:0.6% logz-ratio=692.68+/-0.16 dlogz:164.980>0.1]
9139it [10:56:00 bound:2099 nc:115 ncall:1.6e+06 eff:0.6% logz-ratio=696.17+/-0.16 dlogz:161.415>0.1]
9171it [10:57:19 bound:2104 nc:101 ncall:1.6e+06 eff:0.6% logz-ratio=699.52+/-0.16 dlogz:158.043>0.1]
9187it [10:58:29 bound:2107 nc:206 ncall:1.6e+06 eff:0.6% logz-ratio=701.40+/-0.16 dlogz:156.215>0.1]
9219it [11:00:24 bound:2113 nc:179 ncall:1.6e+06 eff:0.6% logz-ratio=705.26+/-0.16 dlogz:152.249>0.1]
9235it [11:01:36 bound:2118 nc:158 ncall:1.6e+06 eff:0.6% logz-ratio=706.84+/-0.16 dlogz:150.626>0.1]
9251it [11:02:38 bound:2122 nc:136 ncall:1.6e+06 eff:0.6% logz-ratio=708.18+/-0.16 dlogz:149.272>0.1]
9283it [11:04:22 bound:2129 nc:170 ncall:1.6e+06 eff:0.6% logz-ratio=711.12+/-0.16 dlogz:146.296>0.1]
9315it [11:05:45 bound:2135 nc:115 ncall:1.6e+06 eff:0.6% logz-ratio=713.46+/-0.16 dlogz:143.896>0.1]
9347it [11:07:08 bound:2140 nc:113 ncall:1.6e+06 eff:0.6% logz-ratio=715.23+/-0.16 dlogz:142.093>0.1]
9378it [11:08:28 bound:2146 nc:119 ncall:1.6e+06 eff:0.6% logz-ratio=717.43+/-0.16 dlogz:139.881>0.1]
9393it [11:09:45 bound:2148 nc:215 ncall:1.6e+06 eff:0.6% logz-ratio=718.76+/-0.16 dlogz:138.541>0.1]
9425it [11:11:48 bound:2155 nc:148 ncall:1.6e+06 eff:0.6% logz-ratio=720.85+/-0.16 dlogz:136.399>0.1]
9457it [11:13:10 bound:2162 nc:101 ncall:1.6e+06 eff:0.6% logz-ratio=723.23+/-0.16 dlogz:134.008>0.1]
9473it [11:14:21 bound:2165 nc:186 ncall:1.6e+06 eff:0.6% logz-ratio=724.29+/-0.16 dlogz:132.923>0.1]
9488it [11:16:02 bound:2169 nc:154 ncall:1.6e+06 eff:0.6% logz-ratio=725.45+/-0.16 dlogz:131.751>0.1]
9504it [11:17:15 bound:2173 nc:140 ncall:1.6e+06 eff:0.6% logz-ratio=726.68+/-0.16 dlogz:130.502>0.1]
9520it [11:18:57 bound:2177 nc:136 ncall:1.6e+06 eff:0.6% logz-ratio=727.84+/-0.16 dlogz:129.317>0.1]
9552it [11:21:03 bound:2184 nc:230 ncall:1.7e+06 eff:0.6% logz-ratio=730.34+/-0.16 dlogz:126.812>0.1]
9568it [11:22:28 bound:2188 nc:168 ncall:1.7e+06 eff:0.6% logz-ratio=731.78+/-0.16 dlogz:125.356>0.1]
9584it [11:23:37 bound:2192 nc:182 ncall:1.7e+06 eff:0.6% logz-ratio=732.97+/-0.16 dlogz:124.127>0.1]
9616it [11:25:27 bound:2199 nc:223 ncall:1.7e+06 eff:0.6% logz-ratio=735.10+/-0.16 dlogz:121.963>0.1]
9632it [11:26:35 bound:2203 nc:194 ncall:1.7e+06 eff:0.6% logz-ratio=736.23+/-0.16 dlogz:120.832>0.1]
9648it [11:28:11 bound:2207 nc:204 ncall:1.7e+06 eff:0.6% logz-ratio=737.29+/-0.16 dlogz:119.739>0.1]
9664it [11:29:36 bound:2211 nc:218 ncall:1.7e+06 eff:0.6% logz-ratio=738.24+/-0.16 dlogz:118.769>0.1]
9680it [11:30:54 bound:2216 nc:235 ncall:1.7e+06 eff:0.6% logz-ratio=739.16+/-0.16 dlogz:117.830>0.1]
9696it [11:32:18 bound:2220 nc:182 ncall:1.7e+06 eff:0.6% logz-ratio=740.07+/-0.16 dlogz:116.896>0.1]
9712it [11:34:14 bound:2224 nc:261 ncall:1.7e+06 eff:0.6% logz-ratio=741.11+/-0.16 dlogz:115.887>0.1]
9728it [11:36:14 bound:2229 nc:293 ncall:1.7e+06 eff:0.6% logz-ratio=742.21+/-0.16 dlogz:114.734>0.1]
9744it [11:37:32 bound:2234 nc:155 ncall:1.7e+06 eff:0.6% logz-ratio=743.06+/-0.16 dlogz:113.868>0.1]
9760it [11:38:42 bound:2238 nc:179 ncall:1.7e+06 eff:0.6% logz-ratio=743.93+/-0.16 dlogz:112.991>0.1]
9776it [11:40:15 bound:2242 nc:202 ncall:1.7e+06 eff:0.6% logz-ratio=745.15+/-0.16 dlogz:111.764>0.1]
9792it [11:41:44 bound:2247 nc:222 ncall:1.7e+06 eff:0.6% logz-ratio=746.33+/-0.16 dlogz:110.560>0.1]
9808it [11:43:17 bound:2252 nc:117 ncall:1.7e+06 eff:0.6% logz-ratio=747.29+/-0.16 dlogz:109.588>0.1]
9824it [11:44:45 bound:2256 nc:187 ncall:1.7e+06 eff:0.6% logz-ratio=748.27+/-0.16 dlogz:108.589>0.1]
9840it [11:46:04 bound:2260 nc:169 ncall:1.7e+06 eff:0.6% logz-ratio=749.22+/-0.16 dlogz:107.619>0.1]
9856it [11:47:35 bound:2264 nc:154 ncall:1.7e+06 eff:0.6% logz-ratio=750.11+/-0.16 dlogz:106.698>0.1]
9872it [11:48:57 bound:2269 nc:134 ncall:1.7e+06 eff:0.6% logz-ratio=751.09+/-0.16 dlogz:105.706>0.1]
9888it [11:50:12 bound:2273 nc:158 ncall:1.7e+06 eff:0.6% logz-ratio=751.86+/-0.16 dlogz:104.915>0.1]
9904it [11:51:37 bound:2277 nc:195 ncall:1.7e+06 eff:0.6% logz-ratio=752.67+/-0.16 dlogz:104.090>0.1]
9920it [11:53:41 bound:2281 nc:204 ncall:1.7e+06 eff:0.6% logz-ratio=753.41+/-0.16 dlogz:103.328>0.1]
9936it [11:55:12 bound:2285 nc:183 ncall:1.7e+06 eff:0.6% logz-ratio=754.28+/-0.16 dlogz:102.459>0.1]
9952it [11:56:44 bound:2290 nc:250 ncall:1.7e+06 eff:0.6% logz-ratio=755.16+/-0.16 dlogz:101.555>0.1]
9968it [11:58:41 bound:2295 nc:270 ncall:1.7e+06 eff:0.6% logz-ratio=756.04+/-0.16 dlogz:100.673>0.1]
9984it [12:00:34 bound:2300 nc:309 ncall:1.7e+06 eff:0.6% logz-ratio=757.05+/-0.16 dlogz:99.644>0.1]
10000it [12:02:09 bound:2304 nc:181 ncall:1.7e+06 eff:0.6% logz-ratio=757.94+/-0.16 dlogz:98.726>0.1]
10016it [12:03:45 bound:2309 nc:166 ncall:1.7e+06 eff:0.6% logz-ratio=758.89+/-0.16 dlogz:97.778>0.1]
10032it [12:05:16 bound:2314 nc:158 ncall:1.7e+06 eff:0.6% logz-ratio=759.92+/-0.16 dlogz:96.722>0.1]
10048it [12:06:55 bound:2318 nc:149 ncall:1.7e+06 eff:0.6% logz-ratio=760.74+/-0.16 dlogz:95.875>0.1]
10063it [12:08:46 bound:2323 nc:164 ncall:1.7e+06 eff:0.6% logz-ratio=761.38+/-0.16 dlogz:95.218>0.1]
10079it [12:10:21 bound:2328 nc:201 ncall:1.8e+06 eff:0.6% logz-ratio=762.12+/-0.16 dlogz:94.484>0.1]
