000 (14482688.000.000) 01/19 15:10:24 Job submitted from host: <10.2.11.2:9618?addrs=10.2.11.2-9618&noUDP&sock=2702559_4365_3>
    DAG Node: IMRPhenomXPHM20Hz_GW170817_full_data0_1187008882-43_generation_arg_0
...
001 (14482688.000.000) 01/19 15:10:42 Job executing on host: <10.2.1.49:9618?addrs=10.2.1.49-9618&noUDP&sock=1774_6519_141>
...
005 (14482688.000.000) 01/19 15:11:53 Job terminated.
	(1) Normal termination (return value 0)
		Usr 0 00:00:26, Sys 0 00:00:04  -  Run Remote Usage
		Usr 0 00:00:00, Sys 0 00:00:00  -  Run Local Usage
		Usr 0 00:00:26, Sys 0 00:00:04  -  Total Remote Usage
		Usr 0 00:00:00, Sys 0 00:00:00  -  Total Local Usage
	0  -  Run Bytes Sent By Job
	0  -  Run Bytes Received By Job
	0  -  Total Bytes Sent By Job
	0  -  Total Bytes Received By Job
	Partitionable Resources :    Usage  Request Allocated 
	   Cpus                 :        0        1         1 
	   Disk (KB)            :        1  1048576   1067317 
	   Memory (MB)          :       37     8192      8192 
...
000 (14482691.000.000) 01/19 15:11:59 Job submitted from host: <10.2.11.2:9618?addrs=10.2.11.2-9618&noUDP&sock=2702559_4365_3>
    DAG Node: IMRPhenomXPHM20Hz_GW170817_full_data0_1187008882-43_analysis_H1L1V1_arg_0
...
001 (14482691.000.000) 01/19 15:12:00 Job executing on host: <10.2.1.77:9618?addrs=10.2.1.77-9618&noUDP&sock=1787_4fd4_140>
...
005 (14482691.000.000) 01/22 05:51:20 Job terminated.
	(1) Normal termination (return value 1)
		Usr 33 05:17:33, Sys 1 22:01:08  -  Run Remote Usage
		Usr 0 00:00:00, Sys 0 00:00:00  -  Run Local Usage
		Usr 33 05:17:33, Sys 1 22:01:08  -  Total Remote Usage
		Usr 0 00:00:00, Sys 0 00:00:00  -  Total Local Usage
	84682752  -  Run Bytes Sent By Job
	76119144  -  Run Bytes Received By Job
	84682752  -  Total Bytes Sent By Job
	76119144  -  Total Bytes Received By Job
	Partitionable Resources :    Usage  Request Allocated 
	   Cpus                 :    16.00       16        16 
	   Disk (KB)            : 95856     1048576   1071991 
	   Memory (MB)          :  1595        8192      8192 
...
