varX,varP,nbar,Δ,r,window_max
203.8955430027478,170.52607018004312,187.92765000397785,0.01,4.258596595708118,0.9391013674242926
245.52535820159918,276.9989722385243,261.7745069180322,0.012512420061455322,4.034459932776112,0.9063135408616253
304.2275254181952,381.99090815929816,343.3807269329573,0.015656065579430962,3.810323269844106,0.8572646001662105
338.58000037071,403.8310381750003,371.28178488501015,0.01958952690395321,3.5861866069121002,0.7857497178268671
331.38665436956603,339.4858987214643,335.3581050157523,0.024511238942744294,3.362049943980094,0.6855771110132877
299.0770193355743,248.41627203776864,273.5016809371511,0.03066949178783187,3.1379132810480876,0.5537690547136247
251.33361824305175,167.38101131846992,208.9568523998724,0.03837495643207069,2.913776618116081,0.39641830765938196
192.99862904886805,108.26823107684913,150.1519317290869,0.04801635747181153,2.6896399551840746,0.23489123016539834
134.77420341940612,69.25519445919244,101.5157657086936,0.06008008345083048,2.4655032922520683,0.103520161291869
88.23395790997576,44.238068863773904,65.73602313486909,0.07517472414640812,2.2413666293200625,0.028702292545553086
56.517018222612656,28.256195749828287,41.88660699113619,0.09406177265238869,2.017229966388056,0.003852158029366011
36.110007734103334,18.04808213729363,26.579044935698523,0.11769404111517978,1.7930933034560501,0.00016602079857814023
23.0773924536911,11.5278529243038,16.80262268899745,0.14726372811633237,1.5689566405240434,1.2085416434379526e-06
14.760325381087412,7.363186405816695,10.56175589345205,0.18426256260074997,1.344819977592037,5.434379754957914e-10
9.459120899281679,4.703088632550303,6.5811047659159865,0.2305570584860791,1.120683314660031,3.1252880840231858e-15
6.073159713854933,3.0040030639501767,4.0385813889025535,0.2884826763911344,0.896546651728025,1.9530112641833168e-23
3.7458231024799344,1.9183942092482562,2.332108655864094,0.36096164274587544,0.6724099887960185,2.7936913776404214e-36
1.885441406660497,1.2172983859166038,1.0513698962885503,0.4516503700109361,0.4482733258640124,2.1712197760849946e-56
0.7680374960859011,0.7536890747803293,0.2608632854331152,0.5651239150488556,0.22413666293200624,7.131459343752647e-88
0.569621582142819,0.47679280595239343,0.023207194047606346,0.7071067811865476,-1.1102230246251564e-16,3.650603079495543e-137
