1.e-10,1.7999983802840331,1.7999983802840331
1,3.272740889248602,3.272740889248602
2,4.500017634612019,4.500017634612019
3,5.538480160817467,5.538480160817467
4,6.428589281724516,6.428589281724516
5,7.2000153144907815,7.2000153144907815
6,7.875011817325715,7.875011817325715
7,8.470599747045403,8.470599747045403
8,9.000005972814904,9.000005972814904
9,9.473678667525604,9.473678667525604
10,9.899987481669594,9.899987481669594
11,10.285713687110672,10.285713687110672
12,10.636363698036078,10.636363698036078
13,10.956503365797785,10.956503365797785
14,11.24998838255172,11.24998838255172
15,11.519983698423044,11.519983698423044
16,11.769219551561127,11.769219551561127
17,12.000003594118908,12.000003594118908
18,12.214196716543864,12.214196716543864
19,12.413708975954105,12.413708975954105
20,12.599906984953991,12.599906984953991
21,12.774161534272428,12.774161534272428
22,12.937472623126835,12.937472623126835
23,13.090852589394954,13.090852589394954
24,13.235165581635828,13.235165581635828
25,13.371430791961807,13.371430791961807
26,13.500034107608123,13.500034107608123
27,13.621569814647659,13.621569814647659
28,13.736853306583106,13.736853306583106
29,13.846121482029362,13.846121482029362
30,13.949948497895397,13.949948497895397
31,14.048772203979944,14.048772203979944
32,14.142951901897282,14.142951901897282
33,14.232483560888943,14.232483560888943
34,14.317878976111976,14.317878976111976
35,14.400027591473679,14.400027591473679
36,14.478037841018988,14.478037841018988
37,14.553451151574105,14.553451151574105
38,14.625058359883592,14.625058359883592
39,14.69391720225561,14.69391720225561
40,14.759895040921938,14.759895040921938
41,14.823197524174503,14.823197524174503
42,14.884879482211122,14.884879482211122
43,14.943678806052285,14.943678806052285
44,14.999892421741526,14.999892421741526
45,15.054967773766771,15.054967773766771
46,15.106890252682794,15.106890252682794
47,15.157806225893603,15.157806225893603
48,15.206952662453707,15.206952662453707
49,15.254662476168702,15.254662476168702
50,15.299901919160616,15.299901919160616
