0.001,1.8014403333178373
1.001,2.976163205735075
2.001,3.7506423169534853
3.001,4.260787485085186
4.001,4.592126210004288
5.001,4.800190749911591
6.001,4.92199776553215
7.001,4.982779786394603
8.001,5.000074630481458
9.001,4.986286460546711
10.001,4.950328969326688
11.001,4.898699039181511
12.001,4.836188870815053
13.001,4.766365561536186
14.001,4.691899817289144
15.001,4.614795881494511
16.001,4.536555905965147
17.001,4.458299988541802
18.001,4.380855528008725
19.001,4.304824800531325
20.001,4.2306366912406554
21.001,4.158586642045346
22.001,4.088867677001957
23.001,4.02159457870969
24.001,3.9568227557445446
25.001,3.8945629678647333
26.001,3.8347928061513032
27.001,3.7774656252059664
28.001,3.7225174728463215
29.001,3.66987244589328
30.001,3.619446809653061
31.001,3.5711521473369547
32.001,3.524897749464989
33.001,3.480592408938381
34.001,3.438145752410239
35.001,3.3974692108732203
36.001,3.358476710479415
37.001,3.3210851473022514
38.001,3.2852146960823343
39.001,3.2507889922111266
40.001,3.217735217695141
41.001,3.185984115132522
42.001,3.1554699484454383
43.001,3.126130424946743
44.001,3.097906590041442
45.001,3.0707427032860393
46.001,3.0445861025035716
47.001,3.019387061063358
48.001,2.99509864218933
49.001,2.9716765531871507
