QFI,nbar,Δ,r,window_max,var_x,var_p,ratio_var_x_to_var_p,ratio_var_x_to_nbar,ratio_ECQFI_UB,ECQFI_UB,ratio_TMSV,TMSV,QFI_lossless,ratio_TMSV_lossless,TMSV_lossless
16.971867105212148,49.50198670274232,0.1,2.3025850929940455,0.0018674427317079893,50.00397484286404,49.99999855895076,1.0000795256805577,1.0101407675440612,0.8867879795301646,19.138584979697324,0.99982874360711,16.974774143802136,200.02994541435805,1.000210003619356,199.98794722161392
15.43216080664193,29.478382638162476,0.1291549665014884,2.046742304883596,2.8065070817523398e-05,29.98255276046749,29.97421251585745,1.0002782473302887,1.0171030455942425,0.8295321178852121,18.60345184220749,0.9994623846596892,15.440461835786332,119.93770710252328,1.0002615853830783,119.90634135628606
13.419129428153768,17.476024716968592,0.16681005372000587,1.7908995167731467,2.55319212913581e-08,17.9829811149146,17.969068319022586,1.0007742636204062,1.029008679385408,0.7549608494512059,17.774603064395148,0.9977943642135156,13.448792566323055,71.93432693184626,1.0004563613335875,71.90151386109365
11.006539037200797,10.283761087694861,0.21544346900318834,1.5350567286626973,2.158996321208096e-13,10.795348725229932,10.772173450159782,1.0021514019596303,1.0497471336773097,0.6652183321308135,16.54575423672538,0.989271840389194,11.125899462447716,43.18229985138708,1.0011171157128158,43.13411405481805
8.28355120600382,5.971954073150419,0.2782559402207124,1.2792139405522478,7.451758887596273e-22,6.486159821226577,6.4577483250742524,1.004399597928276,1.086103433110445,0.5583876387380567,14.834768235064185,0.9488320310625117,8.730260925875168,25.944807563927696,1.0022144431915019,25.887481207422788
5.203123964844741,3.2964751646938404,0.35938136638046275,1.023371152441798,5.712201840547565e-36,3.7216319227724903,3.8713184066151882,0.9613344943193207,1.1289731415641155,0.41501611674872574,12.537161220644851,0.805113015912208,6.46260073059371,14.886583092333897,0.9802972151551269,15.185785353861455
2.055975360723927,1.4547566688105544,0.46415888336127786,0.7675283643313487,1.624819267807172e-59,1.588747714462046,2.3207656231590605,0.6845791313900191,1.0921054692679608,0.2231265605307838,9.214390952977885,0.47969295958301034,4.286023631681304,6.3550009539605234,0.8127643072306884,7.8189961067726514
0.32419779001044907,0.41921310098944,0.5994842503189409,0.5116855762208993,8.58444731958115e-99,0.448737275100899,1.3896889268779804,0.32290483605493947,1.070427603626354,0.059358567375330025,5.461684881316538,0.11900507622722116,2.7242349678550286,1.7949499057339724,0.4881765728982825,3.6768456443483863
0.013938232233676804,0.0722378752458508,0.774263682681127,0.2558427881104496,2.603591666810278e-164,0.31470324035391395,0.8297725101377876,0.3792644809378609,4.356485282587126,0.004384076157620573,3.1792860645107233,0.006546526351484629,2.1291035100646734,1.2588133574702576,0.5499525864181893,2.288948881336915
1.9316866374760544,4.3808636834050844e-05,1.0,1.1102230246251568e-16,1.3326902844023858e-273,0.5011013833130795,0.4989862339605882,1.004238893196918,11438.415333745144,0.954413275665363,2.0239519783810547,0.9658023041941786,2.0000849336218613,2.004406537578717,1.0021164683675814,2.000173234198852
