1.000000000000000048e-04,7.667900224775112683e+00
1.291549665014884106e-04,7.677180186876371160e+00
1.668100537200059119e-04,7.682752060325332089e+00
2.154434690031884489e-04,7.686095118257060044e+00
2.782559402207125773e-04,7.688099440702109710e+00
3.593813663804625697e-04,7.689299744594376484e+00
4.641588833612777317e-04,7.690016634153330699e+00
5.994842503189408769e-04,7.690441729982014252e+00
7.742636826811269846e-04,7.690688706411006770e+00
1.000000000000000021e-03,7.690823623629269967e+00
1.103250005648551786e-03,7.690854006580215341e+00
1.219322774915984793e-03,7.690874853279570544e+00
1.347607543001844025e-03,7.690886355003264008e+00
1.489389132488399842e-03,7.690888973530536354e+00
1.646087541951012133e-03,7.690882813894916126e+00
1.819272167804291979e-03,7.690867628576791404e+00
2.010677522426587011e-03,7.690842812190977540e+00
2.222220605985997938e-03,7.690807360669762893e+00
2.456020105953656170e-03,7.690759853332234108e+00
2.714417616594906862e-03,7.690698382163149383e+00
3.000001090960045021e-03,7.690620478396781756e+00
3.315630760255488304e-03,7.690523013265305075e+00
3.664467780188150874e-03,7.690402072414132206e+00
4.050005891187461252e-03,7.690252798660842437e+00
4.476106409594617433e-03,7.690069196973561283e+00
4.947036900269687933e-03,7.689843893627711147e+00
5.467513917937969793e-03,7.689567840141366517e+00
6.042750245347018254e-03,7.689229949973147349e+00
6.678507101343188375e-03,7.688816653173080162e+00
7.381151841752156550e-03,7.688311351483902101e+00
8.157721730960477632e-03,7.687693751998167180e+00
9.015994422895851415e-03,7.686939052508230397e+00
9.964565857300732021e-03,7.686016944966906905e+00
1.101293635146145637e-02,7.684890399986512577e+00
1.217160574963529682e-02,7.683514180126555182e+00
1.345217858313468157e-02,7.681833025250451641e+00
1.486748029428815523e-02,7.679779436341620524e+00
1.643168568830719045e-02,7.677270970351975699e+00
1.816046089955464932e-02,7.674206939799915972e+00
2.007112029406340689e-02,7.670464386049499872e+00
2.218279987974548437e-02,7.665893173834526841e+00
2.451664896106380692e-02,7.660310017204289501e+00
2.709604195766327980e-02,7.653491218434918864e+00
2.994681250840859621e-02,7.645163861513306180e+00
3.309751220547331452e-02,7.634995164417951230e+00
3.657969654980383623e-02,7.622579671533171286e+00
4.042824099191517917e-02,7.607423949194501489e+00
4.468169022329234602e-02,7.588928491485571470e+00
4.938264421668775439e-02,7.566366651909549823e+00
5.457818488166128051e-02,7.538860675013909329e+00
6.032034760848601490e-02,7.505355398752184826e+00
6.666664242311885757e-02,7.464591066602894287e+00
7.368062997280773463e-02,7.415078112228855822e+00
8.143255811105885866e-02,7.355078941551907334e+00
9.000006545761461696e-02,7.282604743565490146e+00
9.946895897987149959e-02,7.195439045056675198e+00
1.099340733835239975e-01,7.091203251219702075e+00
1.215002209195699401e-01,6.967480847622175233e+00
1.342832411203708776e-01,6.822012679687179393e+00
1.484111609782866603e-01,6.652961052915414619e+00
1.640254771865314043e-01,6.459211455616284070e+00
1.812825732844013660e-01,6.240640274529217990e+00
2.003552859001399566e-01,5.998241990749234809e+00
2.214346357779821695e-01,5.734014424076528726e+00
2.447317409262990129e-01,5.450581963171259758e+00
2.704799310477720709e-01,5.150689062219693248e+00
2.989370844284541251e-01,4.836829044227170193e+00
3.303882106905790539e-01,4.511243846219612053e+00
3.651483052764145087e-01,4.176295962840176124e+00
4.035655042519339930e-01,3.834952089836688227e+00
4.460245710269143959e-01,3.491073088538210190e+00
4.929507499123412795e-01,3.149380479700807367e+00
5.448140251100125342e-01,2.815147165682841734e+00
6.021338277898051761e-01,2.493715648658271000e+00
6.654842383978480935e-01,2.189940714566387392e+00
7.354997362987587550e-01,1.907670847378114098e+00
8.128815543368900220e-01,1.649409311938459188e+00
8.984047019600170936e-01,1.416240361020465244e+00
9.929257272448336336e-01,1.207935192001915015e+00
1.097391295563989067e+00,1.023137516622449672e+00
1.212847670813411716e+00,8.597510831990143876e-01
1.340451194158158277e+00,7.155713153934980530e-01
1.481479865245550309e+00,5.889471443029757891e-01
1.637346141876027339e+00,4.790095650749531253e-01
1.809611086325473961e+00,3.851788723076092213e-01
2.000000000000000000e+00,3.066182680943128069e-01
