"sigma","QFI lossless","QFI lossy"
0.00001,2.4000001576872942,1.231001957245217e-8
0.020211919191919194,2.3988240340587357,0.04908460045674246
0.040413838383838385,2.395305359586684,0.18307331970174048
0.06061575757575758,2.3894645542959476,0.3703015798174681
0.08081767676767677,2.381335576936226,0.5764480753883952
0.10101959595959598,2.370965276535617,0.7758599198376273
0.12122151515151515,2.3584127243203223,0.9542678181697799
0.14142343434343438,2.343748385611026,1.1062919843152255
0.16162535353535354,2.327053152998771,1.2318410723626354
0.18182727272727273,2.308417264960353,1.333333804845792
0.20202919191919194,2.287939135985355,1.414038541324437
0.22223111111111113,2.265724125227687,1.4772374043004421
0.24243303030303032,2.241883270687686,1.5258751185946242
0.26263494949494953,2.216532015044834,1.5624562463700729
0.28283686868686875,2.1897889476025267,1.5890551294230664
0.3030387878787879,2.1617745845090277,1.6073687783510122
0.3232407070707071,2.1326102066340304,1.6187798915155762
0.3434426262626263,2.102416771365601,1.624416131857253
0.36364454545454544,2.0713139113027634,1.6252008736294987
0.38384646464646466,2.0394190294977648,1.6218946819787905
0.4040483838383839,2.006846497675853,1.6151283997573114
0.42425030303030303,1.9737069608336237,1.605429204915197
0.44445222222222225,1.9401067488708286,1.5932410105468977
0.46465414141414146,1.906147393501558,1.578940409650671
0.4848560606060606,1.8719252466532295,1.5628491525633437
0.5050579797979798,1.8375311949084001,1.5452439421528885
0.525259898989899,1.8030504632707516,1.5263641590393744
0.5454618181818183,1.7685625006237322,1.506417989380703
0.5656637373737374,1.7341409386684106,1.4855873179196748
0.5858656565656566,1.699853615839524,1.4640316640123452
0.6060675757575757,1.66576265766381,1.4418913731984757
0.626269494949495,1.63192460520024,1.4192902271422867
0.6464714141414142,1.598390583545157,1.3963375968881493
0.6666733333333335,1.565206502856843,1.3731302355262318
0.6868752525252526,1.532413284917185,1.349753784375962
0.7070771717171719,1.5000471088704515,1.326284050013948
0.7272790909090909,1.4681396704330147,1.302788096641712
0.7474810101010101,1.4367184495300185,1.2793251884575632
0.7676829292929294,1.4058069819667616,1.255947609148375
0.7878848484848485,1.375425131369509,1.2327013798084885
0.8080867676767678,1.3455893582218073,1.2096268921133244
0.828288686868687,1.3163129833707963,1.1867594701126698
0.8484906060606061,1.2876064438787789,1.1641298713259651
0.8686925252525253,1.2594775395462732,1.141764735738148
0.8888944444444445,1.231931668833347,1.1196869896717432
0.9090963636363637,1.2049720532574184,1.0979162102429685
0.929298282828283,1.1785999496498716,1.0764689551155053
0.9495002020202021,1.1528148499137563,1.0553590614829096
0.9697021212121213,1.1276146681438377,1.0345979175914022
0.9899040404040405,1.102995915152045,1.0141947096219701
1.0101059595959596,1.0789538605896578,0.9941566463559717
1.030307878787879,1.0554826829761996,0.9744891637296769
1.0505097979797982,1.0325756080375303,0.9551961111235623
1.070711717171717,1.0102250358255342,0.9362799210185834
1.0909136363636365,0.9884226571423023,0.9177417634741186
1.1111155555555556,0.9671595598256995,0.8995816867329223
1.131317474747475,0.9464263254733523,0.8817987451314101
1.151519393939394,0.9262131171908485,0.8643911153842435
1.1717213131313131,0.9065097589492613,0.8473562022169782
1.1919232323232325,0.8873058071289788,0.83069073423678
1.2121251515151517,0.8685906148127326,0.8143908508567502
1.2323270707070708,0.8503533893720993,0.7984521810226668
1.25252898989899,0.8325832438697547,0.7828699144306863
1.2727309090909094,0.8152692427753292,0.7676388658697204
1.2929328282828283,0.7984004424667557,0.7527535332721252
1.3131347474747475,0.7819659269620688,0.7382081500103982
1.3333366666666668,0.7659548392994153,0.7239967319352241
1.353538585858586,0.7503564089558262,0.7101131196111877
1.3737405050505052,0.7351599756686183,0.6965510161703312
1.3939424242424243,0.7203550099972562,0.6833040211703191
1.4141443434343437,0.7059311309384279,0.6703656608130177
1.4343462626262629,0.6918781208830307,0.6577294148505994
1.4545481818181818,0.6781859381809126,0.6453887404797107
1.4747501010101012,0.6648447275575605,0.6333370934996323
1.4949520202020203,0.6518448286065522,0.6215679469875659
1.5151539393939395,0.6391767825624795,0.6100748077230949
1.5353558585858587,0.6268313375412026,0.5988512305743805
1.5555577777777778,0.6147994524176877,0.5878908310406369
1.5757596969696972,0.6030722994962493,0.5771872961287982
1.5959616161616161,0.5916412661137683,0.5667343937269692
1.6161635353535355,0.5804979553032755,0.5565259806231062
1.6363654545454547,0.5696341856331703,0.5465560093043674
1.656567373737374,0.5590419903261927,0.5368185336606046
1.676769292929293,0.5487136157520592,0.5273077137044657
1.6969712121212122,0.5386415193782972,0.5180178194104671
1.7171731313131315,0.5288183672552871,0.5089432337661371
1.7373750505050507,0.5192370311036963,0.5000784551198159
1.7575769696969699,0.5098905850654031,0.4914180989019237
1.777778888888889,0.5007723021725293,0.4829568987893722
1.7979808080808084,0.49187565058333854,0.4746897073762758
1.8181827272727273,0.4831942896284243,0.4666114964081604
1.8383846464646465,0.47472206570578457,0.45871735663141855
1.8585865656565659,0.4664530080590201,0.45100249730479725
1.878788484848485,0.45838132446893226,0.4434622454151666
1.8989904040404042,0.45050139688525137,0.4360920446356847
1.9191923232323234,0.44280777702199303,0.428887454060717
1.9393942424242425,0.4352951819370687,0.4218441467484351
1.959596161616162,0.42795848961415484,0.4149579080989018
1.9797980808080808,0.4207927345625047,0.40822463409262827
2.,0.41379310344827586,0.40164032941199085
