0.,1.9999980000020001,1.7999983799996575
0.1,3.7266429721953003,0.00027914293156988587
0.2,4.759580467396475,0.00021828687372408526
0.30000000000000004,5.697982965808172,0.0002020046192206088
0.4,6.593304173517535,0.00019742246533524424
0.5,7.464073758835255,0.00019755686654287125
0.6000000000000001,8.319148984189237,0.00019999538407877997
0.7000000000000001,9.163442861319387,0.00020368100525300971
0.8,9.999950000249996,0.000208078929031898
0.9,10.830620080765524,0.0002128912356561861
1.,11.656786308762873,0.00021794028154821513
1.1,12.479395793282709,0.00022311476234195096
1.2000000000000002,13.299142289527904,0.00022834235305327228
1.3,14.116546947164098,0.0002335748000873155
1.4000000000000001,14.932009628641234,0.00023877931991165963
1.5,15.74584272565728,0.00024393339891601938
1.6,16.558294132061192,0.0002490215249162015
1.7000000000000002,17.36956326207735,0.00025403306434908777
1.8,18.17981247396452,0.00025896084455084666
1.9000000000000001,18.98917537934177,0.0002638001839689993
2.,19.797762993482973,0.000268548214911965
2.1,20.605668358766927,0.00027320340202819114
2.2,21.41297006903913,0.0002777651945671027
2.3000000000000003,22.21973499011062,0.0002822337718264966
2.4000000000000004,23.02602038380908,0.0002866098546120917
2.5,23.8318755836684,0.00029089456416847505
2.6,24.63734332954076,0.0002950893157116501
2.7,25.44246083989909,0.0002991957374894954
2.8000000000000003,26.247260680372847,0.0003032156088816353
2.9000000000000004,27.05177147252111,0.00030715081283862097
3.,27.856018476264484,0.00031100329921547826
3.1,28.660024071605424,0.0003147750564472771
3.2,29.463808159468456,0.00031846808965696883
3.3000000000000003,30.267388497134466,0.0003220844037535489
3.4000000000000004,31.070780980436606,0.00032562599042275055
3.5,31.873999882357552,0.00032909481816810655
3.6,32.67705805571583,0.0003324928247517973
3.7,33.47996710611358,0.0003358219115294873
3.8000000000000003,34.282737540130135,0.00033908393928361666
3.9000000000000004,35.08537889281192,0.00034228072524420587
4.,35.887899837765346,0.00034541404105153646
4.1000000000000005,36.6903082825688,0.00034848561146585044
4.2,37.4926114517439,0.000351497113668861
4.3,38.29481595914331,0.0003544501770330586
4.4,39.09692787130093,0.00035734638325941214
4.5,39.89895276303723,0.00036018726680359456
4.6000000000000005,40.70089576640492,0.00036297431552643767
4.7,41.50276161388901,0.00036570897151676684
4.800000000000001,42.30455467663523,0.0003683926320447676
4.9,43.10627899836265,0.0003710266506120876
5.,43.907938325519574,0.0003736123380713907
5.1000000000000005,44.70953613416083,0.00037615096379334505
5.2,45.51107565395503,0.00037864375686331135
5.300000000000001,46.31255988967413,0.000381091907293489
5.4,47.11399164046868,0.0003834965672391045
5.5,47.915373517190474,0.00038585885220955633
5.6000000000000005,48.71670795799016,0.00038817984226732424
5.7,49.51799724238748,0.00039046058320899707
5.800000000000001,50.31924350398555,0.0003927020877240441
5.9,51.12044874197992,0.0003949053365279975
6.,51.9216148315939,0.00039707127946754956
6.1000000000000005,52.72274353355461,0.0003992008365957773
6.2,53.5238365027123,0.0004012948992162607
6.300000000000001,54.324895295891174,0.00040335433089532365
6.4,55.1259213790512,0.0004053799684420062
6.5,55.92691613383019,0.0004073726228556655
6.6000000000000005,56.72788086352798,0.0004093330802413567
6.7,57.52881679858755,0.0004112621026933331
6.800000000000001,58.329725101621705,0.0004131604291471527
6.9,59.13060687202898,0.0004150287762010081
7.,59.931463150237086,0.0004168678389069779
7.1000000000000005,60.73229492160853,0.0004186782915329677
7.2,61.533103120040046,0.00042046078829616835
7.300000000000001,62.33388863128256,0.00042221596406887837
7.4,63.13465229600754,0.0004239444350575703
7.5,63.93539491264147,0.0004256467994560887
7.6000000000000005,64.73611723998908,0.0004273236380738673
7.7,65.53681999966312,0.00042897551494005756
7.800000000000001,66.3375038783377,0.000430602977884438
7.9,67.13816952983912,0.0004322065590959761
8.,67.93881757708873,0.00043378677565988373
8.1,68.73944861390899,0.0004353441300739964
8.200000000000001,69.54006320670445,0.0004368791107452819
8.3,70.34066189602716,0.0004383921924672579
8.4,71.1412451980367,0.00043988383687908205
8.5,71.94181360586113,0.00044135449290704393
8.6,72.74236759086871,0.0004428045971891715
8.700000000000001,73.54290760385598,0.00044423457448363336
8.8,74.34343407615853,0.00044564483806159503
8.9,75.14394742069067,0.0004470357900851676
9.,75.94444803291937,0.0004484078219710543
9.1,76.74493629177643,0.0004497613147404797
9.200000000000001,77.54541256051462,0.0004510966393559699
9.3,78.34587718751055,0.00045241415704551596
9.4,79.14633050701927,0.00045371421961464415
9.5,79.94677283988281,0.0004549971697468841
9.600000000000001,80.74720449419685,0.00045626334129311426
9.700000000000001,81.5476257659378,0.0004575130595502374
9.8,82.34803693955314,0.00045874664152962196
9.9,83.14843828851794,0.00045996439621573155
10.,83.94883007585894,0.00046116662481533315
10.100000000000001,84.7492125546492,0.00046235362099767715
10.200000000000001,85.54958596847466,0.00046352567112600753
10.3,86.34995055187504,0.00046468305448075576
10.4,87.15030653075995,0.0004658260434747531
10.5,87.9506541228025,0.0004669549038607823
10.600000000000001,88.75099353781134,0.0004680698949317762
10.700000000000001,89.55132497808306,0.0004691712697139557
10.8,90.35164863873544,0.0004702592751531867
10.9,91.1519647080232,0.0004713341522948321
11.,91.95227336763737,0.0004723961364573443
11.100000000000001,92.75257479298892,0.00047344545739985564
11.200000000000001,93.55286915347793,0.0004744823394839969
11.3,94.35315661274903,0.00047550700183016776
11.4,95.15343732893393,0.00047651965846848277
11.5,95.9537114548814,0.0004775205184845885
11.600000000000001,96.75397913837668,0.0004785097861605591
11.700000000000001,97.55424052234903,0.000479487661111055
11.8,98.35449574507007,0.00048045433841492933
11.9,99.15474494034166,0.00048141000874244924
12.,99.9549882376753,0.00048235485847830764
12.100000000000001,100.75522576246304,0.0004832890698405776
12.200000000000001,101.5554576361395,0.0004842128209957647
12.3,102.35568397633736,0.0004851262861701058
12.4,103.15590489703462,0.0004860296357572483
12.5,103.95612050869592,0.00048692303642245246
12.600000000000001,104.75633091840656,0.00048780665120343934
12.700000000000001,105.55653623000093,0.0004886806396080096
12.8,106.35673654418518,0.000489545157708553
12.9,107.15693195865369,0.0004904003582335614
13.,107.95712256820157,0.0004912463906562535
13.100000000000001,108.75730846483063,0.0004920834012804169
13.200000000000001,109.55748973785232,0.0004929115333235673
13.3,110.35766647398489,0.000493730926997521
13.4,111.15783875744704,0.0004945417195864733
13.5,111.9580066700474,0.000495344045522673
13.600000000000001,112.7581702912702,0.0004961380364597746
13.700000000000001,113.55832969835684,0.0004969238213439534
13.8,114.35848496638508,0.0004977015264828608
13.9,115.15863616834399,0.0004984712756124951
14.,115.9587833752061,0.0004992331899620605
14.100000000000001,116.75892665599635,0.0004999873883168837
14.200000000000001,117.55906607785936,0.0005007339870794559
14.3,118.3592017061217,0.0005014731003286637
14.4,119.15933360435407,0.0005022048398772717
14.5,119.9594618344298,0.0005029293153277145
14.600000000000001,120.75958645658034,0.0005036466341262575
14.700000000000001,121.55970752945062,0.0005043569016155801
14.8,122.3598251101498,0.0005050602210858365
14.9,123.15993925430192,0.000505756693824239
15.,123.96005001609379,0.0005064464191632229
15.100000000000001,124.7601574483207,0.0005071294945272294
15.200000000000001,125.56026160243157,0.00050780601547816
15.3,126.36036252857073,0.0005084760757595423
15.4,127.16046027561985,0.0005091397673394495
15.5,127.96055489123694,0.0005097971804522153
15.600000000000001,128.76064642189428,0.0005104484036389826
15.700000000000001,129.56073491291562,0.0005110935237871252
15.8,130.36082040851116,0.000511732626168574
15.9,131.1609029518114,0.0005123657944770903
16.,131.9609825849,0.0005129931108645114
16.1,132.76105934884563,0.00051361465597601
16.2,133.56113328373218,0.0005142305089843881
16.3,134.36120442868776,0.0005148407476234475
16.400000000000002,135.16127282191385,0.0005154454482204546
16.5,135.9613385007117,0.0005160446857277373
16.6,136.76140150150928,0.000516638533753433
16.7,137.56146185988658,0.0005172270645914215
16.8,138.36151961059994,0.0005178103492504591
16.900000000000002,139.16157478760582,0.0005183884574825486
17.,139.96162742408396,0.0005189614578105603
17.1,140.76167755245916,0.0005195294175551297
17.2,141.5617252044227,0.0005200924028608546
17.3,142.36177041095306,0.0005206504787218127
17.400000000000002,143.16181320233568,0.0005212037090064193
17.5,143.96185360818268,0.0005217521564816417
17.6,144.7618916574506,0.0005222958828365981
17.7,145.56192737845947,0.0005228349487055512
17.8,146.36196079890954,0.0005233694136903163
17.900000000000002,147.16199194589845,0.0005238993363821031
18.,147.9620208459372,0.0005244247743828073
18.1,148.76204752496616,0.0005249457843257665
18.2,149.562072008371,0.000525462421895997
18.3,150.3620943209956,0.0005259747418499258
18.400000000000002,151.1621144871587,0.0005264827980346354
18.5,151.96213253066603,0.0005269866434066316
18.6,152.76214847482456,0.0005274863300501469
18.7,153.56216234245525,0.000527981909195001
18.8,154.36217415590573,0.0005284734312340189
18.900000000000002,155.1621839370624,0.0005289609457400301
19.,155.96219170736273,0.0005294445014824551
19.1,156.76219748780542,0.0005299241464434882
19.200000000000003,157.56220129896357,0.0005303999278338968
19.3,158.36220316099386,0.0005308718921084393
19.400000000000002,159.16220309364712,0.0005313400849809149
19.5,159.96220111627957,0.0005318045514388589
19.6,160.76219724786148,0.0005322653357578867
19.700000000000003,161.56219150698752,0.0005327224815157023
19.8,162.36218391188532,0.0005331760316057771
19.900000000000002,163.162174480425,0.0005336260282507087
20.,163.96216323012803,0.0005340725130152691
20.1,164.76215017817495,0.0005345155268191486
20.200000000000003,165.56213534141435,0.0005349551099494066
20.3,166.3621187363706,0.000535391302072635
20.400000000000002,167.16210037925154,0.0005358241422468428
20.5,167.9620802859561,0.0005362536689330691
20.6,168.76205847208158,0.000536679920006728
20.700000000000003,169.5620349529308,0.0005371029327687039
20.8,170.3620097435189,0.000537522743956189
20.900000000000002,171.16198285858067,0.0005379393897532795
21.,171.96195431257587,0.0005383529058013333
21.1,172.76192411969689,0.0005387633272090968
21.200000000000003,173.56189229387417,0.0005391706885626059
21.3,174.3618588487822,0.0005395750239348666
21.400000000000002,175.1618237978459,0.0005399763668953233
21.5,175.9617871542456,0.0005403747505191163
21.6,176.76174893092315,0.0005407702073961369
21.700000000000003,177.56170914058725,0.0005411627696398852
21.8,178.361667795718,0.0005415524688961339
21.900000000000002,179.1616249085731,0.0005419393363514052
22.,179.9615804911917,0.0005423234027412617
22.1,180.7615345554002,0.0005427046983584214
22.200000000000003,181.56148711281605,0.0005430832530606967
22.3,182.361438174853,0.0005434590962787635
22.400000000000002,183.16138775272546,0.0005438322570237658
22.5,183.96133585745247,0.0005442027638947565
22.6,184.76128249986232,0.0005445706450859833
22.700000000000003,185.56122769059647,0.0005449359283940166
22.8,186.36117144011345,0.0005452986412247335
22.900000000000002,187.16111375869312,0.000545658810600149
23.,187.96105465644004,0.0005460164631651089
23.1,188.76099414328806,0.0005463716251938405
23.200000000000003,189.56093222900245,0.000546724322596371
23.3,190.36086892318463,0.0005470745809248086
23.400000000000002,191.1608042352755,0.0005474224253794975
23.5,191.96073817455795,0.0005477678808150442
23.6,192.76067075016135,0.0005481109717462238
23.700000000000003,193.56060197106387,0.0005484517223537614
23.8,194.3605318460956,0.0005487901564899994
23.900000000000002,195.1604603839421,0.000549126297684448
24.,195.960387593147,0.000549460169149225
24.1,196.7603134821149,0.0005497917937843841
24.200000000000003,197.5602380591142,0.0005501211941831403
24.3,198.36016133228006,0.0005504483926369842
24.400000000000002,199.16008330961654,0.0005507734111407013
24.5,199.96000399900007,0.0005510962713972879
24.6,200.759923408181,0.0005514169948227693
24.700000000000003,201.55984154478702,0.0005517356025509251
24.8,202.3597584163251,0.0005520521154379189
24.900000000000002,203.15967403018385,0.000552366554066841
25.,203.95958839363547,0.000552678938752157
25.1,204.7595015138397,0.0005529892895440751
25.200000000000003,205.55941339784363,0.0005532976262328256
25.3,206.35932405258563,0.0005536039683528574
25.400000000000002,207.1592334848966,0.0005539083351869548
25.5,207.95914170150277,0.0005542107457702753
25.6,208.75904870902656,0.0005545112188943079
25.700000000000003,209.55895451398976,0.000554809773110758
25.8,210.35885912281515,0.0005551064267353574
25.900000000000002,211.15876254182717,0.0005554011978516016
26.,211.95866477725582,0.0005556941043144176
26.1,212.75856583523688,0.0005559851637537602
26.200000000000003,213.55846572181414,0.0005562743935781431
26.3,214.35836444294168,0.0005565618109781021
26.400000000000002,215.1582620044843,0.0005568474329295946
26.5,215.9581584122203,0.0005571312761973347
26.6,216.75805367184248,0.0005574133573380678
26.700000000000003,217.55794778896012,0.0005576936927037824
26.8,218.3578407691001,0.0005579722984448645
26.900000000000002,219.15773261770863,0.0005582491905131935
27.,219.95762334015285,0.0005585243846651808
27.1,220.75751294172193,0.0005587978964647522
27.200000000000003,221.55740142762832,0.0005590697412862773
27.3,222.35728880301028,0.0005593399343174457
27.400000000000002,223.1571750729318,0.0005596084905620886
27.5,223.95706024238407,0.0005598754248429529
27.6,224.75694431628878,0.000560140751804422
27.700000000000003,225.55682729949575,0.0005604044859151895
27.8,226.35670919678793,0.0005606666414708866
27.900000000000002,227.1565900128798,0.0005609272325966569
28.,227.95646975242047,0.0005611862732496925
28.1,228.7563484199931,0.0005614437772217192
28.200000000000003,229.5562260201178,0.0005616997581414419
28.3,230.35610255725135,0.0005619542294769434
28.400000000000002,231.15597803578953,0.0005622072045380438
28.5,231.95585246006655,0.000562458696478617
28.6,232.75572583435738,0.0005627087182988661
28.700000000000003,233.5555981628789,0.0005629572828475604
28.8,234.35546944978978,0.0005632044028242334
28.900000000000002,235.15533969919224,0.0005634500907813413
29.,235.95520891513306,0.000563694359126386
29.1,236.75507710160443,0.0005639372201239994
29.200000000000003,237.55494426254407,0.0005641786858979938
29.3,238.35481040183794,0.0005644187684333767
29.400000000000002,239.15467552331884,0.0005646574795783292
29.5,239.95453963076952,0.0005648948310461533
29.6,240.75440272792156,0.0005651308344171847
29.700000000000003,241.5542648184576,0.0005653655011406733
29.8,242.35412590601157,0.0005655988425366321
29.900000000000002,243.1539859941696,0.0005658308697976544
30.,243.95384508647072,0.0005660615939907018
30.1,244.75370318640776,0.0005662910260588598
30.200000000000003,245.55356029742785,0.0005665191768230671
30.3,246.35341642293363,0.0005667460569838123
30.400000000000002,247.15327156628354,0.0005669716771228074
30.5,247.9531257307925,0.0005671960477046273
30.6,248.7529789197332,0.0005674191790783288
30.700000000000003,249.552831136336,0.0005676410814790365
30.8,250.3526823837903,0.0005678617650295083
30.900000000000002,251.1525326652443,0.0005680812397416708
31.,251.95238198380704,0.0005682995155181323
31.1,252.7522303425477,0.0005685166021536705
31.200000000000003,253.55207774449667,0.0005687325093366941
31.3,254.3519241926464,0.0005689472466506847
31.400000000000002,255.15176968995172,0.0005691608235756102
31.5,255.95161423933075,0.0005693732494893207
31.6,256.7514578436648,0.0005695845336689166
31.700000000000003,257.55130050579976,0.0005697946852921012
31.8,258.3511422285461,0.0005700037134385029
31.900000000000002,259.1509830146799,0.0005702116270909855
32.,259.9508228669427,0.0005704184351369326
32.1,260.75066178804246,0.00057062414636951
32.2,261.5504997806541,0.0005708287694889132
32.300000000000004,262.3503368474199,0.0005710323131035908
32.4,263.1501729909502,0.0005712347857314522
32.5,263.95000821382314,0.0005714361958010514
32.6,264.7498425185866,0.0005716365516527577
32.7,265.5496759077566,0.0005718358615399054
32.800000000000004,266.3495083838202,0.0005720341336299239
32.9,267.1493399492336,0.0005722313760054549
33.,267.94917060642456,0.0005724275966654465
33.1,268.7490003577913,0.0005726228035262357
33.2,269.5488292057035,0.000572817004422611
33.300000000000004,270.34865715250385,0.0005730102071088585
33.4,271.1484842005055,0.0005732024192597941
33.5,271.9483103519969,0.0005733936484717781
33.6,272.74813560923707,0.0005735839022637153
33.7,273.54795997446047,0.0005737731880780388
33.800000000000004,274.3477834498748,0.0005739615132816791
33.9,275.1476060376618,0.0005741488851670208
34.,275.9474277399786,0.0005743353109528402
34.1,276.74724855895704,0.0005745207977852336
34.2,277.54706849670407,0.0005747053527385275
34.300000000000004,278.34688755530357,0.000574888982816179
34.4,279.14670573681383,0.0005750716949516596
34.5,279.9465230432708,0.0005752534960093268
34.6,280.7463394766872,0.0005754343927852838
34.7,281.5461550390527,0.0005756143920082247
34.800000000000004,282.3459697323336,0.0005757935003402682
34.9,283.1457835584756,0.00057597172437778
35.,283.9455965194012,0.0005761490706521783
35.1,284.74540861701183,0.0005763255456307352
35.2,285.5452198531873,0.0005765011557173595
35.300000000000004,286.345030229787,0.0005766759072533701
35.4,287.1448397486491,0.0005768498065182615
35.5,287.9446484115911,0.0005770228597304514
35.6,288.7444562204118,0.0005771950730480247
35.7,289.54426317688797,0.0005773664525694616
35.800000000000004,290.34406928277843,0.0005775370043343559
35.9,291.1438745398219,0.0005777067343241257
36.,291.94367894973885,0.0005778756484627119
36.1,292.74348251422947,0.0005780437526172642
36.2,293.5432852349775,0.0005782110525988235
36.300000000000004,294.34308711364673,0.0005783775541629884
36.4,295.142888151883,0.0005785432630105752
36.5,295.94268835131567,0.0005787081847882683
36.6,296.7424877135548,0.0005788723250892607
36.7,297.5422862401946,0.0005790356894538864
36.800000000000004,298.34208393281136,0.000579198283370242
36.9,299.141880792965,0.0005793601122748021
37.,299.94167682219796,0.0005795211815530229
37.1,300.74147202203767,0.0005796814965399417
37.2,301.54126639399425,0.0005798410625207634
37.300000000000004,302.34105993956166,0.0005799998847314409
37.4,303.1408526602192,0.0005801579683592486
37.5,303.94064455743,0.0005803153185433458
37.6,304.7404356326416,0.0005804719403753327
37.7,305.5402258872862,0.0005806278388998003
37.800000000000004,306.34001532278245,0.0005807830191148708
37.9,307.1398039405327,0.0005809374859727307
38.,307.93959174192486,0.0005810912443801599
38.1,308.7393787283338,0.0005812442991990468
38.2,309.5391649011187,0.000581396655246904
38.300000000000004,310.33895026162526,0.0005815483172973707
38.400000000000006,311.1387348111854,0.0005816992900807126
38.5,311.9385185511175,0.0005818495782843125
38.6,312.7383014827265,0.0005819991865531553
38.7,313.53808360730335,0.0005821481194903063
38.800000000000004,314.33786492612734,0.0005822963816573824
38.900000000000006,315.13764544046245,0.0005824439775750174
39.,315.9374251515621,0.000582590911723323
39.1,316.7372040606661,0.0005827371885423388
39.2,317.53698216900176,0.0005828828124324814
39.300000000000004,318.3367594777839,0.0005830277877549841
39.400000000000006,319.13653598821594,0.0005831721188323334
39.5,319.9363117014884,0.0005833158099486963
39.6,320.7360866187805,0.0005834588653503463
39.7,321.53586074125906,0.0005836012892460784
39.800000000000004,322.3356340700803,0.000583743085807624
39.900000000000006,323.1354066063882,0.0005838842591700577
40.,323.93517835131587,0.000584024813432198
40.1,324.7349493059849,0.0005841647526570029
40.2,325.53471947150626,0.0005843040808719638
40.300000000000004,326.3344888489799,0.0005844428020694899
40.400000000000006,327.13425743949466,0.000584580920207289
40.5,327.93402524412954,0.0005847184392087444
40.6,328.733792263952,0.000584855362963286
40.7,329.5335585000202,0.0005849916953267562
40.800000000000004,330.33332395338147,0.0005851274401217721
40.900000000000006,331.13308862507284,0.0005852626011380831
41.,331.93285251612184,0.0005853971821329222
41.1,332.7326156275461,0.0005855311868313541
41.2,333.5323779603529,0.0005856646189266188
41.300000000000004,334.3321395155409,0.0005857974820804724
41.400000000000006,335.13190029409816,0.000585929779923518
41.5,335.9316602970037,0.0005860615160555404
41.6,336.7314195252278,0.0005861926940458293
41.7,337.53117797973124,0.0005863233174335033
41.800000000000004,338.3309356614649,0.0005864533897278273
41.900000000000006,339.13069257137187,0.0005865829144085253
42.,339.93044871038563,0.0005867118949260936
42.1,340.73020407943125,0.000586840334702104
42.2,341.52995867942536,0.0005869682371295078
42.300000000000004,342.32971251127503,0.0005870956055729336
42.400000000000006,343.1294655758801,0.0005872224433689831
42.5,343.9292178741313,0.0005873487538265211
42.6,344.72896940691123,0.0005874745402269633
42.7,345.5287201750946,0.0005875998058245614
42.800000000000004,346.3284701795482,0.0005877245538466831
42.900000000000006,347.1282194211296,0.0005878487874940876
43.,347.9279679006896,0.0005879725099412007
43.1,348.7277156190715,0.0005880957243363856
43.2,349.5274625771099,0.000588218433802208
43.300000000000004,350.3272087756326,0.0005883406414357011
43.400000000000006,351.12695421545874,0.0005884623503086251
43.5,351.92669889740205,0.000588583563467725
43.6,352.72644282226616,0.0005887042839349846
43.7,353.5261859908501,0.0005888245147078783
43.800000000000004,354.3259284039438,0.0005889442587596163
43.900000000000006,355.12567006233087,0.0005890635190393931
44.,355.9254109667878,0.0005891822984726268
44.1,356.7251511180843,0.0005893005999611998
44.2,357.5248905169828,0.000589418426383694
44.300000000000004,358.32462916423924,0.0005895357805956249
44.400000000000006,359.12436706060237,0.000589652665429671
44.5,359.92410420681523,0.0005897690836959034
44.6,360.72384060361287,0.0005898850381820089
44.7,361.5235762517255,0.0005900005316535144
44.800000000000004,362.32331115187526,0.0005901155668540045
44.900000000000006,363.12304530477945,0.0005902301465053399
45.,363.92277871114777,0.0005903442733078726
45.1,364.7225113716845,0.000590457949940656
45.2,365.52224328708763,0.0005905711790616564
45.300000000000004,366.3219744580488,0.0005906839633079579
45.400000000000006,367.12170488525373,0.0005907963052959699
45.5,367.9214345693822,0.0005909082076216266
45.6,368.72116351110833,0.0005910196728605883
45.7,369.52089171109986,0.0005911307035684387
45.800000000000004,370.32061917001954,0.0005912413022808793
45.900000000000006,371.1203458885236,0.0005913514715139239
46.,371.92007186726363,0.0005914612137640874
46.1,372.71979710688413,0.0005915705315085771
46.2,373.51952160802597,0.0005916794272054746
46.300000000000004,374.3192453713227,0.0005917879032939247
46.400000000000006,375.1189683974037,0.000591895962194314
46.5,375.9186906868924,0.0005920036063084526
46.6,376.7184122404077,0.0005921108380197513
46.7,377.51813305856217,0.0005922176596933975
46.800000000000004,378.3178531419642,0.0005923240736765296
46.900000000000006,379.11757249121644,0.0005924300822984073
47.,379.9172911069163,0.0005925356878705835
47.1,380.71700898965696,0.0005926408926870708
47.2,381.5167261400264,0.0005927456990245073
47.300000000000004,382.316442558607,0.0005928501091423228
47.400000000000006,383.11615824597664,0.0005929541252828981
47.5,383.915873202709,0.0005930577496717284
47.6,384.7155874293721,0.000593160984517579
47.7,385.5153009265302,0.000593263832012646
47.800000000000004,386.3150136947419,0.0005933662943327062
47.900000000000006,387.11472573456166,0.0005934683736372764
48.,387.9144370465395,0.0005935700720697599
48.1,388.7141476312205,0.0005936713917575991
48.2,389.51385748914583,0.0005937723348124237
48.300000000000004,390.31356662085193,0.000593872903330197
48.400000000000006,391.11327502687095,0.0005939730993913603
48.5,391.91298270773024,0.0005940729250609763
48.6,392.7126896639536,0.0005941723823888734
48.7,393.51239589606007,0.0005942714734097814
48.800000000000004,394.31210140456466,0.0005943702001434743
48.900000000000006,395.1118061899782,0.0005944685645949057
49.,395.9115102528072,0.0005945665687543449
49.1,396.71121359355476,0.0005946642145975099
49.2,397.510916212719,0.0005947615040857022
49.300000000000004,398.31061811079456,0.0005948584391659359
49.400000000000006,399.1103192882721,0.0005949550217710694
49.5,399.9100197456383,0.0005950512538199328
49.6,400.7097194833764,0.000595147137217455
49.7,401.50941850196455,0.0005952426738547889
49.800000000000004,402.30911680187853,0.0005953378656094374
49.900000000000006,403.1088143835902,0.0005954327143453736
50.,403.90851124756574,0.0005955272219131651
