0.3333333333333333,1,3.6732302199526854e-23,1.0251210355557416,3.7190817202346083e-23,1.025121035555742,3.7190817202346095e-23,1.1110619574198424,3.8718389770656854e-23
0.37419849395325855,1,3.508495428802296e-23,1.0330359588087188,3.565977795229061e-23,1.0330359588087192,3.565977795229062e-23,1.139960487061244,3.7459831035616435e-23
0.42007353863066066,1,3.307534907348421e-23,1.0438317308508271,3.379245029564543e-23,1.0438317308508278,3.3792450295645437e-23,1.1763775236936342,3.5873834103607586e-23
0.47157265651562763,1,3.064073461939465e-23,1.0587086980404394,3.152734607113566e-23,1.0587086980404399,3.1527346071135665e-23,1.2222683263548169,3.387524557332559e-23
0.5293853335730555,1,2.7714726210915204e-23,1.0793599791170594,2.8793452883425266e-23,1.0793599791170592,2.8793452883425266e-23,1.2800957439743474,3.1356806026391045e-23
0.5942855836319423,1,2.4229911561111602e-23,1.1080908073807685,2.55058325992043e-23,1.1080908073807685,2.55058325992043e-23,1.3529607023888215,2.818346720885719e-23
0.6671423111196184,1,2.01212151057321e-23,1.147895264864188,2.1557844556534854e-23,1.1478952648641885,2.1557844556534854e-23,1.4447636142181528,2.4185362530183807e-23
0.7489309442203724,1,1.5329906255225023e-23,1.2024773219548748,1.681039608516147e-23,1.2024773219548752,1.681039608516147e-23,1.5603957019240802,1.9149474994766758e-23
0.8407464942067658,1,9.809515935913652e-24,1.2762264115525142,1.1081828915438799e-23,1.2762264115525146,1.10818289154388e-23,1.7059086204618348,1.281225161318862e-23
0.9438182157859614,1,3.564856023819014e-24,1.3736391018604004,4.178095060354896e-24,1.3736391018604015,4.1780950603548975e-24,1.8876382607899485,4.8978037587003146e-24
1,1,8.637502868075551e-25,1.4204514256517229,1.029440850647911e-24,1.4204514256517247,1.0294408506479115e-24,1.972341023357256,1.2130514143010052e-24
1.0595260647382752,1,3.7649514039384616e-24,1.373825134169505,4.412910340036026e-24,1.3738251341695054,4.412910340036026e-24,1.8879776370498065,5.173182476974776e-24
1.189419173187856,1,1.1654556004176151e-23,1.2763708923247536,1.3166919455529303e-23,1.2763708923247545,1.3166919455529309e-23,1.7061854374472814,1.522330149440065e-23
1.3352365898580771,1,2.0455345361030667e-23,1.202585136372471,2.2431831408751433e-23,1.202585136372472,2.2431831408751442e-23,1.560615915123953,2.5553761208591815e-23
1.4989305629885317,1,3.014601774534095e-23,1.1479743943792287,3.229951871280486e-23,1.1479743943792293,3.2299518712804874e-23,1.4449384890991153,3.6237199775999797e-23
1.682692677632456,1,4.0756650349014116e-23,1.1081481503434458,4.2903961728837854e-23,1.1081481503434458,4.2903961728837854e-23,1.3530995144342317,4.740927922758578e-23
1.8889831972687232,1,5.2337242496630996e-23,1.079401232619893,5.437537836675977e-23,1.0794012326198936,5.43753783667598e-23,1.2802059128895602,5.921759310081629e-23
2.1205640025629022,1,6.495962395088857e-23,1.0587383557522398,6.684021305842068e-23,1.05873835575224,6.68402130584207e-23,1.2223557562030516,7.18194893896322e-23
2.3805355682715956,1,7.872035011898346e-23,1.0438531639044786,8.042789883001865e-23,1.0438531639044788,8.042789883001867e-23,1.1764469052055158,8.538334853384043e-23
2.6723784733481875,1,9.374279249814155e-23,1.0330515913700367,9.527937333548975e-23,1.0330515913700364,9.527937333548975e-23,1.1400155447612756,1.0009059550512467e-22
3.0000000000000004,1,1.101784899352981e-22,1.0251325641159204,1.1155443232367957e-22,1.0251325641159206,1.1155443232367957e-22,1.111105647844322,1.161380402615461e-22
