Fix return value

33 jobs for leslie.wade/lalsuite-4piece-patch in 112 minutes and 25 seconds (queued for 5 seconds)
latest
Status Job ID Name Coverage
  Level0
passed level0:lal #63029

00:05:50

passed level0:rpm:lal #63030

00:11:01

 
  Level1
passed level1:lalframe #63031

00:02:22

passed level1:lalmetaio #63032

00:01:59

passed level1:lalsimulation #63033

00:05:02

passed level1:lalxml #63034

00:02:35

passed level1:rpm:lalframe #63035

00:02:51

passed level1:rpm:lalmetaio #63036

00:02:55

passed level1:rpm:lalsimulation #63037

00:04:28

passed level1:rpm:lalxml #63038

00:02:09

 
  Level2
passed level2:lalburst #63039

00:02:03

passed level2:lalinspiral #63040

00:05:54

passed level2:lalpulsar #63041

00:04:55

passed level2:lalstochastic #63042

00:02:00

passed level2:rpm:lalburst #63043

00:01:51

passed level2:rpm:lalinspiral #63044

00:08:35

passed level2:rpm:lalpulsar #63045

00:07:42

passed level2:rpm:lalstochastic #63046

00:01:54

 
  Level3
passed level3:laldetchar #63047

00:01:59

passed level3:lalinference #63048

00:07:21

passed level3:rpm:laldetchar #63049

00:01:35

passed level3:rpm:lalinference #63050

00:06:39

 
  Level4
passed level4:lalapps #63051

00:06:42

passed level4:rpm:lalapps #63052

00:04:25

 
  Nightly
passed nightly:openmp:jessie #63060

00:34:50

failed nightly:python3:stretch #63061
allowed to fail

00:27:10

passed nightly:top-level:artful #63057

00:34:10

passed nightly:top-level:buster #63058

00:34:05

passed nightly:top-level:clang #63059

00:35:09

passed nightly:top-level:el7 #63053

00:35:15

passed nightly:top-level:stretch #63054

00:38:56

passed nightly:top-level:trusty #63055

00:29:21

passed nightly:top-level:xenial #63056

00:29:40

 
Name Stage Failure
failed
nightly:python3:stretch Nightly
Makefile:416: recipe for target 'check-recursive' failed
make[2]: *** [check-recursive] Error 1
make[2]: Leaving directory '/builds/john-veitch/lalsuite/lalsuite-6.48.1/_build/sub'
Makefile:690: recipe for target 'check' failed
make[1]: *** [check] Error 2
make[1]: Leaving directory '/builds/john-veitch/lalsuite/lalsuite-6.48.1/_build/sub'
make: *** [distcheck] Error 1
Makefile:607: recipe for target 'distcheck' failed
ERROR: Job failed: exit code 1