{
"***WARNING" : "DO NOT CHANGE THESE SETTINGS UNLESS YOU REALLY KNOW WHAT YOU ARE DOING***",

    "verbosity"               : 5 ,

	"5122_fetch_size_E"		  : 19   ,
	"trigger_delay_s"         : 6    ,

	"csd_extra_reserve" 	  : 10   ,
	"timeframe_extra_reserve" : 10   ,

	"csd_thread_frac" 		  : 0.75 ,
	"csd_thread_min" 		  : 1    ,
	"csd_thread_reserve" 	  : 3    ,
    
    "wisdom_fname"            : "fftw_wisdom/julie_live.fftw" ,
    
	"server" : {
	    "enable_networking" : true ,
        "send_interval_s"   : 1.0 ,
        "port"            	: 8700
	} ,
    
	"saturation_detector" : {
	    "enabled"           : true ,
        "level"             : 0.70
	} ,
    
	"transient_detector" : {
	    "enabled"           : true ,
        "level"             : 100.0 ,
        "baseline_size"     : 120 ,
        "auxilliary_chs"    : [4, 5, 6, 7]
	} ,

    "thread_localizations" : [
        {"thread_name" : "data_source_buffer_0"       , "core_idx" : 30} ,
        {"thread_name" : "data_source_buffer_1"       , "core_idx" : 31} ,

        {"thread_name" : "csd_carriers"               , "core_idx" : 28} ,	

        {"thread_name" : "jstream"                    , "core_idx" : 28} , 
        {"thread_name" : "jstream.server"             , "core_idx" : 28} ,         
        {"thread_name" : "jstream.fetch_manager"      , "core_idx" : 29} ,
        {"thread_name" : "jstream.saturation_detector" , "core_idx" : 27} ,
        {"thread_name" : "jstream.csd_accumulator"    , "core_idx" : 28} , 
        {"thread_name" : "jstream.csd_writer"         , "core_idx" : 28} , 
        {"thread_name" : "jstream.csd_exporter"       , "core_idx" : 28} , 		

        {"thread_name" : "jstream.csd_worker_0"       , "core_idx" : 0  } , 
        {"thread_name" : "jstream.csd_worker_1"       , "core_idx" : 8  } , 
        {"thread_name" : "jstream.csd_worker_2"       , "core_idx" : 16 } , 
        {"thread_name" : "jstream.csd_worker_3"       , "core_idx" : 24 } , 
        {"thread_name" : "jstream.csd_worker_4"       , "core_idx" : 4  } , 
        {"thread_name" : "jstream.csd_worker_5"       , "core_idx" : 12 } , 
        {"thread_name" : "jstream.csd_worker_6"       , "core_idx" : 20 } , 
        {"thread_name" : "jstream.csd_worker_7"       , "core_idx" : 2  } , 
        {"thread_name" : "jstream.csd_worker_8"       , "core_idx" : 10 } , 
        {"thread_name" : "jstream.csd_worker_9"       , "core_idx" : 18 } , 
        {"thread_name" : "jstream.csd_worker_10"      , "core_idx" : 26 } , 
        {"thread_name" : "jstream.csd_worker_11"      , "core_idx" : 6  } , 
        {"thread_name" : "jstream.csd_worker_12"      , "core_idx" : 14 } , 
        {"thread_name" : "jstream.csd_worker_13"      , "core_idx" : 22 } , 
        {"thread_name" : "jstream.csd_worker_14"      , "core_idx" : 1  } , 
        {"thread_name" : "jstream.csd_worker_15"      , "core_idx" : 9  } , 
        {"thread_name" : "jstream.csd_worker_16"      , "core_idx" : 17 } , 
        {"thread_name" : "jstream.csd_worker_17"      , "core_idx" : 25 } , 
        {"thread_name" : "jstream.csd_worker_18"      , "core_idx" : 5  } , 
        {"thread_name" : "jstream.csd_worker_19"      , "core_idx" : 13 } , 
        {"thread_name" : "jstream.csd_worker_20"      , "core_idx" : 21 } , 
        {"thread_name" : "jstream.csd_worker_21"      , "core_idx" : 3  } , 
        {"thread_name" : "jstream.csd_worker_22"      , "core_idx" : 11 } , 
        {"thread_name" : "jstream.csd_worker_23"      , "core_idx" : 19 } , 
        {"thread_name" : "jstream.csd_worker_24"      , "core_idx" : 27 } , 
        {"thread_name" : "jstream.csd_worker_25"      , "core_idx" : 7  } , 
        {"thread_name" : "jstream.csd_worker_26"      , "core_idx" : 15 } , 
        {"thread_name" : "jstream.csd_worker_27"      , "core_idx" : 23 } , 
        {"thread_name" : "jstream.csd_worker_28"      , "core_idx" : 28 } , 
        {"thread_name" : "jstream.csd_worker_29"      , "core_idx" : 29 } , 
        {"thread_name" : "jstream.csd_worker_30"      , "core_idx" : 30 } , 
        {"thread_name" : "jstream.csd_worker_31"      , "core_idx" : 31 } 
    ]
}
