{
    "fft_size_E" : {
        "    1,024"         : 10 ,
        "    2,048"         : 11 ,
        "    4,096"         : 12 ,
        "    8,192"         : 13 ,
        "  16,384"          : 14 ,
        "  32,768"          : 15 ,
        "  65,536"          : 16 ,
        "131,072"           : 17 ,
        "262,144"           : 18 ,
        "524,288"           : 19 ,
	"1,048,576"	    : 20,
	"2,097,152"	    : 21 ,
	"4,194,304"	    : 22 ,
	"8,388,608"	    : 23 ,
	"16,777,216"	    : 24 ,
	"33,554,432"	    : 25
    } ,
    
    "csd_veto_thres" : {
        "Veto all errors"                               : 1 ,
        "Veto frame dropping"                           : 10 ,
        "Veto transient in external chn"                : 20 ,
        "Veto unidentified transient in IFO chn"        : 30 ,
        "Veto RFI transient in IFO chn"                 : 31 ,
        "Veto ADC saturation"                           : 40 ,
        "Disable error vetoing (not recommended)"       : 100
    }
}
