{
    "sample_freq" : {
        "    1.0 MHz"               :   1.0e6 ,
        "  10.0 MHz"                :  10.0e6 ,
        "  20.0 MHz"                :  20.0e6 ,
        "  25.0 MHz"                :  25.0e6 ,
        "  33.3 MHz"                :  33.3e6 ,
        "  50.0 MHz"                :  50.0e6 ,
        "100.0 MHz"                 : 100.0e6    
    } ,
    
    "coupling" : {
        "AC"                        : "NISCOPE_VAL_AC" ,
        "DC"                        : "NISCOPE_VAL_DC" ,
        "Ground"                    : "NISCOPE_VAL_GND"
    } ,
    
    "input_range" : { 
        "  0.2 V"                   :  0.2 ,
        "  0.4 V"                   :  0.4 ,
        "  1.0 V"                   :  1.0 ,
        "  2.0 V"                   :  2.0 ,
        "  4.0 V"                   :  4.0 ,
        "10.0 V"                    : 10.0 ,
        "20.0 V"                    : 20.0
    } ,
    
    "bandwidth" : {
        "  20 MHz   (Bessel)"       :  20.0e6 ,
        "  35 MHz   (Chebyshev)"    :  35.0e6 ,
        "100 MHz   (No filter)"     : 100.0e6
    } ,
    
    "impedance" : {
        "1 MOhm"                    : "NISCOPE_VAL_1_MEG_OHM" ,
        "50 Ohm"                    : "NISCOPE_VAL_50_OHMS"
    }   
}