{"copies":1 , "threads_per_copy":1 , "events_per_thread" : 2 , "CPU_score": { "All": {"score": 1.6044, "avg": 0.4011, "median": 0.0753, "min": 0.0191, "max": 1.4347} , "ESDtoAOD": {"score": 1.4347, "avg": 1.4347, "median": 1.4347, "min": 1.4347, "max": 1.4347} , "HITtoRDO": {"score": 0.0191, "avg": 0.0191, "median": 0.0191, "min": 0.0191, "max": 0.0191} , "RAWtoESD": {"score": 0.0774, "avg": 0.0774, "median": 0.0774, "min": 0.0774, "max": 0.0774} , "RDOtoRDOTrigger": {"score": 0.0732, "avg": 0.0732, "median": 0.0732, "min": 0.0732, "max": 0.0732} } , "app": "DigitalReconstruction_21.0.23"}
{"app":"DigitalReconstruction_21.0.23","CPU_score":{"RDOtoRDOTrigger":{"max":0.0732,"min":0.0732,"median":0.0732,"avg":0.0732,"score":0.0732},"RAWtoESD":{"max":0.0774,"min":0.0774,"median":0.0774,"avg":0.0774,"score":0.0774},"HITtoRDO":{"max":0.0191,"min":0.0191,"median":0.0191,"avg":0.0191,"score":0.0191},"ESDtoAOD":{"max":1.4347,"min":1.4347,"median":1.4347,"avg":1.4347,"score":1.4347},"All":{"max":1.4347,"min":0.0191,"median":0.0753,"avg":0.4011,"score":1.6044}},"events_per_thread":2,"threads_per_copy":1,"copies":1}
{"copies":1,"threads_per_copy":1,"events_per_thread":2,"CPU_score":{"All":{"score":1.6044,"avg":0.4011,"median":0.0753,"min":0.0191,"max":1.4347},"ESDtoAOD":{"score":1.4347,"avg":1.4347,"median":1.4347,"min":1.4347,"max":1.4347},"HITtoRDO":{"score":0.0191,"avg":0.0191,"median":0.0191,"min":0.0191,"max":0.0191},"RAWtoESD":{"score":0.0774,"avg":0.0774,"median":0.0774,"min":0.0774,"max":0.0774},"RDOtoRDOTrigger":{"score":0.0732,"avg":0.0732,"median":0.0732,"min":0.0732,"max":0.0732}},"app":"DigitalReconstruction_21.0.23"}
{"copies":1 , "threads_per_copy":1 , "events_per_thread" : 2 , "CPU_score": { "All": {"score": 1.6004, "avg": 0.4001, "median": 0.0763, "min": 0.0192, "max": 1.4286} , "ESDtoAOD": {"score": 1.4286, "avg": 1.4286, "median": 1.4286, "min": 1.4286, "max": 1.4286} , "HITtoRDO": {"score": 0.0192, "avg": 0.0192, "median": 0.0192, "min": 0.0192, "max": 0.0192} , "RAWtoESD": {"score": 0.0799, "avg": 0.0799, "median": 0.0799, "min": 0.0799, "max": 0.0799} , "RDOtoRDOTrigger": {"score": 0.0728, "avg": 0.0728, "median": 0.0728, "min": 0.0728, "max": 0.0728} } , "app": "DigitalReconstruction_21.0.23"}
{"app":"DigitalReconstruction_21.0.23","CPU_score":{"RDOtoRDOTrigger":{"max":0.0728,"min":0.0728,"median":0.0728,"avg":0.0728,"score":0.0728},"RAWtoESD":{"max":0.0799,"min":0.0799,"median":0.0799,"avg":0.0799,"score":0.0799},"HITtoRDO":{"max":0.0192,"min":0.0192,"median":0.0192,"avg":0.0192,"score":0.0192},"ESDtoAOD":{"max":1.4286,"min":1.4286,"median":1.4286,"avg":1.4286,"score":1.4286},"All":{"max":1.4286,"min":0.0192,"median":0.0763,"avg":0.4001,"score":1.6004}},"events_per_thread":2,"threads_per_copy":1,"copies":1}
{"copies":1,"threads_per_copy":1,"events_per_thread":2,"CPU_score":{"All":{"score":1.6044,"avg":0.4011,"median":0.0753,"min":0.0191,"max":1.4347},"ESDtoAOD":{"score":1.4347,"avg":1.4347,"median":1.4347,"min":1.4347,"max":1.4347},"HITtoRDO":{"score":0.0191,"avg":0.0191,"median":0.0191,"min":0.0191,"max":0.0191},"RAWtoESD":{"score":0.0774,"avg":0.0774,"median":0.0774,"min":0.0774,"max":0.0774},"RDOtoRDOTrigger":{"score":0.0732,"avg":0.0732,"median":0.0732,"min":0.0732,"max":0.0732}},"app":"DigitalReconstruction_21.0.23"}
{"copies":1 , "threads_per_copy":1 , "events_per_thread" : 2 , "CPU_score": { "All": {"score": 1.6945, "avg": 0.4236, "median": 0.0786, "min": 0.0199, "max": 1.5175} , "ESDtoAOD": {"score": 1.5175, "avg": 1.5175, "median": 1.5175, "min": 1.5175, "max": 1.5175} , "HITtoRDO": {"score": 0.0199, "avg": 0.0199, "median": 0.0199, "min": 0.0199, "max": 0.0199} , "RAWtoESD": {"score": 0.0817, "avg": 0.0817, "median": 0.0817, "min": 0.0817, "max": 0.0817} , "RDOtoRDOTrigger": {"score": 0.0755, "avg": 0.0755, "median": 0.0755, "min": 0.0755, "max": 0.0755} } , "app": "DigitalReconstruction_21.0.23"}
{"app":"DigitalReconstruction_21.0.23","CPU_score":{"RDOtoRDOTrigger":{"max":0.0755,"min":0.0755,"median":0.0755,"avg":0.0755,"score":0.0755},"RAWtoESD":{"max":0.0817,"min":0.0817,"median":0.0817,"avg":0.0817,"score":0.0817},"HITtoRDO":{"max":0.0199,"min":0.0199,"median":0.0199,"avg":0.0199,"score":0.0199},"ESDtoAOD":{"max":1.5175,"min":1.5175,"median":1.5175,"avg":1.5175,"score":1.5175},"All":{"max":1.5175,"min":0.0199,"median":0.0786,"avg":0.4236,"score":1.6945}},"events_per_thread":2,"threads_per_copy":1,"copies":1}
{"copies":1,"threads_per_copy":1,"events_per_thread":2,"CPU_score":{"All":{"score":1.6044,"avg":0.4011,"median":0.0753,"min":0.0191,"max":1.4347},"ESDtoAOD":{"score":1.4347,"avg":1.4347,"median":1.4347,"min":1.4347,"max":1.4347},"HITtoRDO":{"score":0.0191,"avg":0.0191,"median":0.0191,"min":0.0191,"max":0.0191},"RAWtoESD":{"score":0.0774,"avg":0.0774,"median":0.0774,"min":0.0774,"max":0.0774},"RDOtoRDOTrigger":{"score":0.0732,"avg":0.0732,"median":0.0732,"min":0.0732,"max":0.0732}},"app":"DigitalReconstruction_21.0.23"}
