Parsing results from /results/atlas-gen-c4-e5-1564938438_1173/proc_4/log.generate
Parsing results from /results/atlas-gen-c4-e5-1564938438_1173/proc_1/log.generate
Parsing results from /results/atlas-gen-c4-e5-1564938438_1173/proc_3/log.generate
Parsing results from /results/atlas-gen-c4-e5-1564938438_1173/proc_2/log.generate
{"copies":4 , "threads_per_copy": 1 , "events_per_thread" : 5 , "CPU_score": {"score": 89.2575, "avg": 22.3144, "median": 22.3242, "min": 21.8818, "max": 22.7273} , "log": "ok", "app":{"version":"v0.15","description":"ATLAS Event Generation based on athena version 19.2.5.5","cvmfs_checksum":"512aae44a881c0d4f9bc690488653241","bmkdata_checksum":"9a62d4782b086a9c74ab6edd38dc0ee3","bmk_checksum":"e93678ff532a3233f94f3e3890a8f39c"} }
{"app":{"bmk_checksum":"e93678ff532a3233f94f3e3890a8f39c","bmkdata_checksum":"9a62d4782b086a9c74ab6edd38dc0ee3","cvmfs_checksum":"512aae44a881c0d4f9bc690488653241","description":"ATLAS Event Generation based on athena version 19.2.5.5","version":"v0.15"},"log":"ok","CPU_score":{"max":22.7273,"min":21.8818,"median":22.3242,"avg":22.3144,"score":89.2575},"events_per_thread":5,"threads_per_copy":1,"copies":4}
{"copies":4,"threads_per_copy":1,"events_per_thread":5,"CPU_score":{"score":89.2575,"avg":22.3144,"median":22.3242,"min":21.8818,"max":22.7273},"log":"ok","app":{"version":"v0.15","description":"ATLAS Event Generation based on athena version 19.2.5.5","cvmfs_checksum":"512aae44a881c0d4f9bc690488653241","bmkdata_checksum":"9a62d4782b086a9c74ab6edd38dc0ee3","bmk_checksum":"e93678ff532a3233f94f3e3890a8f39c"}}
Parsing results from /results/atlas-gen-c4-e5-1564939018_9454/proc_4/log.generate
Parsing results from /results/atlas-gen-c4-e5-1564939018_9454/proc_1/log.generate
Parsing results from /results/atlas-gen-c4-e5-1564939018_9454/proc_3/log.generate
Parsing results from /results/atlas-gen-c4-e5-1564939018_9454/proc_2/log.generate
{"copies":4 , "threads_per_copy": 1 , "events_per_thread" : 5 , "CPU_score": {"score": 86.3969, "avg": 21.5992, "median": 21.6451, "min": 21.3675, "max": 21.7391} , "log": "ok", "app":{"version":"v0.15","description":"ATLAS Event Generation based on athena version 19.2.5.5","cvmfs_checksum":"83ed979a1f04a60edb1148a93e8f72b8","bmkdata_checksum":"9a62d4782b086a9c74ab6edd38dc0ee3","bmk_checksum":"5ee90d6a36a8f5471f0234d2164227c4"} }
{"app":{"bmk_checksum":"5ee90d6a36a8f5471f0234d2164227c4","bmkdata_checksum":"9a62d4782b086a9c74ab6edd38dc0ee3","cvmfs_checksum":"83ed979a1f04a60edb1148a93e8f72b8","description":"ATLAS Event Generation based on athena version 19.2.5.5","version":"v0.15"},"log":"ok","CPU_score":{"max":21.7391,"min":21.3675,"median":21.6451,"avg":21.5992,"score":86.3969},"events_per_thread":5,"threads_per_copy":1,"copies":4}
{"copies":4,"threads_per_copy":1,"events_per_thread":5,"CPU_score":{"score":89.2575,"avg":22.3144,"median":22.3242,"min":21.8818,"max":22.7273},"log":"ok","app":{"version":"v0.15","description":"ATLAS Event Generation based on athena version 19.2.5.5","cvmfs_checksum":"512aae44a881c0d4f9bc690488653241","bmkdata_checksum":"9a62d4782b086a9c74ab6edd38dc0ee3","bmk_checksum":"e93678ff532a3233f94f3e3890a8f39c"}}
Parsing results from /results/atlas-gen-c4-e5-1564939600_5041/proc_4/log.generate
Parsing results from /results/atlas-gen-c4-e5-1564939600_5041/proc_1/log.generate
Parsing results from /results/atlas-gen-c4-e5-1564939600_5041/proc_3/log.generate
Parsing results from /results/atlas-gen-c4-e5-1564939600_5041/proc_2/log.generate
{"copies":4 , "threads_per_copy": 1 , "events_per_thread" : 5 , "CPU_score": {"score": 89.4924, "avg": 22.3731, "median": 22.3964, "min": 22.0751, "max": 22.6244} , "log": "ok", "app":{"version":"v0.15","description":"ATLAS Event Generation based on athena version 19.2.5.5","cvmfs_checksum":"83ed979a1f04a60edb1148a93e8f72b8","bmkdata_checksum":"9a62d4782b086a9c74ab6edd38dc0ee3","bmk_checksum":"5ee90d6a36a8f5471f0234d2164227c4"} }
{"app":{"bmk_checksum":"5ee90d6a36a8f5471f0234d2164227c4","bmkdata_checksum":"9a62d4782b086a9c74ab6edd38dc0ee3","cvmfs_checksum":"83ed979a1f04a60edb1148a93e8f72b8","description":"ATLAS Event Generation based on athena version 19.2.5.5","version":"v0.15"},"log":"ok","CPU_score":{"max":22.6244,"min":22.0751,"median":22.3964,"avg":22.3731,"score":89.4924},"events_per_thread":5,"threads_per_copy":1,"copies":4}
{"copies":4,"threads_per_copy":1,"events_per_thread":5,"CPU_score":{"score":89.2575,"avg":22.3144,"median":22.3242,"min":21.8818,"max":22.7273},"log":"ok","app":{"version":"v0.15","description":"ATLAS Event Generation based on athena version 19.2.5.5","cvmfs_checksum":"512aae44a881c0d4f9bc690488653241","bmkdata_checksum":"9a62d4782b086a9c74ab6edd38dc0ee3","bmk_checksum":"e93678ff532a3233f94f3e3890a8f39c"}}
