\relax 
\providecommand\hyper@newdestlabel[2]{}
\providecommand\zref@newlabel[2]{}
\citation{BH_Laws_1973,Hawking_1971_Area}
\citation{NHT_01,NHT_02,NHT_03,NHT_04}
\citation{Bekenstein_01}
\citation{Penrose_Process}
\citation{BH_Superradiance}
\citation{BH_Radiation_01,BH_Radiation_02}
\citation{LIGO_01,LIGO_02,LIGO_03,LIGO_04,LIGO_05,LIGO_06,LIGO_07,LIGO_08,LIGO_09}
\citation{BH_fireball_01,BH_fireball_02,BH_fuzzy_wall_01,BH_fuzzy_wall_02}
\citation{Echoes_01,Echoes_02,Echoes_03,Echoes_04,Echoes_05,Echoes_06,Echoes_07,Echoes_08,Echoes_09,Echoes_10}
\citation{Echoes_Search_01,Echoes_Search_02,Echoes_Search_03,Echoes_Search_04,Echoes_Search_05,Echoes_Search_06,Echoes_Search_07}
\@writefile{toc}{\contentsline {chapter}{\numberline {5}Constraining Effective Temperature of Black Holes through Ringdown Detection}{36}{chapter.5}}
\@writefile{lof}{\addvspace {10\p@ }}
\@writefile{lot}{\addvspace {10\p@ }}
\@writefile{toc}{\contentsline {section}{\numberline {5.1}Introduction}{36}{section.5.1}}
\citation{Teukolsky_01_PRL,Teukolsky_02_ApJ,Teukolsky_03_ApJ,Teukolsky_04_ApJ}
\@writefile{toc}{\contentsline {section}{\numberline {5.2}Ringdown Phase of Quantum Black Holes}{37}{section.5.2}}
\@writefile{lof}{\contentsline {figure}{\numberline {5.1}{\ignorespaces A conformal diagram illustrating the continuous emission of gravitational waves at the event horizon of a quantum black hole. The dashed line joining the null past infinite $ I^- $ and future null infinity $ I^+$ denotes the radial coordinate of the maximum of the effective potential for gravitational-wave propagation around the black hole. As soon as a remnant black hole is formed by binary black-hole coalescence, the final (quantum) black hole starts to emit gravitational waves at the past event horizon ($H^{-}$) at time $ t_0 $, corresponding to the out-going coordinate $ u_0 $. When the emitted gravitational waves come across the potential barrier, part of the waves would be reflected by the potential and end up in future event horizon ($ H^{+} $). The rest of them can transmit through the potential barrier, reaching the spatial infinity ($I^{+}$), where we detect gravitational waves. }}{38}{figure.5.1}}
\newlabel{fig:Penrose_Diagram}{{5.1}{38}{A conformal diagram illustrating the continuous emission of gravitational waves at the event horizon of a quantum black hole. The dashed line joining the null past infinite $ I^- $ and future null infinity $ I^+$ denotes the radial coordinate of the maximum of the effective potential for gravitational-wave propagation around the black hole. As soon as a remnant black hole is formed by binary black-hole coalescence, the final (quantum) black hole starts to emit gravitational waves at the past event horizon ($H^{-}$) at time $ t_0 $, corresponding to the out-going coordinate $ u_0 $. When the emitted gravitational waves come across the potential barrier, part of the waves would be reflected by the potential and end up in future event horizon ($ H^{+} $). The rest of them can transmit through the potential barrier, reaching the spatial infinity ($I^{+}$), where we detect gravitational waves}{figure.5.1}{}}
\newlabel{fig:Penrose_Diagram@cref}{{[figure][1][5]5.1}{[1][37][]38}}
\citation{Sakurai}
\citation{Don_Page_01}
\newlabel{eq:BC}{{5.1}{39}{Ringdown Phase of Quantum Black Holes}{equation.5.2.1}{}}
\newlabel{eq:BC@cref}{{[equation][1][5]5.1}{[1][39][]39}}
\newlabel{eq:emittivity}{{5.2}{39}{Ringdown Phase of Quantum Black Holes}{equation.5.2.2}{}}
\newlabel{eq:emittivity@cref}{{[equation][2][5]5.2}{[1][39][]39}}
\citation{Nikhef_01,Nikhef_02}
\citation{QNM_01,QNM_02}
\newlabel{eq:QBH_RD_Waveform}{{5.3}{40}{Ringdown Phase of Quantum Black Holes}{equation.5.2.3}{}}
\newlabel{eq:QBH_RD_Waveform@cref}{{[equation][3][5]5.3}{[1][39][]40}}
\newlabel{eq:excitation_approx}{{5.4}{40}{Ringdown Phase of Quantum Black Holes}{equation.5.2.4}{}}
\newlabel{eq:excitation_approx@cref}{{[equation][4][5]5.4}{[1][40][]40}}
\@writefile{lof}{\contentsline {figure}{\numberline {5.2}{\ignorespaces The time-domain ringdown waveforms of black holes of mass of $ 100 M_{\odot } $ for $ T = 10^{-8.4} K$ (blue solid line) and for $ T = 0 $ (red dashed line). Overtones of the $ nl|m| = $ 022, 122, 033, 133, 044, 055, 021, 032 and 034 modes are included in the plots. }}{41}{figure.5.2}}
\newlabel{fig:QBH_ringdown}{{5.2}{41}{The time-domain ringdown waveforms of black holes of mass of $ 100 M_{\odot } $ for $ T = 10^{-8.4} K$ (blue solid line) and for $ T = 0 $ (red dashed line). Overtones of the $ nl|m| = $ 022, 122, 033, 133, 044, 055, 021, 032 and 034 modes are included in the plots}{figure.5.2}{}}
\newlabel{fig:QBH_ringdown@cref}{{[figure][2][5]5.2}{[1][41][]41}}
\@writefile{toc}{\contentsline {section}{\numberline {5.3}Parameter Estimation}{41}{section.5.3}}
\citation{LALInference}
\citation{LIGO_01,LIGO_02,LIGO_10}
\citation{LIGO_sensitivity}
\citation{Cutler_Flanagan_1994}
\@writefile{lof}{\contentsline {figure}{\numberline {5.3}{\ignorespaces (Top panel) The posterior of log of black-hole temperatures obtained by Bayesian inference of mock ringdown signals due to classical black hole of $ 80 M_{\odot } $, $100 M_{\odot } $, $150 M_{\odot }$ and $200 M_{\odot }$ at 400 Mpc away. The posteriors are in step-function shape, with a step of $ \qopname  \relax o{log}T_H \sim - 8 $. (Bottom panel) The step position of $ p(\qopname  \relax o{log}T_{H}|d, I) $ as a function of the final mass of the remnant black hole. For final black holes of masses between $ 50 M_{\odot } $ to $ 200 M_{\odot } $, the $ 90 \% $ exclusion region decreases from $ \qopname  \relax o{log}T_H \sim -8.0 $ to $ \qopname  \relax o{log}T_{H} \sim -9.0 $ The decreasing trend suggests that the constraint on the effective temperatures with black-hole ringdown is increasingly stringent for more massive black holes. }}{43}{figure.5.3}}
\newlabel{fig:T_M}{{5.3}{43}{(Top panel) The posterior of log of black-hole temperatures obtained by Bayesian inference of mock ringdown signals due to classical black hole of $ 80 M_{\odot } $, $100 M_{\odot } $, $150 M_{\odot }$ and $200 M_{\odot }$ at 400 Mpc away. The posteriors are in step-function shape, with a step of $ \log T_H \sim - 8 $. (Bottom panel) The step position of $ p(\log T_{H}|d, I) $ as a function of the final mass of the remnant black hole. For final black holes of masses between $ 50 M_{\odot } $ to $ 200 M_{\odot } $, the $ 90 \% $ exclusion region decreases from $ \log T_H \sim -8.0 $ to $ \log T_{H} \sim -9.0 $ The decreasing trend suggests that the constraint on the effective temperatures with black-hole ringdown is increasingly stringent for more massive black holes}{figure.5.3}{}}
\newlabel{fig:T_M@cref}{{[figure][3][5]5.3}{[1][42][]43}}
\@writefile{lof}{\contentsline {figure}{\numberline {5.4}{\ignorespaces (color online) The match between the ringdown waveforms due to classical and quantum black holes of different masses as functions of $ \qopname  \relax o{log}T_{H} $. Match between two waveforms measures the similarity of these two waveforms relative to a detector. As $ T_H \rightarrow 10^{-9} $ K, the match $ \rightarrow 1 $ rapidly, which implies the Advanced LIGO and Virgo detectors cannot distinguish the differences between the ringdown waveforms due to classical and quantum black holes of $ 10^{-9}$K. This limits our test from putting constraints tighter than $ 10^{-9}$ K. This is consistent with our constraints in \cref  {fig:T_M}. }}{44}{figure.5.4}}
\newlabel{fig:T_M}{{5.4}{44}{(color online) The match between the ringdown waveforms due to classical and quantum black holes of different masses as functions of $ \log T_{H} $. Match between two waveforms measures the similarity of these two waveforms relative to a detector. As $ T_H \rightarrow 10^{-9} $ K, the match $ \rightarrow 1 $ rapidly, which implies the Advanced LIGO and Virgo detectors cannot distinguish the differences between the ringdown waveforms due to classical and quantum black holes of $ 10^{-9}$K. This limits our test from putting constraints tighter than $ 10^{-9}$ K. This is consistent with our constraints in \cref {fig:T_M}}{figure.5.4}{}}
\newlabel{fig:T_M@cref}{{[figure][4][5]5.4}{[1][42][]44}}
\citation{BH_Radiation_01,BH_Radiation_02}
\@writefile{toc}{\contentsline {section}{\numberline {5.4}Concluding Remarks}{45}{section.5.4}}
\@writefile{lof}{\contentsline {figure}{\numberline {5.5}{\ignorespaces (color online) A corner plot of the posterior samples of the ringdown parameters $ M_f, a $ and the temperature $ \qopname  \relax o{log}T_H $ from the parameter estimation on the simulated ringdown signals due to a classical black holes of 100 $ M_{\odot } $ at 400 Mpc away. The green solid lines represent the injected ringdown mass and spin. The diagonal histograms show that our test can recover the injected ringdown parameters as well as putting reasonable constraints on effective temperature of black holes. The off-diagonal two-dimensional histograms shows that the posterior samples of $ \qopname  \relax o{log}T_H $ have no strong correlation with the ringdown parameters. From the corner plot, we conclude that our test can constrain the quantum nature of black holes while recovering the correct ringdown physics from signals. }}{46}{figure.5.5}}
\newlabel{fig:match}{{5.5}{46}{(color online) A corner plot of the posterior samples of the ringdown parameters $ M_f, a $ and the temperature $ \log T_H $ from the parameter estimation on the simulated ringdown signals due to a classical black holes of 100 $ M_{\odot } $ at 400 Mpc away. The green solid lines represent the injected ringdown mass and spin. The diagonal histograms show that our test can recover the injected ringdown parameters as well as putting reasonable constraints on effective temperature of black holes. The off-diagonal two-dimensional histograms shows that the posterior samples of $ \log T_H $ have no strong correlation with the ringdown parameters. From the corner plot, we conclude that our test can constrain the quantum nature of black holes while recovering the correct ringdown physics from signals}{figure.5.5}{}}
\newlabel{fig:match@cref}{{[figure][5][5]5.5}{[1][45][]46}}
\citation{Wald_01}
\citation{GreyBody_Factor_01,GreyBody_Factor_02,GreyBody_Factor_03,GreyBody_Factor_04}
\citation{BH_analogy_01,BH_analogy_02,BH_analogy_03,BH_analogy_04,BH_analogy_05,BH_analogy_06,BH_analogy_07}
\citation{BBH_Thermodynamics_test_02,BBH_Thermodynamics_test_01}
\@writefile{toc}{\contentsline {section}{\numberline {5.5}Acknowledgement}{47}{section.5.5}}
\citation{Nikhef_01,Nikhef_02}
\citation{Maggiore_vol_2,Green_Function_Technique_01,Green_Function_Technique_02,Green_Function_Technique_03,Green_Function_Technique_04}
\citation{Hartle_01}
\citation{Maggiore_vol_2}
\@writefile{toc}{\contentsline {section}{\numberline {5.6}Appendix}{48}{section.5.6}}
\newlabel{eq:NR_result}{{5.7}{48}{Appendix}{equation.5.6.7}{}}
\newlabel{eq:NR_result@cref}{{[equation][7][5]5.7}{[1][47][]48}}
\newlabel{eq:Laplace_Transform}{{5.8}{48}{Appendix}{equation.5.6.8}{}}
\newlabel{eq:Laplace_Transform@cref}{{[equation][8][5]5.8}{[1][48][]48}}
\newlabel{eq:SE}{{5.9}{48}{Appendix}{equation.5.6.9}{}}
\newlabel{eq:SE@cref}{{[equation][9][5]5.9}{[1][48][]48}}
\newlabel{eq:Green_fn_technique}{{5.12}{48}{Appendix}{equation.5.6.12}{}}
\newlabel{eq:Green_fn_technique@cref}{{[equation][12][5]5.12}{[1][48][]48}}
\citation{Echoes_07}
\newlabel{eq:Wronskian}{{5.13}{49}{Appendix}{equation.5.6.13}{}}
\newlabel{eq:Wronskian@cref}{{[equation][13][5]5.13}{[1][48][]49}}
\newlabel{eq:ID}{{5.15}{49}{Appendix}{equation.5.6.15}{}}
\newlabel{eq:ID@cref}{{[equation][15][5]5.15}{[1][49][]49}}
\newlabel{eq:IHSE}{{5.17}{49}{Appendix}{equation.5.6.17}{}}
\newlabel{eq:IHSE@cref}{{[equation][17][5]5.17}{[1][49][]49}}
\citation{Berti_02,Andersson_01}
\newlabel{eq:z_w}{{5.19}{50}{Appendix}{equation.5.6.19}{}}
\newlabel{eq:z_w@cref}{{[equation][19][5]5.19}{[1][49][]50}}
\newlabel{eq:excitation factor}{{5.20}{50}{Appendix}{equation.5.6.20}{}}
\newlabel{eq:excitation factor@cref}{{[equation][20][5]5.20}{[1][50][]50}}
\newlabel{eq:inverse_laplace_transform}{{5.21}{50}{Appendix}{equation.5.6.21}{}}
\newlabel{eq:inverse_laplace_transform@cref}{{[equation][21][5]5.21}{[1][50][]50}}
\newlabel{eq:z_t}{{5.22}{50}{Appendix}{equation.5.6.22}{}}
\newlabel{eq:z_t@cref}{{[equation][22][5]5.22}{[1][50][]50}}
\@setckpt{chapter5}{
\setcounter{page}{51}
\setcounter{equation}{22}
\setcounter{enumi}{0}
\setcounter{enumii}{0}
\setcounter{enumiii}{0}
\setcounter{enumiv}{0}
\setcounter{footnote}{0}
\setcounter{mpfootnote}{0}
\setcounter{part}{0}
\setcounter{chapter}{5}
\setcounter{section}{6}
\setcounter{subsection}{0}
\setcounter{subsubsection}{0}
\setcounter{paragraph}{0}
\setcounter{subparagraph}{0}
\setcounter{figure}{5}
\setcounter{table}{0}
\setcounter{parentequation}{0}
\setcounter{lips@count}{0}
\setcounter{Item}{0}
\setcounter{Hfootnote}{0}
\setcounter{bookmark@seq@number}{35}
\setcounter{@pps}{0}
\setcounter{@ppsavesec}{0}
\setcounter{@ppsaveapp}{0}
\setcounter{NAT@ctr}{0}
\setcounter{subfigure}{0}
\setcounter{lofdepth}{1}
\setcounter{subtable}{0}
\setcounter{lotdepth}{1}
\setcounter{section@level}{1}
}
