\relax 
\providecommand\hyper@newdestlabel[2]{}
\providecommand\zref@newlabel[2]{}
\providecommand\HyperFirstAtBeginDocument{\AtBeginDocument}
\HyperFirstAtBeginDocument{\ifx\hyper@anchor\@undefined
\global\let\oldcontentsline\contentsline
\gdef\contentsline#1#2#3#4{\oldcontentsline{#1}{#2}{#3}}
\global\let\oldnewlabel\newlabel
\gdef\newlabel#1#2{\newlabelxx{#1}#2}
\gdef\newlabelxx#1#2#3#4#5#6{\oldnewlabel{#1}{{#2}{#3}}}
\AtEndDocument{\ifx\hyper@anchor\@undefined
\let\contentsline\oldcontentsline
\let\newlabel\oldnewlabel
\fi}
\fi}
\global\let\hyper@last\relax 
\gdef\HyperFirstAtBeginDocument#1{#1}
\providecommand\HyField@AuxAddToFields[1]{}
\providecommand\HyField@AuxAddToCoFields[2]{}
\@input{committee.aux}
\@input{dedication.aux}
\@input{abstract.aux}
\@input{acknowlegements.aux}
\citation{Pretorius_2005_02}
\citation{Pretorius_2005}
\citation{Maggiore_vol_2}
\citation{Maggiore_vol_2}
\citation{LIGO_07}
\citation{LIGO_07}
\@input{chapter1.aux}
\@input{chapter2.aux}
\@input{chapter3.aux}
\@input{chapter_Bayesian.aux}
\@input{chapter_TGRwGW.aux}
\@input{chapter_QNM_mg.aux}
\@input{chapter_BH_Temp.aux}
\@input{conclusions.aux}
\bibdata{refs}
\bibcite{Samajdar_01}{{1}{}{{}}{{}}}
\bibcite{Echoes_Search_03}{{2}{}{{}}{{}}}
\bibcite{TIGER}{{3}{}{{}}{{}}}
\bibcite{LVTheory_01}{{4}{}{{}}{{}}}
\bibcite{Andersson_01}{{5}{}{{}}{{}}}
\bibcite{ADM_Decomposition}{{6}{}{{}}{{}}}
\bibcite{Echoes_Search_07}{{7}{}{{}}{{}}}
\bibcite{LPT_03}{{8}{}{{}}{{}}}
\bibcite{LIGO_08}{{9}{}{{}}{{}}}
\@writefile{toc}{\contentsline {chapter}{Bibliography}{91}{subsection.8.3.2}}
\bibcite{LIGO_02}{{10}{}{{}}{{}}}
\bibcite{LIGO_01}{{11}{}{{}}{{}}}
\bibcite{LIGO_07}{{12}{}{{}}{{}}}
\bibcite{LIGO_03}{{13}{}{{}}{{}}}
\bibcite{LIGO_04}{{14}{}{{}}{{}}}
\bibcite{LIGO_05}{{15}{}{{}}{{}}}
\bibcite{LIGO_06}{{16}{}{{}}{{}}}
\bibcite{LIGO_09}{{17}{}{{}}{{}}}
\bibcite{LIGO_11}{{18}{}{{}}{{}}}
\bibcite{BSSN_01}{{19}{}{{}}{{}}}
\bibcite{MG_05}{{20}{}{{}}{{}}}
\bibcite{MG_06}{{21}{}{{}}{{}}}
\bibcite{QNM_04}{{22}{}{{}}{{}}}
\bibcite{Green_Function_Technique_01}{{23}{}{{}}{{}}}
\bibcite{Berti_02}{{24}{}{{}}{{}}}
\bibcite{QNM_01}{{25}{}{{}}{{}}}
\bibcite{Green_Function_Technique_02}{{26}{}{{}}{{}}}
\bibcite{QNM_Kerr_01}{{27}{}{{}}{{}}}
\bibcite{Berti_01}{{28}{}{{}}{{}}}
\bibcite{Cassini_01}{{29}{}{{}}{{}}}
\bibcite{Klein_Gordon_equation_01}{{30}{}{{}}{{}}}
\bibcite{LVTheory_05}{{31}{}{{}}{{}}}
\bibcite{RD_Gauss_Bonnet}{{32}{}{{}}{{}}}
\bibcite{RD_Einstein-dilaton-Gauss-Bonnet}{{33}{}{{}}{{}}}
\bibcite{BH_Accretion_Disk_Temp_01}{{34}{}{{}}{{}}}
\bibcite{GreyBody_Factor_02}{{35}{}{{}}{{}}}
\bibcite{Brito_Buonanno_Raymond_01}{{36}{}{{}}{{}}}
\bibcite{Massive_Gravity_01}{{37}{}{{}}{{}}}
\bibcite{Supperadiance}{{38}{}{{}}{{}}}
\bibcite{ULTB_GW_03}{{39}{}{{}}{{}}}
\bibcite{PyMultiNest}{{40}{}{{}}{{}}}
\bibcite{Echoes_02}{{41}{}{{}}{{}}}
\bibcite{QNM_02}{{42}{}{{}}{{}}}
\bibcite{BBH_Thermodynamics_test_01}{{43}{}{{}}{{}}}
\bibcite{RD_f_R}{{44}{}{{}}{{}}}
\bibcite{Echoes_03}{{45}{}{{}}{{}}}
\bibcite{NHT_03}{{46}{}{{}}{{}}}
\bibcite{Carullo_01}{{47}{}{{}}{{}}}
\bibcite{Carullo_02}{{48}{}{{}}{{}}}
\bibcite{Gregorio_2018}{{49}{}{{}}{{}}}
\bibcite{Carullo_03}{{50}{}{{}}{{}}}
\bibcite{QNM_Rev_01}{{51}{}{{}}{{}}}
\bibcite{Chung_01}{{52}{}{{}}{{}}}
\bibcite{Chung_02}{{53}{}{{}}{{}}}
\bibcite{Mercury_01}{{54}{}{{}}{{}}}
\bibcite{Echoes_Search_05}{{55}{}{{}}{{}}}
\bibcite{Cutler_Flanagan_1994}{{56}{}{{}}{{}}}
\bibcite{LHC_01}{{57}{}{{}}{{}}}
\bibcite{NHT_TIGER_03}{{58}{}{{}}{{}}}
\bibcite{IMR_Test_02}{{59}{}{{}}{{}}}
\bibcite{Eddington}{{60}{}{{}}{{}}}
\bibcite{Massive_BH_Perturbation_01}{{61}{}{{}}{{}}}
\bibcite{Einstein_01}{{62}{}{{}}{{}}}
\bibcite{Einstein_02}{{63}{}{{}}{{}}}
\bibcite{Einstein:1911vc}{{64}{}{{}}{{}}}
\bibcite{Einstein:1915bz}{{65}{}{{}}{{}}}
\bibcite{EHT_04}{{66}{}{{}}{{}}}
\bibcite{Virgo_detector_01}{{67}{}{{}}{{}}}
\bibcite{pN_03}{{68}{}{{}}{{}}}
\bibcite{IMR_Test_01}{{69}{}{{}}{{}}}
\bibcite{NHT_TIGER_04}{{70}{}{{}}{{}}}
\bibcite{IMR_Test_03}{{71}{}{{}}{{}}}
\bibcite{QNM_05}{{72}{}{{}}{{}}}
\bibcite{Goldberg_Sach_01}{{73}{}{{}}{{}}}
\bibcite{NHT_TIGER_02}{{74}{}{{}}{{}}}
\bibcite{Yunes_01}{{75}{}{{}}{{}}}
\bibcite{GreyBody_Factor_01}{{76}{}{{}}{{}}}
\bibcite{LIGO_detector_01}{{77}{}{{}}{{}}}
\bibcite{Hartle_01}{{78}{}{{}}{{}}}
\bibcite{MG_03}{{79}{}{{}}{{}}}
\bibcite{MG_04}{{80}{}{{}}{{}}}
\bibcite{NHT_04}{{81}{}{{}}{{}}}
\bibcite{BH_Radiation_01}{{82}{}{{}}{{}}}
\bibcite{BH_Radiation_02}{{83}{}{{}}{{}}}
\bibcite{Massive_BH_Perturbation_02}{{84}{}{{}}{{}}}
\bibcite{Massive_BH_Perturbation_03}{{85}{}{{}}{{}}}
\bibcite{RD_Einstein_Maxwell_Dilaton}{{86}{}{{}}{{}}}
\bibcite{Chung_03}{{87}{}{{}}{{}}}
\bibcite{LVTheory_04}{{88}{}{{}}{{}}}
\bibcite{Cassini_02}{{89}{}{{}}{{}}}
\bibcite{Isi_01}{{90}{}{{}}{{}}}
\bibcite{ULTB_GW_02}{{91}{}{{}}{{}}}
\bibcite{NHT_02}{{92}{}{{}}{{}}}
\bibcite{NHT_01}{{93}{}{{}}{{}}}
\bibcite{Ajith_01}{{94}{}{{}}{{}}}
\bibcite{Kerr_01}{{95}{}{{}}{{}}}
\bibcite{GreyBody_Factor_03}{{96}{}{{}}{{}}}
\bibcite{QNM_03}{{97}{}{{}}{{}}}
\bibcite{Massive_Vector_Perturbation_01}{{98}{}{{}}{{}}}
\bibcite{Massive_Scalar_Perturbation_02}{{99}{}{{}}{{}}}
\bibcite{BH_Nature_Test_01}{{100}{}{{}}{{}}}
\bibcite{BBH_Thermodynamics_test_02}{{101}{}{{}}{{}}}
\bibcite{Leaver_01}{{102}{}{{}}{{}}}
\bibcite{Leaver_02}{{103}{}{{}}{{}}}
\bibcite{LPT_01}{{104}{}{{}}{{}}}
\bibcite{LPT_04}{{105}{}{{}}{{}}}
\bibcite{LPT_02}{{106}{}{{}}{{}}}
\bibcite{SUSY_02}{{107}{}{{}}{{}}}
\bibcite{SUSY_01}{{108}{}{{}}{{}}}
\bibcite{Tjonnie_thesis}{{109}{}{{}}{{}}}
\bibcite{LISA_proposal}{{110}{}{{}}{{}}}
\bibcite{Echoes_Search_02}{{111}{}{{}}{{}}}
\bibcite{Nikhef_02}{{112}{}{{}}{{}}}
\bibcite{Nikhef_01}{{113}{}{{}}{{}}}
\bibcite{MG_Pauli}{{114}{}{{}}{{}}}
\bibcite{Maggiore_vol_2}{{115}{}{{}}{{}}}
\bibcite{LVTheory_02}{{116}{}{{}}{{}}}
\bibcite{GreyBody_Factor_04}{{117}{}{{}}{{}}}
\bibcite{exact_sol_TE}{{118}{}{{}}{{}}}
\bibcite{Echoes_05}{{119}{}{{}}{{}}}
\bibcite{Echoes_Search_04}{{120}{}{{}}{{}}}
\bibcite{NHT_TIGER_01}{{121}{}{{}}{{}}}
\bibcite{Wills_01}{{122}{}{{}}{{}}}
\bibcite{Echoes_01}{{123}{}{{}}{{}}}
\bibcite{Penrose_Newman_01}{{124}{}{{}}{{}}}
\bibcite{ULTB_GW_01}{{125}{}{{}}{{}}}
\bibcite{MG_02}{{126}{}{{}}{{}}}
\bibcite{Massive_Scalar_Perturbation_01}{{127}{}{{}}{{}}}
\bibcite{Chern_Simons_01}{{128}{}{{}}{{}}}
\bibcite{RD_Chern-Simons}{{129}{}{{}}{{}}}
\bibcite{Don_Page_01}{{130}{}{{}}{{}}}
\bibcite{Berti_04}{{131}{}{{}}{{}}}
\bibcite{ULTB_BH_Perturbation_01}{{132}{}{{}}{{}}}
\bibcite{Berti_05}{{133}{}{{}}{{}}}
\bibcite{ULTB_BH_Perturbation_02}{{134}{}{{}}{{}}}
\bibcite{Mercury_02}{{135}{}{{}}{{}}}
\bibcite{Peters_and_Mathews}{{136}{}{{}}{{}}}
\bibcite{CPNest}{{137}{}{{}}{{}}}
\bibcite{Teukolsky_03_ApJ}{{138}{}{{}}{{}}}
\bibcite{Pretorius_2005}{{139}{}{{}}{{}}}
\bibcite{Pretorius_2005_02}{{140}{}{{}}{{}}}
\bibcite{Regge_Wheeler}{{141}{}{{}}{{}}}
\bibcite{Sakurai}{{142}{}{{}}{{}}}
\bibcite{Nakamura_01}{{143}{}{{}}{{}}}
\bibcite{LVTheory_03}{{144}{}{{}}{{}}}
\bibcite{BSSN_02}{{145}{}{{}}{{}}}
\bibcite{Echoes_04}{{146}{}{{}}{{}}}
\bibcite{T_decomposition}{{147}{}{{}}{{}}}
\bibcite{Nested_Sampling}{{148}{}{{}}{{}}}
\bibcite{Hulse_Taylor_01}{{149}{}{{}}{{}}}
\bibcite{Echoes_Search_06}{{150}{}{{}}{{}}}
\bibcite{Teukolsky_02_ApJ}{{151}{}{{}}{{}}}
\bibcite{Teukolsky_04_ApJ}{{152}{}{{}}{{}}}
\bibcite{Teukolsky_01_PRL}{{153}{}{{}}{{}}}
\bibcite{Echoes_Search_08}{{154}{}{{}}{{}}}
\bibcite{Echoes_Search_01}{{155}{}{{}}{{}}}
\bibcite{ULTB_GW_04}{{156}{}{{}}{{}}}
\bibcite{GWOSC_01}{{157}{}{{}}{{}}}
\bibcite{LALInference}{{158}{}{{}}{{}}}
\bibcite{Hulse_Taylor_02}{{159}{}{{}}{{}}}
\bibcite{Wills_02}{{160}{}{{}}{{}}}
\bibcite{Helvi_03}{{161}{}{{}}{{}}}
\bibcite{Helvi_01}{{162}{}{{}}{{}}}
\bibcite{Zerilli_01}{{163}{}{{}}{{}}}
\bibcite{Perimeter_01}{{164}{}{{}}{{}}}
\bibcite{Green_Function_Technique_03}{{165}{}{{}}{{}}}
\bibcite{Helvi_02}{{166}{}{{}}{{}}}
\bibcite{Green_Function_Technique_04}{{167}{}{{}}{{}}}
\bibstyle{plain}
\providecommand\NAT@force@numbers{}\NAT@force@numbers
