\relax 
\providecommand\hyper@newdestlabel[2]{}
\providecommand\zref@newlabel[2]{}
\citation{Mercury_02}
\citation{Mercury_01}
\citation{Einstein:1915bz}
\@writefile{toc}{\contentsline {chapter}{\numberline {5}Testing General Relativity through Gravitational-wave Detection}{49}{chapter.5}}
\@writefile{lof}{\addvspace {10\p@ }}
\@writefile{lot}{\addvspace {10\p@ }}
\@writefile{toc}{\contentsline {section}{\numberline {5.1}Introduction}{49}{section.5.1}}
\@writefile{toc}{\contentsline {section}{\numberline {5.2}Classical Tests of General Relativity}{49}{section.5.2}}
\@writefile{toc}{\contentsline {subsection}{\numberline {5.2.1}The Advance of Perihelion of Mercury}{49}{subsection.5.2.1}}
\citation{Einstein:1911vc}
\citation{Eddington}
\@writefile{toc}{\contentsline {subsection}{\numberline {5.2.2}The Eddington Experiment: Testing the Equivalence Principle by Observing Bending of Light Rays}{50}{subsection.5.2.2}}
\citation{Cassini_02}
\citation{Cassini_01}
\citation{Peters_and_Mathews}
\@writefile{toc}{\contentsline {subsection}{\numberline {5.2.3}Cassini Tests of General Relativity}{51}{subsection.5.2.3}}
\@writefile{toc}{\contentsline {subsection}{\numberline {5.2.4}Hulse–Taylor Binary: Indirect Evidence of Gravitational Waves}{51}{subsection.5.2.4}}
\citation{Hulse_Taylor_01,Hulse_Taylor_02}
\citation{LIGO_07}
\newlabel{eq:Peters_and_Mathews}{{5.6}{52}{Hulse–Taylor Binary: Indirect Evidence of Gravitational Waves}{equation.5.2.6}{}}
\newlabel{eq:Peters_and_Mathews@cref}{{[equation][6][5]5.6}{[1][52][]52}}
\@writefile{toc}{\contentsline {section}{\numberline {5.3}Tests of General Relativity with Direct Gravitational Waves}{52}{section.5.3}}
\@writefile{lof}{\contentsline {figure}{\numberline {5.1}{\ignorespaces The orbital period of the Hulse–Taylor binary as a function of time. Hulse and Taylor measured the period of the Hulse–Taylor binary in 30 years (denoted by dots). The measured period has been decreasing in good consistency with the prediction of general relativity (the solid line). Note that error bars have been included in the figure. }}{53}{figure.5.1}}
\newlabel{fig:HT_Binary}{{5.1}{53}{The orbital period of the Hulse–Taylor binary as a function of time. Hulse and Taylor measured the period of the Hulse–Taylor binary in 30 years (denoted by dots). The measured period has been decreasing in good consistency with the prediction of general relativity (the solid line). Note that error bars have been included in the figure}{figure.5.1}{}}
\newlabel{fig:HT_Binary@cref}{{[figure][1][5]5.1}{[1][52][]53}}
\citation{TIGER}
\citation{LIGO_07,LIGO_11}
\citation{IMR_Test_01,IMR_Test_02,IMR_Test_03}
\citation{IMR_Test_01}
\@writefile{toc}{\contentsline {subsection}{\numberline {5.3.1}Post Newtonian Parameterized Test}{54}{subsection.5.3.1}}
\@writefile{toc}{\contentsline {subsection}{\numberline {5.3.2}Inspiral-merger-ringdown (IMR) Consistency Test}{54}{subsection.5.3.2}}
\citation{LIGO_07}
\citation{LIGO_07}
\citation{LIGO_07}
\citation{Wills_01,Wills_02,Ajith_01}
\citation{LIGO_07}
\citation{LIGO_07}
\@writefile{toc}{\contentsline {subsection}{\numberline {5.3.3}Constraining the Mass of Graviton}{55}{subsection.5.3.3}}
\newlabel{eq:dephasing}{{5.11}{55}{Constraining the Mass of Graviton}{equation.5.3.11}{}}
\newlabel{eq:dephasing@cref}{{[equation][11][5]5.11}{[1][55][]55}}
\@writefile{lof}{\contentsline {figure}{\numberline {5.2}{\ignorespaces (Top panel) The 90-\% confidence interval of the posteriors of $ M_f $ and $ a_f $ by analysising the data (i) (pale violent dashed line) only the inspiral phase, (ii) (dark violent dashed line) the post-inspiral phase and (iii) (solid black line) using all the inspiral, merger and ringdown phase of GW150914. (Bottom panel) The two-dimensional posterior $ p(\Delta M, \Delta a_f) $ of GW150914. The dark blue solid line encloses the 90-\% confidence interval of $ p(\Delta M, \Delta a_f) $. Figure reproduced from \cite  {LIGO_07}. }}{56}{figure.5.2}}
\newlabel{fig:IMR_GW150914}{{5.2}{56}{(Top panel) The 90-\% confidence interval of the posteriors of $ M_f $ and $ a_f $ by analysising the data (i) (pale violent dashed line) only the inspiral phase, (ii) (dark violent dashed line) the post-inspiral phase and (iii) (solid black line) using all the inspiral, merger and ringdown phase of GW150914. (Bottom panel) The two-dimensional posterior $ p(\Delta M, \Delta a_f) $ of GW150914. The dark blue solid line encloses the 90-\% confidence interval of $ p(\Delta M, \Delta a_f) $. Figure reproduced from \cite {LIGO_07}}{figure.5.2}{}}
\newlabel{fig:IMR_GW150914@cref}{{[figure][2][5]5.2}{[1][55][]56}}
\@writefile{lof}{\contentsline {figure}{\numberline {5.3}{\ignorespaces The cumulative posterior probability distribution for $\lambda _g$ from the detection of GW150914, reproduced from \cite  {LIGO_07}. Note that the 90 \% confidence interval of $\lambda _g \sim 10^{14} $ km, which is of the same order of the luminosity distance of GW150914. }}{57}{figure.5.3}}
\newlabel{fig:m_g_GW150914}{{5.3}{57}{The cumulative posterior probability distribution for $\lambda _g$ from the detection of GW150914, reproduced from \cite {LIGO_07}. Note that the 90 \% confidence interval of $\lambda _g \sim 10^{14} $ km, which is of the same order of the luminosity distance of GW150914}{figure.5.3}{}}
\newlabel{fig:m_g_GW150914@cref}{{[figure][3][5]5.3}{[1][55][]57}}
\@writefile{toc}{\contentsline {subsection}{\numberline {5.3.4}Measuring the Temperature of Astrophysical Black Holes}{58}{subsection.5.3.4}}
\@writefile{toc}{\contentsline {section}{\numberline {5.4}Concluding Remarks}{58}{section.5.4}}
\@setckpt{chapter_TGRwGW}{
\setcounter{page}{59}
\setcounter{equation}{11}
\setcounter{enumi}{0}
\setcounter{enumii}{0}
\setcounter{enumiii}{0}
\setcounter{enumiv}{0}
\setcounter{footnote}{2}
\setcounter{mpfootnote}{0}
\setcounter{part}{0}
\setcounter{chapter}{5}
\setcounter{section}{4}
\setcounter{subsection}{0}
\setcounter{subsubsection}{0}
\setcounter{paragraph}{0}
\setcounter{subparagraph}{0}
\setcounter{figure}{3}
\setcounter{table}{0}
\setcounter{parentequation}{0}
\setcounter{lips@count}{0}
\setcounter{Item}{0}
\setcounter{Hfootnote}{3}
\setcounter{bookmark@seq@number}{60}
\setcounter{@pps}{0}
\setcounter{@ppsavesec}{0}
\setcounter{@ppsaveapp}{0}
\setcounter{NAT@ctr}{0}
\setcounter{subfigure}{0}
\setcounter{lofdepth}{1}
\setcounter{subtable}{0}
\setcounter{lotdepth}{1}
\setcounter{section@level}{1}
}
