\contentsline {chapter}{\numberline {1}Introduction}{1}{chapter.1}
\contentsline {section}{\numberline {1.1}General Relativity as a Theory of Gravity}{1}{section.1.1}
\contentsline {section}{\numberline {1.2}Linear Expansion of the Einstein Field Equation}{2}{section.1.2}
\contentsline {subsection}{\numberline {1.2.1}The Harmonic Gauge}{3}{subsection.1.2.1}
\contentsline {subsection}{\numberline {1.2.2}The Transverse-Traceless Gauge}{4}{subsection.1.2.2}
\contentsline {subsection}{\numberline {1.2.3}Generation of Gravitational Waves Due to General Sources}{5}{subsection.1.2.3}
\contentsline {section}{\numberline {1.3}Energy and Momentum of Gravitational Waves}{7}{section.1.3}
\contentsline {subsection}{\numberline {1.3.1}Effective Energy-momentum Tensor of Gravitational Waves}{7}{subsection.1.3.1}
\contentsline {subsection}{\numberline {1.3.2}Generation and Power of Gravitational Waves generated by Compact Binary Coalescence}{9}{subsection.1.3.2}
\contentsline {section}{\numberline {1.4}Response of Binary Black-Hole Systems to Emissions of Gravitational Waves}{11}{section.1.4}
\contentsline {subsection}{\numberline {1.4.1}Inspiral}{11}{subsection.1.4.1}
\contentsline {subsection}{\numberline {1.4.2}Merger}{14}{subsection.1.4.2}
\contentsline {subsection}{\numberline {1.4.3}Ringdown}{14}{subsection.1.4.3}
\contentsline {chapter}{\numberline {2}Gravitational Perturbations of Non-rotating Black Holes}{16}{chapter.2}
\contentsline {section}{\numberline {2.1}Introduction}{16}{section.2.1}
\contentsline {section}{\numberline {2.2}Odd-Parity Gravitational Perturbations}{17}{section.2.2}
\contentsline {section}{\numberline {2.3}Even-Parity Gravitational Perturbations}{19}{section.2.3}
\contentsline {section}{\numberline {2.4}Quasinormal Modes of Black-Hole Ringdown}{20}{section.2.4}
\contentsline {subsection}{\numberline {2.4.1}Boundary Conditions for Black-Hole Quasinormal-Mode}{20}{subsection.2.4.1}
\contentsline {subsection}{\numberline {2.4.2}Solving the Quasinormal-mode Frequencies by Leaver's Method}{21}{subsection.2.4.2}
\contentsline {subsection}{\numberline {2.4.3}Solving the Perturbation Function by the Method of Green's Function}{22}{subsection.2.4.3}
\contentsline {subsection}{\numberline {2.4.4}Isospectrality of the Regge-Wheeler and the Zerilli Equation}{24}{subsection.2.4.4}
\contentsline {section}{\numberline {2.5}Summary}{27}{section.2.5}
\contentsline {chapter}{\numberline {3}Gravitational Perturbations of Rotating Black Holes}{29}{chapter.3}
\contentsline {section}{\numberline {3.1}Introduction}{29}{section.3.1}
\contentsline {section}{\numberline {3.2}Spinor Coefficients}{30}{section.3.2}
\contentsline {section}{\numberline {3.3}Derivation of the Teukolsky Equation}{32}{section.3.3}
\contentsline {section}{\numberline {3.4}Energy Carried by the Ringdown Waveform}{34}{section.3.4}
\contentsline {section}{\numberline {3.5}Properties of the Teukolsky Equation}{34}{section.3.5}
\contentsline {subsection}{\numberline {3.5.1}Separation of Variables}{34}{subsection.3.5.1}
\contentsline {subsubsection}{\numberline {3.5.1.1}The Radial Equation}{34}{subsubsection.3.5.1.1}
\contentsline {subsubsection}{\numberline {3.5.1.2}The Angular Equation}{37}{subsubsection.3.5.1.2}
\contentsline {subsection}{\numberline {3.5.2}In Connection with Numerical-relativity Simulations}{38}{subsection.3.5.2}
\contentsline {subsection}{\numberline {3.5.3}Other Useful Properties}{38}{subsection.3.5.3}
\contentsline {section}{\numberline {3.6}Conclusions}{39}{section.3.6}
\contentsline {chapter}{\numberline {4}Bayesian Parameter Estimation and Model Selection}{41}{chapter.4}
\contentsline {section}{\numberline {4.1}Introduction}{41}{section.4.1}
\contentsline {section}{\numberline {4.2}Parameter Estimation}{41}{section.4.2}
\contentsline {subsection}{\numberline {4.2.1}Brief Introduction of Bayes Theorem}{41}{subsection.4.2.1}
\contentsline {subsection}{\numberline {4.2.2}Definitions of Parameters in Gravitational-wave Astronomy}{43}{subsection.4.2.2}
\contentsline {subsection}{\numberline {4.2.3}Definitions of Likelihood}{43}{subsection.4.2.3}
\contentsline {subsection}{\numberline {4.2.4}Extracting the Posteriors through Nested Sampling}{44}{subsection.4.2.4}
\contentsline {subsection}{\numberline {4.2.5}Marginalization of Posteriors}{46}{subsection.4.2.5}
\contentsline {section}{\numberline {4.3}Model Selection}{46}{section.4.3}
\contentsline {subsection}{\numberline {4.3.1}Odd Ratio and Bayes Factor}{46}{subsection.4.3.1}
\contentsline {subsection}{\numberline {4.3.2}Occam's razor}{47}{subsection.4.3.2}
\contentsline {section}{\numberline {4.4}Concluding Remarks}{48}{section.4.4}
\contentsline {chapter}{\numberline {5}Testing General Relativity through Gravitational-wave Detection}{49}{chapter.5}
\contentsline {section}{\numberline {5.1}Introduction}{49}{section.5.1}
\contentsline {section}{\numberline {5.2}Classical Tests of General Relativity}{49}{section.5.2}
\contentsline {subsection}{\numberline {5.2.1}The Advance of Perihelion of Mercury}{49}{subsection.5.2.1}
\contentsline {subsection}{\numberline {5.2.2}The Eddington Experiment: Testing the Equivalence Principle by Observing Bending of Light Rays}{50}{subsection.5.2.2}
\contentsline {subsection}{\numberline {5.2.3}Cassini Tests of General Relativity}{51}{subsection.5.2.3}
\contentsline {subsection}{\numberline {5.2.4}Hulse–Taylor Binary: Indirect Evidence of Gravitational Waves}{51}{subsection.5.2.4}
\contentsline {section}{\numberline {5.3}Tests of General Relativity with Direct Gravitational Waves}{52}{section.5.3}
\contentsline {subsection}{\numberline {5.3.1}Post Newtonian Parameterized Test}{54}{subsection.5.3.1}
\contentsline {subsection}{\numberline {5.3.2}Inspiral-merger-ringdown (IMR) Consistency Test}{54}{subsection.5.3.2}
\contentsline {subsection}{\numberline {5.3.3}Constraining the Mass of Graviton}{55}{subsection.5.3.3}
\contentsline {subsection}{\numberline {5.3.4}Measuring the Temperature of Astrophysical Black Holes}{58}{subsection.5.3.4}
\contentsline {section}{\numberline {5.4}Concluding Remarks}{58}{section.5.4}
\contentsline {chapter}{\numberline {6}Phenomenological Inclusion of Alternative Dispersion Relations to the Teukolsky Equation and its Application to Bounding the Graviton Mass with Gravitational-wave Measurements }{59}{chapter.6}
\contentsline {section}{\numberline {6.1}Introduction}{59}{section.6.1}
\contentsline {subsection}{\numberline {6.1.1}Massive Gravity Theories}{59}{subsection.6.1.1}
\contentsline {subsection}{\numberline {6.1.2}Existing Tests of the Graviton Mass through Gravitational-wave Detection}{60}{subsection.6.1.2}
\contentsline {section}{\numberline {6.2}Method}{61}{section.6.2}
\contentsline {section}{\numberline {6.3}Parameter Estimation}{66}{section.6.3}
\contentsline {section}{\numberline {6.4}Concluding Remarks}{67}{section.6.4}
\contentsline {section}{\numberline {6.5}Appendix: Calculation in LPT -- }{70}{section.6.5}
\contentsline {chapter}{\numberline {7}First Direct Constraint on the Temperature of a Black Hole}{74}{chapter.7}
\contentsline {section}{\numberline {7.1}Introduction}{74}{section.7.1}
\contentsline {subsection}{\numberline {7.1.1}A Heuristic Introduction to Black-hole Radiation}{74}{subsection.7.1.1}
\contentsline {subsection}{\numberline {7.1.2}Implication to Gravitational-wave Astrophysics}{76}{subsection.7.1.2}
\contentsline {section}{\numberline {7.2}Phenomenological description of the quasi-normal modes of quantum black holes.}{77}{section.7.2}
\contentsline {section}{\numberline {7.3}Results of GW150914 Remnant}{81}{section.7.3}
\contentsline {section}{\numberline {7.4}Concluding Remarks}{83}{section.7.4}
\contentsline {chapter}{\numberline {8}Concluding Remarks}{88}{chapter.8}
\contentsline {section}{\numberline {8.1}Importance of Black-hole Ringdown Detection}{88}{section.8.1}
\contentsline {section}{\numberline {8.2}The Work in the Thesis}{89}{section.8.2}
\contentsline {section}{\numberline {8.3}Future Work}{89}{section.8.3}
\contentsline {subsection}{\numberline {8.3.1}Ringdown of Black Holes with Topological Defects}{89}{subsection.8.3.1}
\contentsline {subsection}{\numberline {8.3.2}Probing Gravitational-atomic Nature of the Final Black Hole of Gravitational-wave Events}{90}{subsection.8.3.2}
\contentsline {chapter}{Bibliography}{91}{subsection.8.3.2}
