\contentsline {chapter}{\numberline {1}Introduction}{1}{chapter.1}
\contentsline {section}{\numberline {1.1}General Relativity as a Theory of Gravity}{1}{section.1.1}
\contentsline {section}{\numberline {1.2}Linear Expansion of the Einstein Field Equation}{2}{section.1.2}
\contentsline {subsection}{\numberline {1.2.1}The Harmonic Gauge}{3}{subsection.1.2.1}
\contentsline {subsection}{\numberline {1.2.2}The Transverse-Traceless Gauge}{4}{subsection.1.2.2}
\contentsline {subsection}{\numberline {1.2.3}Generation of Gravitational Waves Due to General Sources}{5}{subsection.1.2.3}
\contentsline {section}{\numberline {1.3}Energy and Momentum of Gravitational Waves}{7}{section.1.3}
\contentsline {subsection}{\numberline {1.3.1}Effective Energy-momentum Tensor of Gravitational Waves}{7}{subsection.1.3.1}
\contentsline {subsection}{\numberline {1.3.2}Generation and Power of Gravitational Waves generated by Compact Binary Coalescence}{9}{subsection.1.3.2}
\contentsline {section}{\numberline {1.4}Response of Binary Black-Hole Systems to Emissions of Gravitational Waves}{11}{section.1.4}
\contentsline {subsection}{\numberline {1.4.1}Inspiral}{11}{subsection.1.4.1}
\contentsline {subsection}{\numberline {1.4.2}Merger}{14}{subsection.1.4.2}
\contentsline {subsection}{\numberline {1.4.3}Ringdown}{14}{subsection.1.4.3}
\contentsline {chapter}{\numberline {2}Gravitational Perturbations of Non-rotating Black Holes}{16}{chapter.2}
\contentsline {section}{\numberline {2.1}Introduction}{16}{section.2.1}
\contentsline {section}{\numberline {2.2}Odd-Parity Gravitational Perturbations}{17}{section.2.2}
\contentsline {section}{\numberline {2.3}Even-Parity Gravitational Perturbations}{19}{section.2.3}
\contentsline {section}{\numberline {2.4}Quasinormal Modes of Black-Hole Ringdown}{20}{section.2.4}
\contentsline {subsection}{\numberline {2.4.1}Boundary Conditions for Black-Hole Quasinormal-Mode}{20}{subsection.2.4.1}
\contentsline {subsection}{\numberline {2.4.2}Solving the Quasinormal-mode Frequencies by Leaver's Method}{21}{subsection.2.4.2}
\contentsline {subsection}{\numberline {2.4.3}Solving the Perturbation Function by the Method of Green's Function}{22}{subsection.2.4.3}
\contentsline {subsection}{\numberline {2.4.4}Isospectrality of the Regge-Wheeler and the Zerilli Equation}{24}{subsection.2.4.4}
\contentsline {section}{\numberline {2.5}Summary}{27}{section.2.5}
\contentsline {chapter}{\numberline {3}Gravitational Perturbations of Rotating Black Holes}{29}{chapter.3}
\contentsline {section}{\numberline {3.1}Introduction}{29}{section.3.1}
\contentsline {section}{\numberline {3.2}Spinor Coefficients}{30}{section.3.2}
\contentsline {section}{\numberline {3.3}Derivation of the Teukolsky Equation}{32}{section.3.3}
\contentsline {section}{\numberline {3.4}Energy Carried by the Ringdown Waveform}{34}{section.3.4}
\contentsline {section}{\numberline {3.5}Properties of the Teukolsky Equation}{34}{section.3.5}
\contentsline {subsection}{\numberline {3.5.1}Separation of Variables}{34}{subsection.3.5.1}
\contentsline {subsubsection}{\numberline {3.5.1.1}The Radial Equation}{34}{subsubsection.3.5.1.1}
\contentsline {subsubsection}{\numberline {3.5.1.2}The Angular Equation}{37}{subsubsection.3.5.1.2}
\contentsline {subsection}{\numberline {3.5.2}In Connection with Numerical-relativity Simulations}{38}{subsection.3.5.2}
\contentsline {subsection}{\numberline {3.5.3}Other Useful Properties}{38}{subsection.3.5.3}
\contentsline {section}{\numberline {3.6}Conclusions}{39}{section.3.6}
\contentsline {chapter}{\numberline {4}Phenomenological Inclusion of Alternative Dispersion Relations to the Teukolsky Equation and its Application to Bounding the Graviton Mass with Gravitational-wave Measurements }{41}{chapter.4}
\contentsline {section}{\numberline {4.1}Introduction}{41}{section.4.1}
\contentsline {section}{\numberline {4.2}Method}{42}{section.4.2}
\contentsline {section}{\numberline {4.3}Parameter Estimation}{47}{section.4.3}
\contentsline {section}{\numberline {4.4}Concluding Remarks}{48}{section.4.4}
\contentsline {section}{\numberline {4.5}Appendix: Calculation in LPT -- }{51}{section.4.5}
\contentsline {chapter}{\numberline {5}Measuring the Temperature of Astrophysical Black Holes through Detecting their Ringdown Phases: An Application to the Final Black Hole of GW150914}{55}{chapter.5}
\contentsline {section}{\numberline {5.1}The Bounday Condition at the Horizon}{56}{section.5.1}
\contentsline {section}{\numberline {5.2}Ringdown Phase of Quantum Black Holes}{57}{section.5.2}
\contentsline {section}{\numberline {5.3}Parameter Estimation}{58}{section.5.3}
\contentsline {section}{\numberline {5.4}Concluding Remarks}{60}{section.5.4}
\contentsline {chapter}{\numberline {6}Concluding Remarks}{66}{chapter.6}
\contentsline {section}{\numberline {6.1}Importance of Black-hole Ringdown Detection}{66}{section.6.1}
\contentsline {section}{\numberline {6.2}The Work in the Thesis}{67}{section.6.2}
\contentsline {section}{\numberline {6.3}Future Work}{67}{section.6.3}
\contentsline {chapter}{Bibliography}{68}{section.6.3}
