\boolfalse {citerequest}\boolfalse {citetracker}\boolfalse {pagetracker}\boolfalse {backtracker}\relax 
\babel@toc {english}{}
\defcounter {refsection}{0}\relax 
\beamer@sectionintoc {1}{BH Perturbation}{4}{0}{1}
\defcounter {refsection}{0}\relax 
\beamer@sectionintoc {2}{NP Formalism}{14}{0}{2}
\defcounter {refsection}{0}\relax 
\beamer@sectionintoc {3}{Constraining $m_g$}{18}{0}{3}
\defcounter {refsection}{0}\relax 
\beamer@sectionintoc {4}{Temperature Measurement}{29}{0}{4}
