\relax 
\@writefile{toc}{\contentsline {chapter}{Abstract}{i}}
\@writefile{toc}{\contentsline {chapter}{Acknowledgement}{ii}}
\@writefile{toc}{\contentsline {chapter}{\numberline {1}Introduction}{1}}
\@writefile{lof}{\addvspace {10\p@ }}
\@writefile{lot}{\addvspace {10\p@ }}
\citation{theimer89}
\@writefile{toc}{\contentsline {chapter}{\numberline {2}Background Study}{4}}
\@writefile{lof}{\addvspace {10\p@ }}
\@writefile{lot}{\addvspace {10\p@ }}
\@writefile{toc}{\contentsline {chapter}{\numberline {3}Conclusion}{5}}
\@writefile{lof}{\addvspace {10\p@ }}
\@writefile{lot}{\addvspace {10\p@ }}
\citation{lyle88}
\@writefile{toc}{\contentsline {chapter}{\numberline {A}Equation Derivation}{6}}
\@writefile{lof}{\addvspace {10\p@ }}
\@writefile{lot}{\addvspace {10\p@ }}
\bibstyle{ieee}
\bibdata{database}
\bibcite{lyle88}{1}
\bibcite{theimer89}{2}
\@writefile{toc}{\contentsline {chapter}{Bibliography}{7}}
