\contentsline {chapter}{Abstract}{i}
\contentsline {chapter}{Acknowledgement}{ii}
\contentsline {chapter}{\numberline {1}Introduction}{1}
\contentsline {chapter}{\numberline {2}Background Study}{4}
\contentsline {chapter}{\numberline {3}Conclusion}{5}
\contentsline {chapter}{\numberline {A}Equation Derivation}{6}
\contentsline {chapter}{Bibliography}{7}
