\relax 
\providecommand\hyper@newdestlabel[2]{}
\providecommand\zref@newlabel[2]{}
\citation{LHC_01}
\citation{EHT_04}
\@writefile{toc}{\contentsline {chapter}{\numberline {4}Bayesian Parameter Estimation and Model Selection}{41}{chapter.4}}
\@writefile{lof}{\addvspace {10\p@ }}
\@writefile{lot}{\addvspace {10\p@ }}
\newlabel{chap:Bayesian}{{4}{41}{Bayesian Parameter Estimation and Model Selection}{chapter.4}{}}
\newlabel{chap:Bayesian@cref}{{[chapter][4][]4}{[1][41][]41}}
\@writefile{toc}{\contentsline {section}{\numberline {4.1}Introduction}{41}{section.4.1}}
\@writefile{toc}{\contentsline {section}{\numberline {4.2}Parameter Estimation}{41}{section.4.2}}
\newlabel{sec:PE}{{4.2}{41}{Parameter Estimation}{section.4.2}{}}
\newlabel{sec:PE@cref}{{[section][2][4]4.2}{[1][41][]41}}
\@writefile{toc}{\contentsline {subsection}{\numberline {4.2.1}Brief Introduction of Bayes Theorem}{41}{subsection.4.2.1}}
\newlabel{eq:sim_Bayes_theorem}{{4.3}{42}{Brief Introduction of Bayes Theorem}{equation.4.2.3}{}}
\newlabel{eq:sim_Bayes_theorem@cref}{{[equation][3][4]4.3}{[1][42][]42}}
\newlabel{eq:Bayes_theorem_GW}{{4.4}{42}{Brief Introduction of Bayes Theorem}{equation.4.2.4}{}}
\newlabel{eq:Bayes_theorem_GW@cref}{{[equation][4][4]4.4}{[1][42][]42}}
\citation{LIGO_06}
\citation{Cutler_Flanagan_1994}
\@writefile{toc}{\contentsline {subsection}{\numberline {4.2.2}Definitions of Parameters in Gravitational-wave Astronomy}{43}{subsection.4.2.2}}
\@writefile{toc}{\contentsline {subsection}{\numberline {4.2.3}Definitions of Likelihood}{43}{subsection.4.2.3}}
\newlabel{eq:likelihood}{{4.5}{43}{Definitions of Likelihood}{equation.4.2.5}{}}
\newlabel{eq:likelihood@cref}{{[equation][5][4]4.5}{[1][43][]43}}
\citation{Nested_Sampling}
\@writefile{toc}{\contentsline {subsection}{\numberline {4.2.4}Extracting the Posteriors through Nested Sampling}{44}{subsection.4.2.4}}
\citation{Tjonnie_thesis}
\citation{LALInference}
\citation{PyMultiNest}
\citation{CPNest}
\@writefile{toc}{\contentsline {subsection}{\numberline {4.2.5}Marginalization of Posteriors}{46}{subsection.4.2.5}}
\@writefile{toc}{\contentsline {section}{\numberline {4.3}Model Selection}{46}{section.4.3}}
\@writefile{toc}{\contentsline {subsection}{\numberline {4.3.1}Odd Ratio and Bayes Factor}{46}{subsection.4.3.1}}
\@writefile{toc}{\contentsline {subsection}{\numberline {4.3.2}Occam's razor}{47}{subsection.4.3.2}}
\@writefile{toc}{\contentsline {section}{\numberline {4.4}Concluding Remarks}{48}{section.4.4}}
\@setckpt{chapter_Bayesian}{
\setcounter{page}{49}
\setcounter{equation}{25}
\setcounter{enumi}{0}
\setcounter{enumii}{0}
\setcounter{enumiii}{0}
\setcounter{enumiv}{0}
\setcounter{footnote}{1}
\setcounter{mpfootnote}{0}
\setcounter{part}{0}
\setcounter{chapter}{4}
\setcounter{section}{4}
\setcounter{subsection}{0}
\setcounter{subsubsection}{0}
\setcounter{paragraph}{0}
\setcounter{subparagraph}{0}
\setcounter{figure}{0}
\setcounter{table}{0}
\setcounter{parentequation}{0}
\setcounter{lips@count}{0}
\setcounter{Item}{0}
\setcounter{Hfootnote}{1}
\setcounter{bookmark@seq@number}{47}
\setcounter{@pps}{0}
\setcounter{@ppsavesec}{0}
\setcounter{@ppsaveapp}{0}
\setcounter{NAT@ctr}{0}
\setcounter{subfigure}{0}
\setcounter{lofdepth}{1}
\setcounter{subtable}{0}
\setcounter{lotdepth}{1}
\setcounter{section@level}{1}
}
