\relax 
\providecommand\hyper@newdestlabel[2]{}
\providecommand\zref@newlabel[2]{}
\@writefile{toc}{\contentsline {chapter}{\numberline {2}Gravitational Perturbations of Non-rotating Black Holes}{16}{chapter.2}}
\@writefile{lof}{\addvspace {10\p@ }}
\@writefile{lot}{\addvspace {10\p@ }}
\@writefile{toc}{\contentsline {section}{\numberline {2.1}Introduction}{16}{section.2.1}}
\newlabel{eq:schwarzschild black hole}{{2.1}{16}{Introduction}{equation.2.1.1}{}}
\newlabel{eq:schwarzschild black hole@cref}{{[equation][1][2]2.1}{[1][16][]16}}
\citation{Regge_Wheeler}
\@writefile{toc}{\contentsline {section}{\numberline {2.2}Odd-Parity Gravitational Perturbations}{17}{section.2.2}}
\newlabel{eq:perturbation}{{2.7}{17}{Odd-Parity Gravitational Perturbations}{equation.2.2.7}{}}
\newlabel{eq:perturbation@cref}{{[equation][7][2]2.7}{[1][17][]17}}
\newlabel{eq:perturbation_axial}{{2.8}{17}{Odd-Parity Gravitational Perturbations}{equation.2.2.8}{}}
\newlabel{eq:perturbation_axial@cref}{{[equation][8][2]2.8}{[1][17][]17}}
\newlabel{eq:perturbation_polar}{{2.9}{17}{Odd-Parity Gravitational Perturbations}{equation.2.2.9}{}}
\newlabel{eq:perturbation_polar@cref}{{[equation][9][2]2.9}{[1][17][]17}}
\newlabel{eq:RG_equation}{{2.14}{18}{Odd-Parity Gravitational Perturbations}{equation.2.2.14}{}}
\newlabel{eq:RG_equation@cref}{{[equation][14][2]2.14}{[1][18][]18}}
\newlabel{eq:V_RW}{{2.16}{18}{Odd-Parity Gravitational Perturbations}{equation.2.2.16}{}}
\newlabel{eq:V_RW@cref}{{[equation][16][2]2.16}{[1][18][]18}}
\citation{Zerilli_01}
\@writefile{toc}{\contentsline {section}{\numberline {2.3}Even-Parity Gravitational Perturbations}{19}{section.2.3}}
\newlabel{eq:V_Z}{{2.26}{20}{Even-Parity Gravitational Perturbations}{equation.2.3.26}{}}
\newlabel{eq:V_Z@cref}{{[equation][26][2]2.26}{[1][20][]20}}
\@writefile{toc}{\contentsline {section}{\numberline {2.4}Quasinormal Modes of Black-Hole Ringdown}{20}{section.2.4}}
\@writefile{toc}{\contentsline {subsection}{\numberline {2.4.1}Boundary Conditions for Black-Hole Quasinormal-Mode}{20}{subsection.2.4.1}}
\newlabel{eq:Master_equation}{{2.29}{20}{Boundary Conditions for Black-Hole Quasinormal-Mode}{equation.2.4.29}{}}
\newlabel{eq:Master_equation@cref}{{[equation][29][2]2.29}{[1][20][]20}}
\citation{Leaver_01}
\newlabel{eq:QNM_BC}{{2.32}{21}{Boundary Conditions for Black-Hole Quasinormal-Mode}{equation.2.4.32}{}}
\newlabel{eq:QNM_BC@cref}{{[equation][32][2]2.32}{[1][21][]21}}
\@writefile{toc}{\contentsline {subsection}{\numberline {2.4.2}Solving the Quasinormal-mode Frequencies by Leaver's Method}{21}{subsection.2.4.2}}
\newlabel{eq:Leaver_sol}{{2.34}{21}{Solving the Quasinormal-mode Frequencies by Leaver's Method}{equation.2.4.34}{}}
\newlabel{eq:Leaver_sol@cref}{{[equation][34][2]2.34}{[1][21][]21}}
\citation{Green_Function_Technique_01,Green_Function_Technique_02,Green_Function_Technique_03,Green_Function_Technique_04}
\@writefile{toc}{\contentsline {subsection}{\numberline {2.4.3}Solving the Perturbation Function by the Method of Green's Function}{22}{subsection.2.4.3}}
\newlabel{eq:Master_equation_Laplace_transformed}{{2.41}{22}{Solving the Perturbation Function by the Method of Green's Function}{equation.2.4.41}{}}
\newlabel{eq:Master_equation_Laplace_transformed@cref}{{[equation][41][2]2.41}{[1][22][]22}}
\citation{Hartle_01}
\citation{Maggiore_vol_2}
\newlabel{eq:down_mode}{{2.43}{23}{Solving the Perturbation Function by the Method of Green's Function}{equation.2.4.43}{}}
\newlabel{eq:down_mode@cref}{{[equation][43][2]2.43}{[1][23][]23}}
\newlabel{eq:up_mode}{{2.44}{23}{Solving the Perturbation Function by the Method of Green's Function}{equation.2.4.44}{}}
\newlabel{eq:up_mode@cref}{{[equation][44][2]2.44}{[1][23][]23}}
\citation{Maggiore_vol_2}
\citation{Maggiore_vol_2}
\citation{Maggiore_vol_2}
\citation{Maggiore_vol_2}
\citation{SUSY_01,SUSY_02}
\newlabel{eq:IFT}{{2.52}{24}{Solving the Perturbation Function by the Method of Green's Function}{equation.2.4.52}{}}
\newlabel{eq:IFT@cref}{{[equation][52][2]2.52}{[1][24][]24}}
\@writefile{toc}{\contentsline {subsection}{\numberline {2.4.4}Isospectrality of the Regge-Wheeler and the Zerilli Equation}{24}{subsection.2.4.4}}
\@writefile{lof}{\contentsline {figure}{\numberline {2.1}{\ignorespaces Contour used when evaluating inverse Laplace transform. Figure reproduced from \cite  {Maggiore_vol_2} with permission. }}{25}{figure.2.1}}
\newlabel{fig:contour}{{2.1}{25}{Contour used when evaluating inverse Laplace transform. Figure reproduced from \cite {Maggiore_vol_2} with permission}{figure.2.1}{}}
\newlabel{fig:contour@cref}{{[figure][1][2]2.1}{[1][24][]25}}
\@writefile{lof}{\contentsline {figure}{\numberline {2.2}{\ignorespaces The effective potential for the Regge-Wheeler (solid lines) and the Zerilli equation (dashed line) for $ l = 2$ and 3 as functions of $ x $. Despite the expressions of the two potentials are very different, they give almost the same value for a given $ x $ for $ l = 2 $ and 3. Figure modified from \cite  {Maggiore_vol_2} with permission. }}{26}{figure.2.2}}
\newlabel{fig:Effective_Potential}{{2.2}{26}{The effective potential for the Regge-Wheeler (solid lines) and the Zerilli equation (dashed line) for $ l = 2$ and 3 as functions of $ x $. Despite the expressions of the two potentials are very different, they give almost the same value for a given $ x $ for $ l = 2 $ and 3. Figure modified from \cite {Maggiore_vol_2} with permission}{figure.2.2}{}}
\newlabel{fig:Effective_Potential@cref}{{[figure][2][2]2.2}{[1][24][]26}}
\newlabel{eq:SUSY_relation}{{2.54}{26}{Isospectrality of the Regge-Wheeler and the Zerilli Equation}{equation.2.4.54}{}}
\newlabel{eq:SUSY_relation@cref}{{[equation][54][2]2.54}{[1][26][]26}}
\newlabel{eq:SUSY_transform}{{2.56}{26}{Isospectrality of the Regge-Wheeler and the Zerilli Equation}{equation.2.4.56}{}}
\newlabel{eq:SUSY_transform@cref}{{[equation][56][2]2.56}{[1][26][]26}}
\citation{Maggiore_vol_2}
\citation{Maggiore_vol_2}
\@writefile{toc}{\contentsline {section}{\numberline {2.5}Summary}{27}{section.2.5}}
\@setckpt{chapter2}{
\setcounter{page}{29}
\setcounter{equation}{60}
\setcounter{enumi}{0}
\setcounter{enumii}{0}
\setcounter{enumiii}{0}
\setcounter{enumiv}{0}
\setcounter{footnote}{0}
\setcounter{mpfootnote}{0}
\setcounter{part}{0}
\setcounter{chapter}{2}
\setcounter{section}{5}
\setcounter{subsection}{0}
\setcounter{subsubsection}{0}
\setcounter{paragraph}{0}
\setcounter{subparagraph}{0}
\setcounter{figure}{2}
\setcounter{table}{0}
\setcounter{parentequation}{0}
\setcounter{lips@count}{0}
\setcounter{Item}{0}
\setcounter{Hfootnote}{0}
\setcounter{bookmark@seq@number}{23}
\setcounter{@pps}{0}
\setcounter{@ppsavesec}{0}
\setcounter{@ppsaveapp}{0}
\setcounter{NAT@ctr}{0}
\setcounter{subfigure}{0}
\setcounter{lofdepth}{1}
\setcounter{subtable}{0}
\setcounter{lotdepth}{1}
\setcounter{section@level}{1}
}
