\relax 
\providecommand\hyper@newdestlabel[2]{}
\providecommand\zref@newlabel[2]{}
\citation{Chung_02}
\@writefile{toc}{\contentsline {chapter}{\numberline {7}First Direct Constraint on the Temperature of a Black Hole}{74}{chapter.7}}
\@writefile{lof}{\addvspace {10\p@ }}
\@writefile{lot}{\addvspace {10\p@ }}
\newlabel{chap:BHTemp}{{7}{74}{First Direct Constraint on the Temperature of a Black Hole}{chapter.7}{}}
\newlabel{chap:BHTemp@cref}{{[chapter][7][]7}{[1][74][]74}}
\@writefile{toc}{\contentsline {section}{\numberline {7.1}Introduction}{74}{section.7.1}}
\@writefile{toc}{\contentsline {subsection}{\numberline {7.1.1}A Heuristic Introduction to Black-hole Radiation}{74}{subsection.7.1.1}}
\newlabel{eq:Phi_H}{{7.1}{74}{A Heuristic Introduction to Black-hole Radiation}{equation.7.1.1}{}}
\newlabel{eq:Phi_H@cref}{{[equation][1][7]7.1}{[1][74][]74}}
\newlabel{eq:Phi_I}{{7.3}{75}{A Heuristic Introduction to Black-hole Radiation}{equation.7.1.3}{}}
\newlabel{eq:Phi_I@cref}{{[equation][3][7]7.3}{[1][75][]75}}
\newlabel{eq:bogoliubov_transformation}{{7.6}{75}{A Heuristic Introduction to Black-hole Radiation}{equation.7.1.6}{}}
\newlabel{eq:bogoliubov_transformation@cref}{{[equation][6][7]7.6}{[1][75][]75}}
\newlabel{eq:bogoliubov_coefficient}{{7.10}{75}{A Heuristic Introduction to Black-hole Radiation}{equation.7.1.10}{}}
\newlabel{eq:bogoliubov_coefficient@cref}{{[equation][10][7]7.10}{[1][75][]75}}
\citation{LIGO_detector_01,Virgo_detector_01}
\citation{LIGO_08,LIGO_07,LIGO_03,LIGO_11,Carullo_01,Carullo_02,Carullo_03,Brito_Buonanno_Raymond_01,Isi_01}
\citation{Echoes_Search_01,Echoes_Search_02,Echoes_Search_03,Echoes_Search_04,Echoes_Search_05,Echoes_Search_06,Echoes_Search_07,Echoes_Search_08}
\citation{Green_Function_Technique_02,QNM_03,QNM_04,QNM_05}
\citation{Berti_02,Andersson_01}
\citation{BH_Radiation_01,BH_Radiation_02}
\citation{LIGO_07,LIGO_03,LIGO_11,IMR_Test_01,BH_Nature_Test_01,BBH_Thermodynamics_test_01,Nikhef_01}
\newlabel{eq:occupation_number}{{7.11}{76}{A Heuristic Introduction to Black-hole Radiation}{equation.7.1.11}{}}
\newlabel{eq:occupation_number@cref}{{[equation][11][7]7.11}{[1][75][]76}}
\@writefile{toc}{\contentsline {subsection}{\numberline {7.1.2}Implication to Gravitational-wave Astrophysics}{76}{subsection.7.1.2}}
\citation{Teukolsky_01_PRL,Teukolsky_02_ApJ,Teukolsky_03_ApJ,Teukolsky_04_ApJ}
\citation{Berti_01}
\citation{BH_Radiation_01,BH_Radiation_02}
\@writefile{toc}{\contentsline {section}{\numberline {7.2}Phenomenological description of the quasi-normal modes of quantum black holes.}{77}{section.7.2}}
\newlabel{eq:BC}{{7.15}{77}{Phenomenological description of the quasi-normal modes of quantum black holes}{equation.7.2.15}{}}
\newlabel{eq:BC@cref}{{[equation][15][7]7.15}{[1][77][]77}}
\citation{Sakurai}
\citation{hawking1977quantum}
\citation{Green_Function_Technique_01,Green_Function_Technique_02,Green_Function_Technique_03}
\newlabel{eq:QBH_RD_Waveform}{{7.16}{78}{Phenomenological description of the quasi-normal modes of quantum black holes}{equation.7.2.16}{}}
\newlabel{eq:QBH_RD_Waveform@cref}{{[equation][16][7]7.16}{[1][78][]78}}
\newlabel{eq:excitation_approx}{{7.17}{78}{Phenomenological description of the quasi-normal modes of quantum black holes}{equation.7.2.17}{}}
\newlabel{eq:excitation_approx@cref}{{[equation][17][7]7.17}{[1][78][]78}}
\citation{Green_Function_Technique_01,Green_Function_Technique_03}
\citation{Don_Page_01}
\newlabel{eq:graviton_emission_rate}{{7.20}{79}{Phenomenological description of the quasi-normal modes of quantum black holes}{equation.7.2.20}{}}
\newlabel{eq:graviton_emission_rate@cref}{{[equation][20][7]7.20}{[1][79][]79}}
\newlabel{eq:graviton_emission_power}{{7.21}{79}{Phenomenological description of the quasi-normal modes of quantum black holes}{equation.7.2.21}{}}
\newlabel{eq:graviton_emission_power@cref}{{[equation][21][7]7.21}{[1][79][]79}}
\citation{Nikhef_01}
\@writefile{lof}{\contentsline {figure}{\numberline {7.1}{\ignorespaces The magnitude of $ \frac  {M}{r} |\DOTSI \intop \ilimits@ _{0}^{+ \infty } \mathcal  {H}(\omega |\beta ) d \omega | $ and $\frac  {M}{r} |C(\mathaccentV {tilde}07E{\omega }_{022}|\beta )|$ as a function of temperature, with $ \mathaccentV {tilde}07E{\omega }_{022} $, $ M $ and $ r $ taken to be the estimated 022-mode frequency, final mass and luminosity distance of the GW150914 remnant. These two terms correspond to the extra quasi-normal-mode excitation term and continuous-emission term in Eq.\nobreakspace  {}\ref  {eq:QBH_RD_Waveform} at the start of the ringdown phase. The horizontal dashed line plots the value of $ \frac  {M}{r} $ of the GW150914 remnant. From the plot, we conclude that $ |\DOTSI \intop \ilimits@ _{0}^{+ \infty } \mathcal  {H}(\omega |\beta ) d \omega | $ is much larger than $ |C(\mathaccentV {tilde}07E{\omega }_{022}|\beta )| $. Thus, the continuous emission is comparatively more visible than the extra excitation of quasi-normal modes.}}{80}{figure.7.1}}
\newlabel{fig:Term_Contribution}{{7.1}{80}{The magnitude of $ \frac {M}{r} |\int _{0}^{+ \infty } \mathcal {H}(\omega |\beta ) d \omega | $ and $\frac {M}{r} |C(\tilde {\omega }_{022}|\beta )|$ as a function of temperature, with $ \tilde {\omega }_{022} $, $ M $ and $ r $ taken to be the estimated 022-mode frequency, final mass and luminosity distance of the GW150914 remnant. These two terms correspond to the extra quasi-normal-mode excitation term and continuous-emission term in Eq.~\ref {eq:QBH_RD_Waveform} at the start of the ringdown phase. The horizontal dashed line plots the value of $ \frac {M}{r} $ of the GW150914 remnant. From the plot, we conclude that $ |\int _{0}^{+ \infty } \mathcal {H}(\omega |\beta ) d \omega | $ is much larger than $ |C(\tilde {\omega }_{022}|\beta )| $. Thus, the continuous emission is comparatively more visible than the extra excitation of quasi-normal modes}{figure.7.1}{}}
\newlabel{fig:Term_Contribution@cref}{{[figure][1][7]7.1}{[1][80][]80}}
\newlabel{eq:H_omega}{{7.22}{80}{Phenomenological description of the quasi-normal modes of quantum black holes}{equation.7.2.22}{}}
\newlabel{eq:H_omega@cref}{{[equation][22][7]7.22}{[1][79][]80}}
\citation{GWOSC_01}
\citation{BH_Accretion_Disk_Temp_01}
\citation{Carullo_02}
\citation{Carullo_01}
\citation{LIGO_01,LIGO_07}
\citation{Nikhef_01}
\citation{Carullo_02}
\citation{Carullo_02}
\citation{CPNest}
\@writefile{toc}{\contentsline {section}{\numberline {7.3}Results of GW150914 Remnant}{81}{section.7.3}}
\newlabel{eq:Bayes_theorem}{{7.23}{81}{Results of GW150914 Remnant}{equation.7.3.23}{}}
\newlabel{eq:Bayes_theorem@cref}{{[equation][23][7]7.23}{[1][81][]81}}
\citation{GWOSC_01}
\@writefile{lof}{\contentsline {figure}{\numberline {7.2}{\ignorespaces The posterior of the temperature of the remnant black hole of GW150914, $p(\qopname  \relax o{log}T|d, H, I) $, where $ T $ is measured in Kelvin. The posterior shows no support for $ T > 10^{6}\tmspace  +\thinmuskip {.1667em}\mathrm  {K} $, which sets the first direct constraint on the temperature of a black hole.}}{82}{figure.7.2}}
\newlabel{fig:Summary_Plot}{{7.2}{82}{The posterior of the temperature of the remnant black hole of GW150914, $p(\log T|d, H, I) $, where $ T $ is measured in Kelvin. The posterior shows no support for $ T > 10^{6}\,\mathrm {K} $, which sets the first direct constraint on the temperature of a black hole}{figure.7.2}{}}
\newlabel{fig:Summary_Plot@cref}{{[figure][2][7]7.2}{[1][82][]82}}
\citation{BH_Accretion_Disk_Temp_01}
\citation{BBH_Thermodynamics_test_01,BBH_Thermodynamics_test_02}
\citation{LISA_proposal}
\citation{GreyBody_Factor_01,GreyBody_Factor_02,GreyBody_Factor_03,GreyBody_Factor_04}
\@writefile{toc}{\contentsline {section}{\numberline {7.4}Concluding Remarks}{83}{section.7.4}}
\newlabel{eq:Integral}{{7.26}{83}{Concluding Remarks}{equation.7.4.26}{}}
\newlabel{eq:Integral@cref}{{[equation][26][7]7.26}{[1][83][]83}}
\newlabel{eq:estimateT}{{7.27}{83}{Concluding Remarks}{equation.7.4.27}{}}
\newlabel{eq:estimateT@cref}{{[equation][27][7]7.27}{[1][83][]83}}
\newlabel{eq:Laplace_Transform}{{7.29}{84}{Derivation of the Ringdown Waveform of Quantum Black Holes}{equation.7.4.29}{}}
\newlabel{eq:Laplace_Transform@cref}{{[equation][29][7]7.29}{[1][84][]84}}
\newlabel{eq:SE}{{7.30}{84}{Derivation of the Ringdown Waveform of Quantum Black Holes}{equation.7.4.30}{}}
\newlabel{eq:SE@cref}{{[equation][30][7]7.30}{[1][84][]84}}
\newlabel{eq:down_mode}{{7.31}{84}{Derivation of the Ringdown Waveform of Quantum Black Holes}{equation.7.4.31}{}}
\newlabel{eq:down_mode@cref}{{[equation][31][7]7.31}{[1][84][]84}}
\newlabel{eq:up_mode}{{7.32}{84}{Derivation of the Ringdown Waveform of Quantum Black Holes}{equation.7.4.32}{}}
\newlabel{eq:up_mode@cref}{{[equation][32][7]7.32}{[1][84][]84}}
\citation{Nikhef_01,Nikhef_02}
\citation{Berti_02,Andersson_01}
\newlabel{eq:Wronskian}{{7.33}{85}{Derivation of the Ringdown Waveform of Quantum Black Holes}{equation.7.4.33}{}}
\newlabel{eq:Wronskian@cref}{{[equation][33][7]7.33}{[1][85][]85}}
\newlabel{eq:NR_result}{{7.34}{85}{Derivation of the Ringdown Waveform of Quantum Black Holes}{equation.7.4.34}{}}
\newlabel{eq:NR_result@cref}{{[equation][34][7]7.34}{[1][85][]85}}
\newlabel{eq:Green_fn_technique}{{7.37}{85}{Derivation of the Ringdown Waveform of Quantum Black Holes}{equation.7.4.37}{}}
\newlabel{eq:Green_fn_technique@cref}{{[equation][37][7]7.37}{[1][85][]85}}
\newlabel{eq:IHSE}{{7.38}{85}{Derivation of the Ringdown Waveform of Quantum Black Holes}{equation.7.4.38}{}}
\newlabel{eq:IHSE@cref}{{[equation][38][7]7.38}{[1][85][]85}}
\citation{Green_Function_Technique_01,Green_Function_Technique_02}
\newlabel{eq:z_w}{{7.40}{86}{Derivation of the Ringdown Waveform of Quantum Black Holes}{equation.7.4.40}{}}
\newlabel{eq:z_w@cref}{{[equation][40][7]7.40}{[1][86][]86}}
\newlabel{eq:excitation factor}{{7.41}{86}{Derivation of the Ringdown Waveform of Quantum Black Holes}{equation.7.4.41}{}}
\newlabel{eq:excitation factor@cref}{{[equation][41][7]7.41}{[1][86][]86}}
\newlabel{eq:inverse_laplace_transform}{{7.42}{86}{Derivation of the Ringdown Waveform of Quantum Black Holes}{equation.7.4.42}{}}
\newlabel{eq:inverse_laplace_transform@cref}{{[equation][42][7]7.42}{[1][86][]86}}
\newlabel{eq:z_t}{{7.43}{86}{Derivation of the Ringdown Waveform of Quantum Black Holes}{equation.7.4.43}{}}
\newlabel{eq:z_t@cref}{{[equation][43][7]7.43}{[1][86][]86}}
\@setckpt{chapter_BH_Temp}{
\setcounter{page}{88}
\setcounter{equation}{44}
\setcounter{enumi}{0}
\setcounter{enumii}{0}
\setcounter{enumiii}{0}
\setcounter{enumiv}{0}
\setcounter{footnote}{1}
\setcounter{mpfootnote}{0}
\setcounter{part}{0}
\setcounter{chapter}{7}
\setcounter{section}{4}
\setcounter{subsection}{0}
\setcounter{subsubsection}{0}
\setcounter{paragraph}{0}
\setcounter{subparagraph}{0}
\setcounter{figure}{2}
\setcounter{table}{0}
\setcounter{parentequation}{0}
\setcounter{lips@count}{0}
\setcounter{Item}{0}
\setcounter{Hfootnote}{5}
\setcounter{bookmark@seq@number}{75}
\setcounter{@pps}{0}
\setcounter{@ppsavesec}{0}
\setcounter{@ppsaveapp}{0}
\setcounter{NAT@ctr}{0}
\setcounter{subfigure}{0}
\setcounter{lofdepth}{1}
\setcounter{subtable}{0}
\setcounter{lotdepth}{1}
\setcounter{section@level}{1}
}
