\relax 
\providecommand\hyper@newdestlabel[2]{}
\providecommand\zref@newlabel[2]{}
\citation{LIGO_01}
\citation{Gregorio_2018,Brito_Buonanno_Raymond_01}
\citation{LIGO_07}
\citation{NHT_TIGER_01,NHT_TIGER_02,NHT_TIGER_03,NHT_TIGER_04}
\citation{LIGO_07}
\citation{Echoes_01,Echoes_02,Echoes_03,Echoes_04,Echoes_05}
\citation{Echoes_Search_01,Echoes_Search_02,Echoes_Search_03,Echoes_Search_04,Echoes_Search_05,Echoes_Search_07}
\@writefile{toc}{\contentsline {chapter}{\numberline {8}Concluding Remarks}{88}{chapter.8}}
\@writefile{lof}{\addvspace {10\p@ }}
\@writefile{lot}{\addvspace {10\p@ }}
\@writefile{toc}{\contentsline {section}{\numberline {8.1}Importance of Black-hole Ringdown Detection}{88}{section.8.1}}
\citation{Chung_03}
\@writefile{toc}{\contentsline {section}{\numberline {8.2}The Work in the Thesis}{89}{section.8.2}}
\@writefile{toc}{\contentsline {section}{\numberline {8.3}Future Work}{89}{section.8.3}}
\@writefile{toc}{\contentsline {subsection}{\numberline {8.3.1}Ringdown of Black Holes with Topological Defects}{89}{subsection.8.3.1}}
\citation{Supperadiance,ULTB_GW_01,ULTB_GW_02,ULTB_GW_03,ULTB_GW_04,ULTB_BH_Perturbation_01,ULTB_BH_Perturbation_02}
\citation{Echoes_01,Echoes_02,Echoes_03,Echoes_04,Echoes_05}
\citation{T_decomposition}
\@writefile{toc}{\contentsline {subsection}{\numberline {8.3.2}Probing Gravitational-atomic Nature of the Final Black Hole of Gravitational-wave Events}{90}{subsection.8.3.2}}
\@setckpt{conclusions}{
\setcounter{page}{91}
\setcounter{equation}{0}
\setcounter{enumi}{0}
\setcounter{enumii}{0}
\setcounter{enumiii}{0}
\setcounter{enumiv}{0}
\setcounter{footnote}{1}
\setcounter{mpfootnote}{0}
\setcounter{part}{0}
\setcounter{chapter}{8}
\setcounter{section}{3}
\setcounter{subsection}{2}
\setcounter{subsubsection}{0}
\setcounter{paragraph}{0}
\setcounter{subparagraph}{0}
\setcounter{figure}{0}
\setcounter{table}{0}
\setcounter{parentequation}{0}
\setcounter{lips@count}{0}
\setcounter{Item}{0}
\setcounter{Hfootnote}{6}
\setcounter{bookmark@seq@number}{81}
\setcounter{@pps}{0}
\setcounter{@ppsavesec}{0}
\setcounter{@ppsaveapp}{0}
\setcounter{NAT@ctr}{0}
\setcounter{subfigure}{0}
\setcounter{lofdepth}{1}
\setcounter{subtable}{0}
\setcounter{lotdepth}{1}
\setcounter{section@level}{2}
}
