\relax 
\providecommand\hyper@newdestlabel[2]{}
\providecommand\zref@newlabel[2]{}
\providecommand\HyperFirstAtBeginDocument{\AtBeginDocument}
\HyperFirstAtBeginDocument{\ifx\hyper@anchor\@undefined
\global\let\oldcontentsline\contentsline
\gdef\contentsline#1#2#3#4{\oldcontentsline{#1}{#2}{#3}}
\global\let\oldnewlabel\newlabel
\gdef\newlabel#1#2{\newlabelxx{#1}#2}
\gdef\newlabelxx#1#2#3#4#5#6{\oldnewlabel{#1}{{#2}{#3}}}
\AtEndDocument{\ifx\hyper@anchor\@undefined
\let\contentsline\oldcontentsline
\let\newlabel\oldnewlabel
\fi}
\fi}
\global\let\hyper@last\relax 
\gdef\HyperFirstAtBeginDocument#1{#1}
\providecommand\HyField@AuxAddToFields[1]{}
\providecommand\HyField@AuxAddToCoFields[2]{}
\@input{dedication.aux}
\@input{abstract.aux}
\@input{acknowlegements.aux}
\citation{Pretorius_2005_02}
\citation{Pretorius_2005}
\citation{Maggiore_vol_2}
\citation{Maggiore_vol_2}
\@input{chapter1.aux}
\@input{chapter2.aux}
\@input{chapter3.aux}
\@input{chapter_QNM_mg.aux}
\@input{chapter_BH_Temp.aux}
\@input{conclusions.aux}
\bibdata{refs}
\bibcite{Samajdar_01}{{1}{}{{}}{{}}}
\bibcite{Echoes_Search_03}{{2}{}{{}}{{}}}
\bibcite{LVTheory_01}{{3}{}{{}}{{}}}
\bibcite{ADM_Decomposition}{{4}{}{{}}{{}}}
\bibcite{Echoes_Search_07}{{5}{}{{}}{{}}}
\bibcite{LPT_03}{{6}{}{{}}{{}}}
\bibcite{LIGO_08}{{7}{}{{}}{{}}}
\bibcite{LIGO_02}{{8}{}{{}}{{}}}
\bibcite{LIGO_01}{{9}{}{{}}{{}}}
\@writefile{toc}{\contentsline {chapter}{Bibliography}{68}{section.6.3}}
\bibcite{LIGO_07}{{10}{}{{}}{{}}}
\bibcite{LIGO_03}{{11}{}{{}}{{}}}
\bibcite{LIGO_04}{{12}{}{{}}{{}}}
\bibcite{LIGO_05}{{13}{}{{}}{{}}}
\bibcite{LIGO_06}{{14}{}{{}}{{}}}
\bibcite{LIGO_09}{{15}{}{{}}{{}}}
\bibcite{BSSN_01}{{16}{}{{}}{{}}}
\bibcite{MG_05}{{17}{}{{}}{{}}}
\bibcite{MG_06}{{18}{}{{}}{{}}}
\bibcite{Green_Function_Technique_01}{{19}{}{{}}{{}}}
\bibcite{QNM_01}{{20}{}{{}}{{}}}
\bibcite{Green_Function_Technique_02}{{21}{}{{}}{{}}}
\bibcite{QNM_Kerr_01}{{22}{}{{}}{{}}}
\bibcite{Berti_01}{{23}{}{{}}{{}}}
\bibcite{Klein_Gordon_equation_01}{{24}{}{{}}{{}}}
\bibcite{LVTheory_05}{{25}{}{{}}{{}}}
\bibcite{RD_Gauss_Bonnet}{{26}{}{{}}{{}}}
\bibcite{RD_Einstein-dilaton-Gauss-Bonnet}{{27}{}{{}}{{}}}
\bibcite{Brito_Buonanno_Raymond_01}{{28}{}{{}}{{}}}
\bibcite{Massive_Gravity_01}{{29}{}{{}}{{}}}
\bibcite{Echoes_02}{{30}{}{{}}{{}}}
\bibcite{QNM_02}{{31}{}{{}}{{}}}
\bibcite{RD_f_R}{{32}{}{{}}{{}}}
\bibcite{Echoes_03}{{33}{}{{}}{{}}}
\bibcite{NHT_03}{{34}{}{{}}{{}}}
\bibcite{Carullo_01}{{35}{}{{}}{{}}}
\bibcite{Gregorio_2018}{{36}{}{{}}{{}}}
\bibcite{QNM_Rev_01}{{37}{}{{}}{{}}}
\bibcite{Chung_01}{{38}{}{{}}{{}}}
\bibcite{Echoes_Search_05}{{39}{}{{}}{{}}}
\bibcite{NHT_TIGER_03}{{40}{}{{}}{{}}}
\bibcite{Massive_BH_Perturbation_01}{{41}{}{{}}{{}}}
\bibcite{Einstein_01}{{42}{}{{}}{{}}}
\bibcite{Einstein_02}{{43}{}{{}}{{}}}
\bibcite{pN_03}{{44}{}{{}}{{}}}
\bibcite{NHT_TIGER_04}{{45}{}{{}}{{}}}
\bibcite{Goldberg_Sach_01}{{46}{}{{}}{{}}}
\bibcite{NHT_TIGER_02}{{47}{}{{}}{{}}}
\bibcite{Yunes_01}{{48}{}{{}}{{}}}
\bibcite{Hartle_01}{{49}{}{{}}{{}}}
\bibcite{MG_03}{{50}{}{{}}{{}}}
\bibcite{MG_04}{{51}{}{{}}{{}}}
\bibcite{NHT_04}{{52}{}{{}}{{}}}
\bibcite{Massive_BH_Perturbation_02}{{53}{}{{}}{{}}}
\bibcite{Massive_BH_Perturbation_03}{{54}{}{{}}{{}}}
\bibcite{RD_Einstein_Maxwell_Dilaton}{{55}{}{{}}{{}}}
\bibcite{LVTheory_04}{{56}{}{{}}{{}}}
\bibcite{NHT_02}{{57}{}{{}}{{}}}
\bibcite{NHT_01}{{58}{}{{}}{{}}}
\bibcite{Ajith_01}{{59}{}{{}}{{}}}
\bibcite{Massive_Vector_Perturbation_01}{{60}{}{{}}{{}}}
\bibcite{Massive_Scalar_Perturbation_02}{{61}{}{{}}{{}}}
\bibcite{Leaver_01}{{62}{}{{}}{{}}}
\bibcite{Leaver_02}{{63}{}{{}}{{}}}
\bibcite{LPT_01}{{64}{}{{}}{{}}}
\bibcite{LPT_04}{{65}{}{{}}{{}}}
\bibcite{LPT_02}{{66}{}{{}}{{}}}
\bibcite{SUSY_02}{{67}{}{{}}{{}}}
\bibcite{SUSY_01}{{68}{}{{}}{{}}}
\bibcite{Echoes_Search_02}{{69}{}{{}}{{}}}
\bibcite{Nikhef_01}{{70}{}{{}}{{}}}
\bibcite{MG_Pauli}{{71}{}{{}}{{}}}
\bibcite{Maggiore_vol_2}{{72}{}{{}}{{}}}
\bibcite{LVTheory_02}{{73}{}{{}}{{}}}
\bibcite{exact_sol_TE}{{74}{}{{}}{{}}}
\bibcite{Echoes_05}{{75}{}{{}}{{}}}
\bibcite{Echoes_Search_04}{{76}{}{{}}{{}}}
\bibcite{NHT_TIGER_01}{{77}{}{{}}{{}}}
\bibcite{Wills_01}{{78}{}{{}}{{}}}
\bibcite{Echoes_01}{{79}{}{{}}{{}}}
\bibcite{Penrose_Newman_01}{{80}{}{{}}{{}}}
\bibcite{MG_02}{{81}{}{{}}{{}}}
\bibcite{Massive_Scalar_Perturbation_01}{{82}{}{{}}{{}}}
\bibcite{Chern_Simons_01}{{83}{}{{}}{{}}}
\bibcite{RD_Chern-Simons}{{84}{}{{}}{{}}}
\bibcite{Berti_04}{{85}{}{{}}{{}}}
\bibcite{Berti_05}{{86}{}{{}}{{}}}
\bibcite{Teukolsky_03_ApJ}{{87}{}{{}}{{}}}
\bibcite{Pretorius_2005}{{88}{}{{}}{{}}}
\bibcite{Pretorius_2005_02}{{89}{}{{}}{{}}}
\bibcite{Regge_Wheeler}{{90}{}{{}}{{}}}
\bibcite{Nakamura_01}{{91}{}{{}}{{}}}
\bibcite{LVTheory_03}{{92}{}{{}}{{}}}
\bibcite{BSSN_02}{{93}{}{{}}{{}}}
\bibcite{Echoes_04}{{94}{}{{}}{{}}}
\bibcite{Teukolsky_02_ApJ}{{95}{}{{}}{{}}}
\bibcite{Teukolsky_04_ApJ}{{96}{}{{}}{{}}}
\bibcite{Teukolsky_01_PRL}{{97}{}{{}}{{}}}
\bibcite{Echoes_Search_01}{{98}{}{{}}{{}}}
\bibcite{LALInference}{{99}{}{{}}{{}}}
\bibcite{Wills_02}{{100}{}{{}}{{}}}
\bibcite{Helvi_03}{{101}{}{{}}{{}}}
\bibcite{Helvi_01}{{102}{}{{}}{{}}}
\bibcite{Zerilli_01}{{103}{}{{}}{{}}}
\bibcite{Perimeter_01}{{104}{}{{}}{{}}}
\bibcite{Green_Function_Technique_03}{{105}{}{{}}{{}}}
\bibcite{Helvi_02}{{106}{}{{}}{{}}}
\bibcite{Green_Function_Technique_04}{{107}{}{{}}{{}}}
\bibstyle{plain}
\providecommand\NAT@force@numbers{}\NAT@force@numbers
