\relax 
\providecommand\hyper@newdestlabel[2]{}
\providecommand\zref@newlabel[2]{}
\citation{Kerr_01}
\citation{Penrose_Newman_01}
\@writefile{toc}{\contentsline {chapter}{\numberline {3}Gravitational Perturbations of Rotating Black Holes}{29}{chapter.3}}
\@writefile{lof}{\addvspace {10\p@ }}
\@writefile{lot}{\addvspace {10\p@ }}
\@writefile{toc}{\contentsline {section}{\numberline {3.1}Introduction}{29}{section.3.1}}
\newlabel{eq:Kerr_metric}{{3.1}{29}{Introduction}{equation.3.1.1}{}}
\newlabel{eq:Kerr_metric@cref}{{[equation][1][3]3.1}{[1][29][]29}}
\citation{Teukolsky_01_PRL,Teukolsky_02_ApJ}
\citation{Goldberg_Sach_01}
\@writefile{toc}{\contentsline {section}{\numberline {3.2}Spinor Coefficients}{30}{section.3.2}}
\@writefile{toc}{\contentsline {section}{\numberline {3.3}Derivation of the Teukolsky Equation}{32}{section.3.3}}
\newlabel{eq:perturbed_NP_equations}{{3.16}{32}{Derivation of the Teukolsky Equation}{equation.3.3.16}{}}
\newlabel{eq:perturbed_NP_equations@cref}{{[equation][16][3]3.16}{[1][32][]32}}
\citation{Teukolsky_02_ApJ}
\citation{Teukolsky_02_ApJ}
\newlabel{eq:TE}{{3.22}{33}{Derivation of the Teukolsky Equation}{equation.3.3.22}{}}
\newlabel{eq:TE@cref}{{[equation][22][3]3.22}{[1][33][]33}}
\citation{exact_sol_TE}
\@writefile{toc}{\contentsline {section}{\numberline {3.4}Energy Carried by the Ringdown Waveform}{34}{section.3.4}}
\@writefile{toc}{\contentsline {section}{\numberline {3.5}Properties of the Teukolsky Equation}{34}{section.3.5}}
\@writefile{toc}{\contentsline {subsection}{\numberline {3.5.1}Separation of Variables}{34}{subsection.3.5.1}}
\newlabel{eq:TE_Radial}{{3.25}{34}{Separation of Variables}{equation.3.5.25}{}}
\newlabel{eq:TE_Radial@cref}{{[equation][25][3]3.25}{[1][34][]34}}
\@writefile{toc}{\contentsline {subsubsection}{\numberline {3.5.1.1}The Radial Equation}{34}{subsubsection.3.5.1.1}}
\citation{exact_sol_TE}
\newlabel{eq:hypergeometric_equation}{{3.28}{35}{The Radial Equation}{equation.3.5.28}{}}
\newlabel{eq:hypergeometric_equation@cref}{{[equation][28][3]3.28}{[1][34][]35}}
\newlabel{eq:hypergeometric_series}{{3.32}{35}{The Radial Equation}{equation.3.5.32}{}}
\newlabel{eq:hypergeometric_series@cref}{{[equation][32][3]3.32}{[1][35][]35}}
\newlabel{eq:recurrence}{{3.33}{35}{The Radial Equation}{equation.3.5.33}{}}
\newlabel{eq:recurrence@cref}{{[equation][33][3]3.33}{[1][35][]35}}
\citation{Nakamura_01}
\newlabel{eq:KG_TE}{{3.40}{36}{The Radial Equation}{equation.3.5.40}{}}
\newlabel{eq:KG_TE@cref}{{[equation][40][3]3.40}{[1][36][]36}}
\citation{Leaver_02}
\citation{Leaver_02}
\citation{Berti_01}
\newlabel{eq:down_mode}{{3.43}{37}{The Radial Equation}{equation.3.5.43}{}}
\newlabel{eq:down_mode@cref}{{[equation][43][3]3.43}{[1][37][]37}}
\newlabel{eq:up_mode}{{3.44}{37}{The Radial Equation}{equation.3.5.44}{}}
\newlabel{eq:up_mode@cref}{{[equation][44][3]3.44}{[1][37][]37}}
\@writefile{toc}{\contentsline {subsubsection}{\numberline {3.5.1.2}The Angular Equation}{37}{subsubsection.3.5.1.2}}
\newlabel{eq:angular_equation}{{3.45}{37}{The Angular Equation}{equation.3.5.45}{}}
\newlabel{eq:angular_equation@cref}{{[equation][45][3]3.45}{[1][37][]37}}
\newlabel{eq:inner_product_S}{{3.49}{37}{The Angular Equation}{equation.3.5.49}{}}
\newlabel{eq:inner_product_S@cref}{{[equation][49][3]3.49}{[1][37][]37}}
\citation{Teukolsky_03_ApJ}
\citation{Nikhef_01}
\@writefile{toc}{\contentsline {subsection}{\numberline {3.5.2}In Connection with Numerical-relativity Simulations}{38}{subsection.3.5.2}}
\newlabel{eq:RD_WF}{{3.50}{38}{In Connection with Numerical-relativity Simulations}{equation.3.5.50}{}}
\newlabel{eq:RD_WF@cref}{{[equation][50][3]3.50}{[1][38][]38}}
\@writefile{toc}{\contentsline {subsection}{\numberline {3.5.3}Other Useful Properties}{38}{subsection.3.5.3}}
\@writefile{toc}{\contentsline {section}{\numberline {3.6}Conclusions}{39}{section.3.6}}
\@setckpt{chapter3}{
\setcounter{page}{41}
\setcounter{equation}{52}
\setcounter{enumi}{0}
\setcounter{enumii}{0}
\setcounter{enumiii}{0}
\setcounter{enumiv}{0}
\setcounter{footnote}{0}
\setcounter{mpfootnote}{0}
\setcounter{part}{0}
\setcounter{chapter}{3}
\setcounter{section}{6}
\setcounter{subsection}{0}
\setcounter{subsubsection}{0}
\setcounter{paragraph}{0}
\setcounter{subparagraph}{0}
\setcounter{figure}{0}
\setcounter{table}{0}
\setcounter{parentequation}{0}
\setcounter{lips@count}{0}
\setcounter{Item}{0}
\setcounter{Hfootnote}{0}
\setcounter{bookmark@seq@number}{35}
\setcounter{@pps}{0}
\setcounter{@ppsavesec}{0}
\setcounter{@ppsaveapp}{0}
\setcounter{NAT@ctr}{0}
\setcounter{subfigure}{0}
\setcounter{lofdepth}{1}
\setcounter{subtable}{0}
\setcounter{lotdepth}{1}
\setcounter{section@level}{1}
}
