\relax 
\providecommand\hyper@newdestlabel[2]{}
\providecommand\zref@newlabel[2]{}
\citation{LIGO_01,LIGO_02,LIGO_03,LIGO_04,LIGO_05,LIGO_06}
\citation{LIGO_07,LIGO_08}
\citation{LIGO_07,LIGO_08}
\@writefile{toc}{\contentsline {chapter}{\numberline {4}A Phenomenological Inclusion of Alternative Dispersion Relations to the Teukolsky Equation and its Application to Bounding the Graviton Mass with Gravitational-wave Measurements}{22}{chapter.4}}
\@writefile{lof}{\addvspace {10\p@ }}
\@writefile{lot}{\addvspace {10\p@ }}
\citation{Wills_01,Wills_02,Ajith_01,Samajdar_01}
\citation{LVTheory_01,LVTheory_02,LVTheory_03,LVTheory_04,LVTheory_05}
\citation{Yunes_01}
\citation{Chern_Simons_01,Helvi_01,Helvi_02,Helvi_03,RD_Chern-Simons,RD_f_R,RD_Gauss_Bonnet,RD_Einstein_Maxwell_Dilaton,RD_Einstein-dilaton-Gauss-Bonnet}
\citation{Massive_BH_Perturbation_01,Massive_BH_Perturbation_02,Massive_BH_Perturbation_03,Massive_Gravity_01,Massive_Scalar_Perturbation_01,Massive_Scalar_Perturbation_02,Massive_Vector_Perturbation_01,Perimeter_01,Berti_04,Berti_05}
\@writefile{toc}{\contentsline {section}{\numberline {4.1}Introduction}{23}{section.4.1}}
\citation{Teukolsky_01_PRL,Teukolsky_02_ApJ,Teukolsky_03_ApJ,Teukolsky_04_ApJ}
\citation{MG_Pauli,MG_02,MG_03,MG_04,MG_05,MG_06}
\@writefile{toc}{\contentsline {section}{\numberline {4.2}Method}{24}{section.4.2}}
\newlabel{eq:TE}{{4.1}{24}{Method}{equation.4.2.1}{}}
\newlabel{eq:TE@cref}{{[equation][1][4]4.1}{[1][24][]24}}
\newlabel{eq:MTE}{{4.2}{24}{Method}{equation.4.2.2}{}}
\newlabel{eq:MTE@cref}{{[equation][2][4]4.2}{[1][24][]24}}
\citation{Klein_Gordon_equation_01}
\citation{Nakamura_01}
\citation{LIGO_07,LIGO_08}
\citation{LPT_01,LPT_02,LPT_03}
\newlabel{eq:MTE_massive_gravity}{{4.3}{25}{Method}{equation.4.2.3}{}}
\newlabel{eq:MTE_massive_gravity@cref}{{[equation][3][4]4.3}{[1][25][]25}}
\newlabel{eq:SE}{{4.4}{25}{Method}{equation.4.2.4}{}}
\newlabel{eq:SE@cref}{{[equation][4][4]4.4}{[1][25][]25}}
\citation{Massive_Gravity_01}
\citation{Massive_Vector_Perturbation_01}
\citation{Massive_Scalar_Perturbation_01,Massive_Scalar_Perturbation_02}
\citation{Wills_01}
\citation{QNM_Rev_01}
\citation{Nikhef_01}
\citation{Nikhef_01}
\newlabel{eq:freq_shift}{{4.5}{26}{Method}{equation.4.2.5}{}}
\newlabel{eq:freq_shift@cref}{{[equation][5][4]4.5}{[1][25][]26}}
\newlabel{eq:RDTDWF}{{4.6}{26}{Method}{equation.4.2.6}{}}
\newlabel{eq:RDTDWF@cref}{{[equation][6][4]4.6}{[1][26][]26}}
\@writefile{lof}{\contentsline {figure}{\numberline {4.1}{\ignorespaces Quasinormal mode frequencies of 022 (top panel) and 033 (bottom panel) overtone of a spinless black hole of mass $ 100 M_{\odot }$ with $ m_g = 0, 2, 4, ...., 20 \tmspace  +\thinmuskip {.1667em}\textrm  {s}^{-1}$. The point of the smallest $ \omega ^{\rm  Re}_{nlm} $ and the largest $ \omega ^{\rm  Im}_{nlm} $ corresponds to $ m_g = 0 $. Both frequencies and lifetimes are enhanced by mass of gravitational field.}}{27}{figure.4.1}}
\newlabel{fig:complex_plane}{{4.1}{27}{Quasinormal mode frequencies of 022 (top panel) and 033 (bottom panel) overtone of a spinless black hole of mass $ 100 M_{\odot }$ with $ m_g = 0, 2, 4, ...., 20 \,\textrm {s}^{-1}$. The point of the smallest $ \omega ^{\rm Re}_{nlm} $ and the largest $ \omega ^{\rm Im}_{nlm} $ corresponds to $ m_g = 0 $. Both frequencies and lifetimes are enhanced by mass of gravitational field}{figure.4.1}{}}
\newlabel{fig:complex_plane@cref}{{[figure][1][4]4.1}{[1][26][]27}}
\citation{QNM_01,QNM_02}
\citation{LALInference}
\citation{LIGO_01,LIGO_02}
\@writefile{lof}{\contentsline {figure}{\numberline {4.2}{\ignorespaces (color online). The plus mode time domain ringdown waveforms emitted by a black hole of 100 $ M_{\odot } $ at 400\tmspace  +\thinmuskip {.1667em}Mpc for $ \qopname  \relax o{log}\lambda _g = $ 6.0 (blue), 6.5 (green), and $ \qopname  \relax o{log}\lambda _g = \infty $ ($ m_g = 0 $) (red). As $ \qopname  \relax o{log}\lambda $ approaches 7, waveforms of $ m_g > 0 $ and $ m_g = 0 $ overlap almost completely. Major overtones of $ nl|m| = $ 022, 122, 033, 133, 044, 055, 021, 032 and 034 are included in the plots.}}{28}{figure.4.2}}
\newlabel{fig:RDTDWF}{{4.2}{28}{(color online). The plus mode time domain ringdown waveforms emitted by a black hole of 100 $ M_{\odot } $ at 400\,Mpc for $ \log \lambda _g = $ 6.0 (blue), 6.5 (green), and $ \log \lambda _g = \infty $ ($ m_g = 0 $) (red). As $ \log \lambda $ approaches 7, waveforms of $ m_g > 0 $ and $ m_g = 0 $ overlap almost completely. Major overtones of $ nl|m| = $ 022, 122, 033, 133, 044, 055, 021, 032 and 034 are included in the plots}{figure.4.2}{}}
\newlabel{fig:RDTDWF@cref}{{[figure][2][4]4.2}{[1][28][]28}}
\citation{Wills_01}
\citation{Massive_Gravity_01,Massive_Vector_Perturbation_01,Massive_Scalar_Perturbation_01,Massive_Scalar_Perturbation_02}
\@writefile{lof}{\contentsline {figure}{\numberline {4.3}{\ignorespaces (Top panel) The posterior of $ \qopname  \relax o{log}\lambda _g $ obtained from the ringdown signal by a black hole of $ 50 M_{\odot }$ (blue), $ 100 M_{\odot }$ (red), $ 200 M_{\odot }$ (green) and $ 290 M_{\odot }$ (black) at 400\tmspace  +\thinmuskip {.1667em}Mpc. The posterior of different black hole masses are in step-function shape. Beyond $ \qopname  \relax o{log}\lambda _g \sim 6 - 8 $, the ringdown waveforms of $m_g > 0 $ are almost indistinguishable from $ m_g = 0 $ to the sampler. (Bottom panel) The 90\% confidence interval of $ m_g $ as a function of the final black hole mass $ M_f $. The credible interval increases with the final mass of black holes, despite some fluctuation due to noise. Increase of signal-to-noise ratio with mass leads to a better constraint by a black hole of higher mass.}}{30}{figure.4.3}}
\newlabel{fig:pdf}{{4.3}{30}{(Top panel) The posterior of $ \log \lambda _g $ obtained from the ringdown signal by a black hole of $ 50 M_{\odot }$ (blue), $ 100 M_{\odot }$ (red), $ 200 M_{\odot }$ (green) and $ 290 M_{\odot }$ (black) at 400\,Mpc. The posterior of different black hole masses are in step-function shape. Beyond $ \log \lambda _g \sim 6 - 8 $, the ringdown waveforms of $m_g > 0 $ are almost indistinguishable from $ m_g = 0 $ to the sampler. (Bottom panel) The 90\% confidence interval of $ m_g $ as a function of the final black hole mass $ M_f $. The credible interval increases with the final mass of black holes, despite some fluctuation due to noise. Increase of signal-to-noise ratio with mass leads to a better constraint by a black hole of higher mass}{figure.4.3}{}}
\newlabel{fig:pdf@cref}{{[figure][3][4]4.3}{[1][29][]30}}
\citation{Carullo_01,Brito_Buonanno_Raymond_01}
\citation{LIGO_09}
\citation{NHT_01,NHT_02,NHT_03,NHT_04}
\citation{NHT_TIGER_01,NHT_TIGER_02,NHT_TIGER_04,NHT_TIGER_03}
\@writefile{toc}{\contentsline {section}{\numberline {4.3}Concluding Remarks}{31}{section.4.3}}
\citation{Nikhef_01}
\citation{LPT_01,LPT_02,LPT_03,LPT_04}
\citation{LPT_02,LPT_04}
\@writefile{toc}{\contentsline {section}{\numberline {4.4}Acknowledgement}{32}{section.4.4}}
\@writefile{toc}{\contentsline {section}{\numberline {4.5}Appendix: Calculation in LPT}{32}{section.4.5}}
\newlabel{eq:LPT_01}{{4.7}{32}{Appendix: Calculation in LPT}{equation.4.5.7}{}}
\newlabel{eq:LPT_01@cref}{{[equation][7][4]4.7}{[1][32][]32}}
\newlabel{eq:inner_product_01}{{4.8}{32}{Appendix: Calculation in LPT}{equation.4.5.8}{}}
\newlabel{eq:inner_product_01@cref}{{[equation][8][4]4.8}{[1][32][]32}}
\citation{exact_sol_TE}
\citation{QNM_Kerr_01}
\newlabel{eq:inner_product_02}{{4.10}{33}{Appendix: Calculation in LPT}{equation.4.5.10}{}}
\newlabel{eq:inner_product_02@cref}{{[equation][10][4]4.10}{[1][33][]33}}
\newlabel{eq:exact_sol}{{4.11}{33}{Appendix: Calculation in LPT}{equation.4.5.11}{}}
\newlabel{eq:exact_sol@cref}{{[equation][11][4]4.11}{[1][33][]33}}
\@writefile{lof}{\contentsline {figure}{\numberline {4.4}{\ignorespaces (color lines) The real (top panel) and imaginary part (bottom panel) of $ \Braket  {u|V^{(1)}|u} / \Braket  {u|u} $ as functions of the upper limit ($R_+$) of the inner products for $ m_g = 1 $ and $ a = 0.7 $. $ u $ is the analytic solution for the 022-quasinormal mode for Kerr black holes. $ u $ involves summation of hypergeometric function from $ n = - N $ to $ n = + N $. For $ N = 20, 30 $ and 40, the real part of $ \Braket  {u|V^{(1)}|u} / \Braket  {u|u} $ trends to 1 as $ R_+$ is extended to $ R_+ \sim r_+ + 50 \frac  {\epsilon \kappa }{\omega } $. This serves a numerical proof of \cref  {eq:freq_shift}}}{35}{figure.4.4}}
\newlabel{fig:LPT}{{4.4}{35}{(color lines) The real (top panel) and imaginary part (bottom panel) of $ \Braket {u|V^{(1)}|u} / \Braket {u|u} $ as functions of the upper limit ($R_+$) of the inner products for $ m_g = 1 $ and $ a = 0.7 $. $ u $ is the analytic solution for the 022-quasinormal mode for Kerr black holes. $ u $ involves summation of hypergeometric function from $ n = - N $ to $ n = + N $. For $ N = 20, 30 $ and 40, the real part of $ \Braket {u|V^{(1)}|u} / \Braket {u|u} $ trends to 1 as $ R_+$ is extended to $ R_+ \sim r_+ + 50 \frac {\epsilon \kappa }{\omega } $. This serves a numerical proof of \cref {eq:freq_shift}}{figure.4.4}{}}
\newlabel{fig:LPT@cref}{{[figure][4][4]4.4}{[1][34][]35}}
\@setckpt{chapter4}{
\setcounter{page}{36}
\setcounter{equation}{12}
\setcounter{enumi}{0}
\setcounter{enumii}{0}
\setcounter{enumiii}{0}
\setcounter{enumiv}{0}
\setcounter{footnote}{0}
\setcounter{mpfootnote}{0}
\setcounter{part}{0}
\setcounter{chapter}{4}
\setcounter{section}{5}
\setcounter{subsection}{0}
\setcounter{subsubsection}{0}
\setcounter{paragraph}{0}
\setcounter{subparagraph}{0}
\setcounter{figure}{4}
\setcounter{table}{0}
\setcounter{parentequation}{0}
\setcounter{lips@count}{0}
\setcounter{Item}{0}
\setcounter{Hfootnote}{0}
\setcounter{bookmark@seq@number}{28}
\setcounter{@pps}{0}
\setcounter{@ppsavesec}{0}
\setcounter{@ppsaveapp}{0}
\setcounter{NAT@ctr}{0}
\setcounter{subfigure}{0}
\setcounter{lofdepth}{1}
\setcounter{subtable}{0}
\setcounter{lotdepth}{1}
\setcounter{section@level}{1}
}
