\relax 
\providecommand\hyper@newdestlabel[2]{}
\providecommand\zref@newlabel[2]{}
\@writefile{toc}{\contentsline {chapter}{\numberline {1}Introduction}{1}{chapter.1}}
\@writefile{lof}{\addvspace {10\p@ }}
\@writefile{lot}{\addvspace {10\p@ }}
\@writefile{toc}{\contentsline {section}{\numberline {1.1}General Relativity as a Theory of Gravity}{1}{section.1.1}}
\citation{Einstein_01,Einstein_02}
\newlabel{eq:EFE}{{1.4}{2}{General Relativity as a Theory of Gravity}{equation.1.1.4}{}}
\newlabel{eq:EFE@cref}{{[equation][4][1]1.4}{[1][2][]2}}
\@writefile{toc}{\contentsline {section}{\numberline {1.2}Linear Expansion of the Einstein Field Equation}{2}{section.1.2}}
\newlabel{eq:metric_expansion}{{1.5}{2}{Linear Expansion of the Einstein Field Equation}{equation.1.2.5}{}}
\newlabel{eq:metric_expansion@cref}{{[equation][5][1]1.5}{[1][2][]2}}
\newlabel{eq:Perturbed_EFE}{{1.7}{3}{Linear Expansion of the Einstein Field Equation}{equation.1.2.7}{}}
\newlabel{eq:Perturbed_EFE@cref}{{[equation][7][1]1.7}{[1][3][]3}}
\@writefile{toc}{\contentsline {subsection}{\numberline {1.2.1}The Harmonic Gauge}{3}{subsection.1.2.1}}
\newlabel{eq:guage_transformation}{{1.8}{3}{The Harmonic Gauge}{equation.1.2.8}{}}
\newlabel{eq:guage_transformation@cref}{{[equation][8][1]1.8}{[1][3][]3}}
\newlabel{eq:Harmonic_guage}{{1.9}{3}{The Harmonic Gauge}{equation.1.2.9}{}}
\newlabel{eq:Harmonic_guage@cref}{{[equation][9][1]1.9}{[1][3][]3}}
\newlabel{eq:wave_equation}{{1.14}{3}{The Harmonic Gauge}{equation.1.2.14}{}}
\newlabel{eq:wave_equation@cref}{{[equation][14][1]1.14}{[1][3][]3}}
\@writefile{toc}{\contentsline {subsection}{\numberline {1.2.2}The Transverse-Traceless Gauge}{4}{subsection.1.2.2}}
\newlabel{eq:WE_TT}{{1.15}{4}{The Transverse-Traceless Gauge}{equation.1.2.15}{}}
\newlabel{eq:WE_TT@cref}{{[equation][15][1]1.15}{[1][3][]4}}
\newlabel{eq:TT_gauge}{{1.16}{4}{The Transverse-Traceless Gauge}{equation.1.2.16}{}}
\newlabel{eq:TT_gauge@cref}{{[equation][16][1]1.16}{[1][4][]4}}
\newlabel{eq:P_operator}{{1.19}{4}{The Transverse-Traceless Gauge}{equation.1.2.19}{}}
\newlabel{eq:P_operator@cref}{{[equation][19][1]1.19}{[1][4][]4}}
\newlabel{eq:Lambda_operator}{{1.20}{4}{The Transverse-Traceless Gauge}{equation.1.2.20}{}}
\newlabel{eq:Lambda_operator@cref}{{[equation][20][1]1.20}{[1][4][]4}}
\newlabel{eq:Lambda_operator_traceless_prop}{{1.21}{5}{The Transverse-Traceless Gauge}{equation.1.2.21}{}}
\newlabel{eq:Lambda_operator_traceless_prop@cref}{{[equation][21][1]1.21}{[1][4][]5}}
\@writefile{toc}{\contentsline {subsection}{\numberline {1.2.3}Generation of Gravitational Waves Due to General Sources}{5}{subsection.1.2.3}}
\newlabel{eq:h_mu_nu_T_mu_nu}{{1.25}{5}{Generation of Gravitational Waves Due to General Sources}{equation.1.2.25}{}}
\newlabel{eq:h_mu_nu_T_mu_nu@cref}{{[equation][25][1]1.25}{[1][5][]5}}
\newlabel{eq:h_ij_T_mu_nu}{{1.26}{5}{Generation of Gravitational Waves Due to General Sources}{equation.1.2.26}{}}
\newlabel{eq:h_ij_T_mu_nu@cref}{{[equation][26][1]1.26}{[1][5][]5}}
\newlabel{eq:T_mu_nu_F_transform}{{1.27}{5}{Generation of Gravitational Waves Due to General Sources}{equation.1.2.27}{}}
\newlabel{eq:T_mu_nu_F_transform@cref}{{[equation][27][1]1.27}{[1][5][]5}}
\newlabel{eq:h_mu_nu_F_transform}{{1.28}{5}{Generation of Gravitational Waves Due to General Sources}{equation.1.2.28}{}}
\newlabel{eq:h_mu_nu_F_transform@cref}{{[equation][28][1]1.28}{[1][5][]5}}
\@writefile{toc}{\contentsline {section}{\numberline {1.3}Energy and Momentum of Gravitational Waves}{7}{section.1.3}}
\@writefile{toc}{\contentsline {subsection}{\numberline {1.3.1}Effective Energy-momentum Tensor of Gravitational Waves}{7}{subsection.1.3.1}}
\newlabel{eq:R_higher_order}{{1.41}{8}{Effective Energy-momentum Tensor of Gravitational Waves}{equation.1.3.41}{}}
\newlabel{eq:R_higher_order@cref}{{[equation][41][1]1.41}{[1][7][]8}}
\newlabel{eq:EFE_expanded}{{1.42}{8}{Effective Energy-momentum Tensor of Gravitational Waves}{equation.1.3.42}{}}
\newlabel{eq:EFE_expanded@cref}{{[equation][42][1]1.42}{[1][8][]8}}
\newlabel{eq:EFE_expanded_02}{{1.44}{8}{Effective Energy-momentum Tensor of Gravitational Waves}{equation.1.3.44}{}}
\newlabel{eq:EFE_expanded_02@cref}{{[equation][44][1]1.44}{[1][8][]8}}
\newlabel{eq:conservation_law}{{1.46}{8}{Effective Energy-momentum Tensor of Gravitational Waves}{equation.1.3.46}{}}
\newlabel{eq:conservation_law@cref}{{[equation][46][1]1.46}{[1][8][]8}}
\newlabel{eq:Power_formula}{{1.50}{9}{Effective Energy-momentum Tensor of Gravitational Waves}{equation.1.3.50}{}}
\newlabel{eq:Power_formula@cref}{{[equation][50][1]1.50}{[1][9][]9}}
\@writefile{toc}{\contentsline {subsection}{\numberline {1.3.2}Generation and Power of Gravitational Waves generated by Compact Binary Coalescence}{9}{subsection.1.3.2}}
\newlabel{eq:displacement}{{1.52}{10}{Generation and Power of Gravitational Waves generated by Compact Binary Coalescence}{equation.1.3.52}{}}
\newlabel{eq:displacement@cref}{{[equation][52][1]1.52}{[1][9][]10}}
\@writefile{toc}{\contentsline {section}{\numberline {1.4}Response of Binary Black-Hole Systems to Emissions of Gravitational Waves}{11}{section.1.4}}
\@writefile{toc}{\contentsline {subsection}{\numberline {1.4.1}Inspiral}{11}{subsection.1.4.1}}
\@writefile{lof}{\contentsline {figure}{\numberline {1.1}{\ignorespaces The three phases of gravitational-wave generation: firstly, the inspiral phase, when the orbital radius shrinks and frequencies increases as a result of the loss of energy and angular momentum through the transmission of gravitational waves. Secondly, the merger phase: when two black holes are close enough, their event horizons merge to form a common one. Finally, the ringdown phase, when the event horizon of the newly formed black hole settles down by going through a series of quasinormal oscillations. Figure taken from \url  {https://www.soundsofspacetime.org/coalescing-binaries.html}}}{12}{figure.1.1}}
\newlabel{fig:LPT}{{1.1}{12}{The three phases of gravitational-wave generation: firstly, the inspiral phase, when the orbital radius shrinks and frequencies increases as a result of the loss of energy and angular momentum through the transmission of gravitational waves. Secondly, the merger phase: when two black holes are close enough, their event horizons merge to form a common one. Finally, the ringdown phase, when the event horizon of the newly formed black hole settles down by going through a series of quasinormal oscillations. Figure taken from \url {https://www.soundsofspacetime.org/coalescing-binaries.html}}{figure.1.1}{}}
\newlabel{fig:LPT@cref}{{[figure][1][1]1.1}{[1][11][]12}}
\citation{pN_03}
\citation{pN_03}
\citation{ADM_Decomposition}
\citation{Pretorius_2005}
\citation{Pretorius_2005_02}
\citation{BSSN_01,BSSN_02}
\citation{Pretorius_2005_02}
\citation{Pretorius_2005}
\citation{Pretorius_2005_02}
\citation{Pretorius_2005}
\newlabel{fig:y equals x}{{1.4.2}{14}{Merger}{subfigure.1.2.1}{}}
\newlabel{fig:y equals x@cref}{{[subsection][2][1,4]1.4.2}{[1][14][]14}}
\newlabel{fig:three sin x}{{1.4.2}{14}{Merger}{subfigure.1.2.2}{}}
\newlabel{fig:three sin x@cref}{{[subsection][2][1,4]1.4.2}{[1][14][]14}}
\@writefile{lof}{\contentsline {figure}{\numberline {1.2}{\ignorespaces (colour lines) The left panel shows the orbit of the equal-mass binary black-hole up to the merger phase of individual mass of $10 M_{\odot }$ with different resolutions, from the first complete and successful simulations of binary black-hole merger. The simulations are done by a numerical relativity code based on generalized harmonic gauge decomposition \cite  {Pretorius_2005_02}. The right panel shows the extracted gravitational waves due to the equal masses binary in the same simulation. Figures reproduced from \cite  {Pretorius_2005} with permission. }}{14}{figure.1.2}}
\@writefile{toc}{\contentsline {subsection}{\numberline {1.4.2}Merger}{14}{subsection.1.4.2}}
\@writefile{toc}{\contentsline {subsection}{\numberline {1.4.3}Ringdown}{14}{subsection.1.4.3}}
\@setckpt{chapter1}{
\setcounter{page}{16}
\setcounter{equation}{66}
\setcounter{enumi}{0}
\setcounter{enumii}{0}
\setcounter{enumiii}{0}
\setcounter{enumiv}{0}
\setcounter{footnote}{0}
\setcounter{mpfootnote}{0}
\setcounter{part}{0}
\setcounter{chapter}{1}
\setcounter{section}{4}
\setcounter{subsection}{3}
\setcounter{subsubsection}{0}
\setcounter{paragraph}{0}
\setcounter{subparagraph}{0}
\setcounter{figure}{2}
\setcounter{table}{0}
\setcounter{parentequation}{0}
\setcounter{lips@count}{0}
\setcounter{Item}{0}
\setcounter{Hfootnote}{0}
\setcounter{bookmark@seq@number}{13}
\setcounter{@pps}{0}
\setcounter{@ppsavesec}{0}
\setcounter{@ppsaveapp}{0}
\setcounter{NAT@ctr}{0}
\setcounter{subfigure}{0}
\setcounter{lofdepth}{1}
\setcounter{subtable}{0}
\setcounter{lotdepth}{1}
\setcounter{section@level}{2}
}
