PWD /home/adrian/GWPhysics/Thesis/Mphil_CUHK/thesis_02
INPUT /etc/texmf/web2c/texmf.cnf
INPUT /usr/share/texmf/web2c/texmf.cnf
INPUT /usr/share/texlive/texmf-dist/web2c/texmf.cnf
INPUT /var/lib/texmf/web2c/pdftex/pdflatex.fmt
INPUT ociamthesismain.tex
OUTPUT ociamthesismain.log
INPUT ociamthesis.cls
INPUT ociamthesis.cls
INPUT /usr/share/texlive/texmf-dist/tex/latex/base/report.cls
INPUT /usr/share/texlive/texmf-dist/tex/latex/base/report.cls
INPUT /usr/share/texlive/texmf-dist/tex/latex/base/size12.clo
INPUT /usr/share/texlive/texmf-dist/tex/latex/base/size12.clo
INPUT /usr/share/texlive/texmf-dist/fonts/map/fontname/texfonts.map
INPUT /usr/share/texlive/texmf-dist/fonts/tfm/public/cm/cmr12.tfm
INPUT /usr/share/texlive/texmf-dist/tex/latex/graphics/graphicx.sty
INPUT /usr/share/texlive/texmf-dist/tex/latex/graphics/graphicx.sty
INPUT /usr/share/texlive/texmf-dist/tex/latex/graphics/keyval.sty
INPUT /usr/share/texlive/texmf-dist/tex/latex/graphics/keyval.sty
INPUT /usr/share/texlive/texmf-dist/tex/latex/graphics/graphics.sty
INPUT /usr/share/texlive/texmf-dist/tex/latex/graphics/graphics.sty
INPUT /usr/share/texlive/texmf-dist/tex/latex/graphics/trig.sty
INPUT /usr/share/texlive/texmf-dist/tex/latex/graphics/trig.sty
INPUT /usr/share/texlive/texmf-dist/tex/latex/graphics-cfg/graphics.cfg
INPUT /usr/share/texlive/texmf-dist/tex/latex/graphics-cfg/graphics.cfg
INPUT /usr/share/texlive/texmf-dist/tex/latex/graphics-def/pdftex.def
INPUT /usr/share/texlive/texmf-dist/tex/latex/graphics-def/pdftex.def
INPUT /usr/share/texlive/texmf-dist/tex/latex/base/ifthen.sty
INPUT /usr/share/texlive/texmf-dist/tex/latex/base/ifthen.sty
INPUT /usr/share/texlive/texmf-dist/tex/latex/amsmath/amsmath.sty
INPUT /usr/share/texlive/texmf-dist/tex/latex/amsmath/amsmath.sty
INPUT /usr/share/texlive/texmf-dist/tex/latex/amsmath/amstext.sty
INPUT /usr/share/texlive/texmf-dist/tex/latex/amsmath/amstext.sty
INPUT /usr/share/texlive/texmf-dist/tex/latex/amsmath/amsgen.sty
INPUT /usr/share/texlive/texmf-dist/tex/latex/amsmath/amsgen.sty
INPUT /usr/share/texlive/texmf-dist/tex/latex/amsmath/amsbsy.sty
INPUT /usr/share/texlive/texmf-dist/tex/latex/amsmath/amsbsy.sty
INPUT /usr/share/texlive/texmf-dist/tex/latex/amsmath/amsopn.sty
INPUT /usr/share/texlive/texmf-dist/tex/latex/amsmath/amsopn.sty
INPUT /usr/share/texlive/texmf-dist/tex/latex/base/latexsym.sty
INPUT /usr/share/texlive/texmf-dist/tex/latex/base/latexsym.sty
INPUT /usr/share/texlive/texmf-dist/tex/latex/lipsum/lipsum.sty
INPUT /usr/share/texlive/texmf-dist/tex/latex/lipsum/lipsum.sty
INPUT /usr/share/texlive/texmf-dist/tex/latex/preprint/balance.sty
INPUT /usr/share/texlive/texmf-dist/tex/latex/preprint/balance.sty
INPUT /usr/share/texlive/texmf-dist/tex/latex/hyperref/hyperref.sty
INPUT /usr/share/texlive/texmf-dist/tex/latex/hyperref/hyperref.sty
INPUT /usr/share/texlive/texmf-dist/tex/generic/oberdiek/hobsub-hyperref.sty
INPUT /usr/share/texlive/texmf-dist/tex/generic/oberdiek/hobsub-hyperref.sty
INPUT /usr/share/texlive/texmf-dist/tex/generic/oberdiek/hobsub-hyperref.sty
INPUT /usr/share/texlive/texmf-dist/tex/generic/oberdiek/hobsub-generic.sty
INPUT /usr/share/texlive/texmf-dist/tex/generic/oberdiek/hobsub-generic.sty
INPUT /usr/share/texlive/texmf-dist/tex/generic/ifxetex/ifxetex.sty
INPUT /usr/share/texlive/texmf-dist/tex/generic/ifxetex/ifxetex.sty
INPUT /usr/share/texlive/texmf-dist/tex/latex/oberdiek/auxhook.sty
INPUT /usr/share/texlive/texmf-dist/tex/latex/oberdiek/auxhook.sty
INPUT /usr/share/texlive/texmf-dist/tex/latex/oberdiek/kvoptions.sty
INPUT /usr/share/texlive/texmf-dist/tex/latex/oberdiek/kvoptions.sty
INPUT /usr/share/texlive/texmf-dist/tex/latex/hyperref/pd1enc.def
INPUT /usr/share/texlive/texmf-dist/tex/latex/hyperref/pd1enc.def
INPUT /usr/share/texlive/texmf-dist/tex/latex/latexconfig/hyperref.cfg
INPUT /usr/share/texlive/texmf-dist/tex/latex/latexconfig/hyperref.cfg
INPUT /usr/share/texlive/texmf-dist/tex/latex/url/url.sty
INPUT /usr/share/texlive/texmf-dist/tex/latex/url/url.sty
INPUT /usr/share/texlive/texmf-dist/tex/latex/hyperref/hpdftex.def
INPUT /usr/share/texlive/texmf-dist/tex/latex/hyperref/hpdftex.def
INPUT /usr/share/texlive/texmf-dist/tex/latex/oberdiek/rerunfilecheck.sty
INPUT /usr/share/texlive/texmf-dist/tex/latex/oberdiek/rerunfilecheck.sty
INPUT /usr/share/texlive/texmf-dist/tex/latex/appendix/appendix.sty
INPUT /usr/share/texlive/texmf-dist/tex/latex/appendix/appendix.sty
INPUT /usr/share/texlive/texmf-dist/tex/latex/oberdiek/zref.sty
INPUT /usr/share/texlive/texmf-dist/tex/latex/oberdiek/zref.sty
INPUT /usr/share/texlive/texmf-dist/tex/latex/oberdiek/zref-base.sty
INPUT /usr/share/texlive/texmf-dist/tex/latex/oberdiek/zref-base.sty
INPUT /usr/share/texlive/texmf-dist/tex/latex/oberdiek/zref-titleref.sty
INPUT /usr/share/texlive/texmf-dist/tex/latex/oberdiek/zref-titleref.sty
INPUT /usr/share/texlive/texmf-dist/tex/generic/oberdiek/gettitlestring.sty
INPUT /usr/share/texlive/texmf-dist/tex/generic/oberdiek/gettitlestring.sty
INPUT /usr/share/texlive/texmf-dist/tex/latex/oberdiek/zref-user.sty
INPUT /usr/share/texlive/texmf-dist/tex/latex/oberdiek/zref-user.sty
INPUT /usr/share/texlive/texmf-dist/tex/latex/cleveref/cleveref.sty
INPUT /usr/share/texlive/texmf-dist/tex/latex/cleveref/cleveref.sty
INPUT /usr/share/texlive/texmf-dist/tex/latex/braket/braket.sty
INPUT /usr/share/texlive/texmf-dist/tex/latex/braket/braket.sty
INPUT /usr/share/texlive/texmf-dist/tex/latex/natbib/natbib.sty
INPUT /usr/share/texlive/texmf-dist/tex/latex/natbib/natbib.sty
INPUT /usr/share/texlive/texmf-dist/tex/latex/subfigure/subfigure.sty
INPUT /usr/share/texlive/texmf-dist/tex/latex/subfigure/subfigure.sty
INPUT /usr/share/texlive/texmf-dist/tex/latex/subfigure/subfigure.cfg
INPUT /usr/share/texlive/texmf-dist/tex/latex/subfigure/subfigure.cfg
INPUT /usr/share/texmf/tex/latex/CJK/CJKutf8.sty
INPUT /usr/share/texmf/tex/latex/CJK/CJKutf8.sty
INPUT /usr/share/texlive/texmf-dist/tex/latex/base/inputenc.sty
INPUT /usr/share/texlive/texmf-dist/tex/latex/base/inputenc.sty
INPUT /usr/share/texlive/texmf-dist/tex/latex/base/utf8.def
INPUT /usr/share/texlive/texmf-dist/tex/latex/base/utf8.def
INPUT /usr/share/texlive/texmf-dist/tex/latex/base/t1enc.dfu
INPUT /usr/share/texlive/texmf-dist/tex/latex/base/t1enc.dfu
INPUT /usr/share/texlive/texmf-dist/tex/latex/base/ot1enc.dfu
INPUT /usr/share/texlive/texmf-dist/tex/latex/base/ot1enc.dfu
INPUT /usr/share/texlive/texmf-dist/tex/latex/base/omsenc.dfu
INPUT /usr/share/texlive/texmf-dist/tex/latex/base/omsenc.dfu
INPUT /usr/share/texmf/tex/latex/CJK/CJK.sty
INPUT /usr/share/texmf/tex/latex/CJK/CJK.sty
INPUT /usr/share/texmf/tex/latex/CJK/mule/MULEenc.sty
INPUT /usr/share/texmf/tex/latex/CJK/mule/MULEenc.sty
INPUT /usr/share/texmf/tex/latex/CJK/CJK.enc
INPUT /usr/share/texlive/texmf-dist/tex/latex/base/fontenc.sty
INPUT /usr/share/texlive/texmf-dist/tex/latex/base/fontenc.sty
INPUT /usr/share/texlive/texmf-dist/tex/latex/pgf/frontendlayer/tikz.sty
INPUT /usr/share/texlive/texmf-dist/tex/latex/pgf/frontendlayer/tikz.sty
INPUT /usr/share/texlive/texmf-dist/tex/latex/pgf/basiclayer/pgf.sty
INPUT /usr/share/texlive/texmf-dist/tex/latex/pgf/basiclayer/pgf.sty
INPUT /usr/share/texlive/texmf-dist/tex/latex/pgf/utilities/pgfrcs.sty
INPUT /usr/share/texlive/texmf-dist/tex/latex/pgf/utilities/pgfrcs.sty
INPUT /usr/share/texlive/texmf-dist/tex/generic/pgf/utilities/pgfutil-common.tex
INPUT /usr/share/texlive/texmf-dist/tex/generic/pgf/utilities/pgfutil-common-lists.tex
INPUT /usr/share/texlive/texmf-dist/tex/generic/pgf/utilities/pgfutil-latex.def
INPUT /usr/share/texlive/texmf-dist/tex/latex/ms/everyshi.sty
INPUT /usr/share/texlive/texmf-dist/tex/latex/ms/everyshi.sty
INPUT /usr/share/texlive/texmf-dist/tex/generic/pgf/utilities/pgfrcs.code.tex
INPUT /usr/share/texlive/texmf-dist/tex/generic/pgf/utilities/pgfrcs.code.tex
INPUT /usr/share/texlive/texmf-dist/tex/latex/pgf/basiclayer/pgfcore.sty
INPUT /usr/share/texlive/texmf-dist/tex/latex/pgf/basiclayer/pgfcore.sty
INPUT /usr/share/texlive/texmf-dist/tex/latex/pgf/systemlayer/pgfsys.sty
INPUT /usr/share/texlive/texmf-dist/tex/latex/pgf/systemlayer/pgfsys.sty
INPUT /usr/share/texlive/texmf-dist/tex/generic/pgf/systemlayer/pgfsys.code.tex
INPUT /usr/share/texlive/texmf-dist/tex/generic/pgf/systemlayer/pgfsys.code.tex
INPUT /usr/share/texlive/texmf-dist/tex/generic/pgf/utilities/pgfkeys.code.tex
INPUT /usr/share/texlive/texmf-dist/tex/generic/pgf/utilities/pgfkeysfiltered.code.tex
INPUT /usr/share/texlive/texmf-dist/tex/generic/pgf/systemlayer/pgf.cfg
INPUT /usr/share/texlive/texmf-dist/tex/generic/pgf/systemlayer/pgfsys-pdftex.def
INPUT /usr/share/texlive/texmf-dist/tex/generic/pgf/systemlayer/pgfsys-pdftex.def
INPUT /usr/share/texlive/texmf-dist/tex/generic/pgf/systemlayer/pgfsys-common-pdf.def
INPUT /usr/share/texlive/texmf-dist/tex/generic/pgf/systemlayer/pgfsyssoftpath.code.tex
INPUT /usr/share/texlive/texmf-dist/tex/generic/pgf/systemlayer/pgfsyssoftpath.code.tex
INPUT /usr/share/texlive/texmf-dist/tex/generic/pgf/systemlayer/pgfsysprotocol.code.tex
INPUT /usr/share/texlive/texmf-dist/tex/generic/pgf/systemlayer/pgfsysprotocol.code.tex
INPUT /usr/share/texlive/texmf-dist/tex/latex/xcolor/xcolor.sty
INPUT /usr/share/texlive/texmf-dist/tex/latex/xcolor/xcolor.sty
INPUT /usr/share/texlive/texmf-dist/tex/latex/graphics-cfg/color.cfg
INPUT /usr/share/texlive/texmf-dist/tex/latex/graphics-cfg/color.cfg
INPUT /usr/share/texlive/texmf-dist/tex/generic/pgf/basiclayer/pgfcore.code.tex
INPUT /usr/share/texlive/texmf-dist/tex/generic/pgf/basiclayer/pgfcore.code.tex
INPUT /usr/share/texlive/texmf-dist/tex/generic/pgf/math/pgfmath.code.tex
INPUT /usr/share/texlive/texmf-dist/tex/generic/pgf/math/pgfmathcalc.code.tex
INPUT /usr/share/texlive/texmf-dist/tex/generic/pgf/math/pgfmathutil.code.tex
INPUT /usr/share/texlive/texmf-dist/tex/generic/pgf/math/pgfmathparser.code.tex
INPUT /usr/share/texlive/texmf-dist/tex/generic/pgf/math/pgfmathfunctions.code.tex
INPUT /usr/share/texlive/texmf-dist/tex/generic/pgf/math/pgfmathfunctions.basic.code.tex
INPUT /usr/share/texlive/texmf-dist/tex/generic/pgf/math/pgfmathfunctions.trigonometric.code.tex
INPUT /usr/share/texlive/texmf-dist/tex/generic/pgf/math/pgfmathfunctions.random.code.tex
INPUT /usr/share/texlive/texmf-dist/tex/generic/pgf/math/pgfmathfunctions.comparison.code.tex
INPUT /usr/share/texlive/texmf-dist/tex/generic/pgf/math/pgfmathfunctions.base.code.tex
INPUT /usr/share/texlive/texmf-dist/tex/generic/pgf/math/pgfmathfunctions.round.code.tex
INPUT /usr/share/texlive/texmf-dist/tex/generic/pgf/math/pgfmathfunctions.misc.code.tex
INPUT /usr/share/texlive/texmf-dist/tex/generic/pgf/math/pgfmathfunctions.integerarithmetics.code.tex
INPUT /usr/share/texlive/texmf-dist/tex/generic/pgf/math/pgfmathfloat.code.tex
INPUT /usr/share/texlive/texmf-dist/tex/generic/pgf/basiclayer/pgfcorepoints.code.tex
INPUT /usr/share/texlive/texmf-dist/tex/generic/pgf/basiclayer/pgfcorepathconstruct.code.tex
INPUT /usr/share/texlive/texmf-dist/tex/generic/pgf/basiclayer/pgfcorepathusage.code.tex
INPUT /usr/share/texlive/texmf-dist/tex/generic/pgf/basiclayer/pgfcorescopes.code.tex
INPUT /usr/share/texlive/texmf-dist/tex/generic/pgf/basiclayer/pgfcoregraphicstate.code.tex
INPUT /usr/share/texlive/texmf-dist/tex/generic/pgf/basiclayer/pgfcoretransformations.code.tex
INPUT /usr/share/texlive/texmf-dist/tex/generic/pgf/basiclayer/pgfcorequick.code.tex
INPUT /usr/share/texlive/texmf-dist/tex/generic/pgf/basiclayer/pgfcoreobjects.code.tex
INPUT /usr/share/texlive/texmf-dist/tex/generic/pgf/basiclayer/pgfcorepathprocessing.code.tex
INPUT /usr/share/texlive/texmf-dist/tex/generic/pgf/basiclayer/pgfcorearrows.code.tex
INPUT /usr/share/texlive/texmf-dist/tex/generic/pgf/basiclayer/pgfcoreshade.code.tex
INPUT /usr/share/texlive/texmf-dist/tex/generic/pgf/basiclayer/pgfcoreimage.code.tex
INPUT /usr/share/texlive/texmf-dist/tex/generic/pgf/basiclayer/pgfcoreexternal.code.tex
INPUT /usr/share/texlive/texmf-dist/tex/generic/pgf/basiclayer/pgfcorelayers.code.tex
INPUT /usr/share/texlive/texmf-dist/tex/generic/pgf/basiclayer/pgfcoretransparency.code.tex
INPUT /usr/share/texlive/texmf-dist/tex/generic/pgf/basiclayer/pgfcorepatterns.code.tex
INPUT /usr/share/texlive/texmf-dist/tex/generic/pgf/modules/pgfmoduleshapes.code.tex
INPUT /usr/share/texlive/texmf-dist/tex/generic/pgf/modules/pgfmoduleplot.code.tex
INPUT /usr/share/texlive/texmf-dist/tex/latex/pgf/compatibility/pgfcomp-version-0-65.sty
INPUT /usr/share/texlive/texmf-dist/tex/latex/pgf/compatibility/pgfcomp-version-0-65.sty
INPUT /usr/share/texlive/texmf-dist/tex/latex/pgf/compatibility/pgfcomp-version-1-18.sty
INPUT /usr/share/texlive/texmf-dist/tex/latex/pgf/compatibility/pgfcomp-version-1-18.sty
INPUT /usr/share/texlive/texmf-dist/tex/latex/pgf/utilities/pgffor.sty
INPUT /usr/share/texlive/texmf-dist/tex/latex/pgf/utilities/pgffor.sty
INPUT /usr/share/texlive/texmf-dist/tex/latex/pgf/utilities/pgfkeys.sty
INPUT /usr/share/texlive/texmf-dist/tex/latex/pgf/utilities/pgfkeys.sty
INPUT /usr/share/texlive/texmf-dist/tex/generic/pgf/utilities/pgfkeys.code.tex
INPUT /usr/share/texlive/texmf-dist/tex/generic/pgf/utilities/pgfkeys.code.tex
INPUT /usr/share/texlive/texmf-dist/tex/latex/pgf/math/pgfmath.sty
INPUT /usr/share/texlive/texmf-dist/tex/latex/pgf/math/pgfmath.sty
INPUT /usr/share/texlive/texmf-dist/tex/generic/pgf/math/pgfmath.code.tex
INPUT /usr/share/texlive/texmf-dist/tex/generic/pgf/math/pgfmath.code.tex
INPUT /usr/share/texlive/texmf-dist/tex/generic/pgf/utilities/pgffor.code.tex
INPUT /usr/share/texlive/texmf-dist/tex/generic/pgf/utilities/pgffor.code.tex
INPUT /usr/share/texlive/texmf-dist/tex/generic/pgf/math/pgfmath.code.tex
INPUT /usr/share/texlive/texmf-dist/tex/generic/pgf/frontendlayer/tikz/tikz.code.tex
INPUT /usr/share/texlive/texmf-dist/tex/generic/pgf/frontendlayer/tikz/tikz.code.tex
INPUT /usr/share/texlive/texmf-dist/tex/generic/pgf/libraries/pgflibraryplothandlers.code.tex
INPUT /usr/share/texlive/texmf-dist/tex/generic/pgf/libraries/pgflibraryplothandlers.code.tex
INPUT /usr/share/texlive/texmf-dist/tex/generic/pgf/modules/pgfmodulematrix.code.tex
INPUT /usr/share/texlive/texmf-dist/tex/generic/pgf/frontendlayer/tikz/libraries/tikzlibrarytopaths.code.tex
INPUT /usr/share/texlive/texmf-dist/tex/generic/pgf/frontendlayer/tikz/libraries/tikzlibrarytopaths.code.tex
INPUT /usr/share/texlive/texmf-dist/tex/latex/tools/dcolumn.sty
INPUT /usr/share/texlive/texmf-dist/tex/latex/tools/dcolumn.sty
INPUT /usr/share/texlive/texmf-dist/tex/latex/tools/array.sty
INPUT /usr/share/texlive/texmf-dist/tex/latex/tools/array.sty
INPUT /usr/share/texlive/texmf-dist/tex/latex/tools/bm.sty
INPUT /usr/share/texlive/texmf-dist/tex/latex/tools/bm.sty
INPUT ociamthesismain.aux
INPUT ociamthesismain.aux
INPUT dedication.aux
INPUT dedication.aux
INPUT abstract.aux
INPUT abstract.aux
INPUT acknowlegements.aux
INPUT acknowlegements.aux
INPUT chapter1.aux
INPUT chapter1.aux
INPUT chapter2.aux
INPUT chapter2.aux
INPUT chapter3.aux
INPUT chapter3.aux
INPUT chapter_QNM_mg.aux
INPUT chapter_QNM_mg.aux
INPUT conclusions.aux
INPUT conclusions.aux
OUTPUT ociamthesismain.aux
INPUT /usr/share/texlive/texmf-dist/tex/context/base/mkii/supp-pdf.mkii
INPUT /usr/share/texlive/texmf-dist/tex/context/base/mkii/supp-pdf.mkii
INPUT /usr/share/texlive/texmf-dist/tex/latex/oberdiek/epstopdf-base.sty
INPUT /usr/share/texlive/texmf-dist/tex/latex/oberdiek/epstopdf-base.sty
INPUT /usr/share/texlive/texmf-dist/tex/latex/oberdiek/grfext.sty
INPUT /usr/share/texlive/texmf-dist/tex/latex/oberdiek/grfext.sty
INPUT /usr/share/texlive/texmf-dist/tex/latex/latexconfig/epstopdf-sys.cfg
INPUT /usr/share/texlive/texmf-dist/tex/latex/latexconfig/epstopdf-sys.cfg
INPUT /usr/share/texlive/texmf-dist/tex/latex/hyperref/nameref.sty
INPUT /usr/share/texlive/texmf-dist/tex/latex/hyperref/nameref.sty
INPUT ociamthesismain.out
INPUT ociamthesismain.out
INPUT ociamthesismain.out
INPUT ociamthesismain.out
OUTPUT ociamthesismain.pdf
INPUT ./ociamthesismain.out
INPUT ./ociamthesismain.out
OUTPUT ociamthesismain.out
INPUT /usr/share/texmf/tex/latex/CJK/UTF8/UTF8.bdg
INPUT /usr/share/texmf/tex/latex/CJK/UTF8/UTF8.enc
INPUT /usr/share/texmf/tex/latex/CJK/UTF8/UTF8.chr
INPUT /usr/share/texlive/texmf-dist/fonts/tfm/public/cm/cmr17.tfm
INPUT /usr/share/texlive/texmf-dist/fonts/tfm/public/cm/cmbx12.tfm
INPUT /usr/share/texmf/tex/latex/CJK/UTF8/c70bsmi.fd
INPUT /usr/share/texmf/tex/latex/CJK/UTF8/c70bsmi.fd
INPUT /usr/share/texmf/tex/latex/CJK/UTF8/c70bsmi.fdx
INPUT /usr/share/texmf/tex/latex/CJK/UTF8/c70bsmi.fdx
INPUT /usr/share/texmf/fonts/tfm/arphic/bsmiu/bsmiu90.tfm
INPUT /usr/share/texmf/fonts/tfm/arphic/bsmiu/bsmiu63.tfm
INPUT /usr/share/texmf/fonts/tfm/arphic/bsmiu/bsmiu6e.tfm
INPUT /usr/share/texmf/fonts/tfm/arphic/bsmiu/bsmiu9e.tfm
INPUT /usr/share/texmf/fonts/tfm/arphic/bsmiu/bsmiu6d.tfm
INPUT /usr/share/texmf/fonts/tfm/arphic/bsmiu/bsmiu92.tfm
INPUT /usr/share/texmf/fonts/tfm/arphic/bsmiu/bsmiu76.tfm
INPUT /usr/share/texmf/fonts/tfm/arphic/bsmiu/bsmiu8a.tfm
INPUT /usr/share/texmf/fonts/tfm/arphic/bsmiu/bsmiu5e.tfm
INPUT /usr/share/texmf/fonts/tfm/arphic/bsmiu/bsmiu7f.tfm
INPUT /usr/share/texmf/fonts/tfm/arphic/bsmiu/bsmiu5c.tfm
INPUT /usr/share/texlive/texmf-dist/fonts/tfm/public/cm/cmr12.tfm
INPUT /usr/share/texlive/texmf-dist/fonts/tfm/public/cm/cmr17.tfm
INPUT /usr/share/texmf/fonts/tfm/arphic/bsmiu/bsmiu93.tfm
INPUT /usr/share/texmf/fonts/tfm/arphic/bsmiu/bsmiu56.tfm
INPUT /usr/share/texmf/fonts/tfm/arphic/bsmiu/bsmiu55.tfm
INPUT /usr/share/texlive/texmf-dist/fonts/tfm/public/cm/cmti12.tfm
INPUT /var/lib/texmf/fonts/map/pdftex/updmap/pdftex.map
OUTPUT dedication.aux
INPUT dedication.tex
INPUT dedication.tex
INPUT /usr/share/texlive/texmf-dist/fonts/tfm/public/cm/cmr17.tfm
OUTPUT abstract.aux
INPUT abstract.tex
INPUT abstract.tex
INPUT /usr/share/texlive/texmf-dist/fonts/tfm/public/cm/cmbx12.tfm
INPUT /usr/share/texlive/texmf-dist/fonts/tfm/public/cm/cmr8.tfm
INPUT /usr/share/texlive/texmf-dist/fonts/tfm/public/cm/cmr6.tfm
INPUT /usr/share/texlive/texmf-dist/fonts/tfm/public/cm/cmmi12.tfm
INPUT /usr/share/texlive/texmf-dist/fonts/tfm/public/cm/cmmi8.tfm
INPUT /usr/share/texlive/texmf-dist/fonts/tfm/public/cm/cmmi6.tfm
INPUT /usr/share/texlive/texmf-dist/fonts/tfm/public/cm/cmsy10.tfm
INPUT /usr/share/texlive/texmf-dist/fonts/tfm/public/cm/cmsy8.tfm
INPUT /usr/share/texlive/texmf-dist/fonts/tfm/public/cm/cmsy6.tfm
INPUT /usr/share/texlive/texmf-dist/fonts/tfm/public/cm/cmex10.tfm
INPUT /usr/share/texlive/texmf-dist/fonts/tfm/public/amsfonts/cmextra/cmex8.tfm
INPUT /usr/share/texlive/texmf-dist/fonts/tfm/public/amsfonts/cmextra/cmex7.tfm
INPUT /usr/share/texlive/texmf-dist/tex/latex/base/ulasy.fd
INPUT /usr/share/texlive/texmf-dist/tex/latex/base/ulasy.fd
INPUT /usr/share/texlive/texmf-dist/fonts/tfm/public/latex-fonts/lasy10.tfm
INPUT /usr/share/texlive/texmf-dist/fonts/tfm/public/latex-fonts/lasy8.tfm
INPUT /usr/share/texlive/texmf-dist/fonts/tfm/public/latex-fonts/lasy6.tfm
INPUT /usr/share/texlive/texmf-dist/fonts/tfm/public/cm/cmbx12.tfm
INPUT /usr/share/texlive/texmf-dist/fonts/tfm/public/cm/cmbx8.tfm
INPUT /usr/share/texlive/texmf-dist/fonts/tfm/public/cm/cmbx6.tfm
INPUT /usr/share/texlive/texmf-dist/fonts/tfm/public/cm/cmmib10.tfm
INPUT /usr/share/texlive/texmf-dist/fonts/tfm/public/amsfonts/cmextra/cmmib8.tfm
INPUT /usr/share/texlive/texmf-dist/fonts/tfm/public/amsfonts/cmextra/cmmib6.tfm
INPUT /usr/share/texlive/texmf-dist/fonts/tfm/public/cm/cmbsy10.tfm
INPUT /usr/share/texlive/texmf-dist/fonts/tfm/public/amsfonts/cmextra/cmbsy8.tfm
INPUT /usr/share/texlive/texmf-dist/fonts/tfm/public/amsfonts/cmextra/cmbsy6.tfm
INPUT /usr/share/texlive/texmf-dist/fonts/tfm/public/latex-fonts/lasyb10.tfm
INPUT /usr/share/texmf/fonts/tfm/arphic/bsmiu/bsmiu64.tfm
INPUT /usr/share/texmf/fonts/tfm/arphic/bsmiu/bsmiu89.tfm
INPUT /usr/share/texmf/fonts/tfm/arphic/bsmiu/bsmiu9e.tfm
INPUT /usr/share/texmf/fonts/tfm/arphic/bsmiu/bsmiu6d.tfm
INPUT /usr/share/texmf/fonts/tfm/arphic/bsmiu/bsmiu92.tfm
INPUT /usr/share/texmf/fonts/tfm/arphic/bsmiu/bsmiu76.tfm
INPUT /usr/share/texmf/fonts/tfm/arphic/bsmiu/bsmiu66.tfm
INPUT /usr/share/texmf/fonts/tfm/arphic/bsmiu/bsmiu4e.tfm
INPUT /usr/share/texmf/fonts/tfm/arphic/bsmiu/bsmiu75.tfm
INPUT /usr/share/texmf/fonts/tfm/arphic/bsmiu/bsmiu97.tfm
INPUT /usr/share/texmf/fonts/tfm/arphic/bsmiu/bsmiu52.tfm
INPUT /usr/share/texmf/fonts/tfm/arphic/bsmiu/bsmiu30.tfm
INPUT /usr/share/texmf/fonts/tfm/arphic/bsmiu/bsmiu98.tfm
INPUT /usr/share/texmf/fonts/tfm/arphic/bsmiu/bsmiu73.tfm
INPUT /usr/share/texmf/fonts/tfm/arphic/bsmiu/bsmiu63.tfm
INPUT /usr/share/texmf/fonts/tfm/arphic/bsmiu/bsmiu4f.tfm
INPUT /usr/share/texmf/fonts/tfm/arphic/bsmiu/bsmiu50.tfm
INPUT /usr/share/texmf/fonts/tfm/arphic/bsmiu/bsmiu65.tfm
INPUT /usr/share/texmf/fonts/tfm/arphic/bsmiu/bsmiu6c.tfm
INPUT /usr/share/texmf/fonts/tfm/arphic/bsmiu/bsmiu53.tfm
INPUT /usr/share/texmf/fonts/tfm/arphic/bsmiu/bsmiu6e.tfm
INPUT /usr/share/texmf/fonts/tfm/arphic/bsmiu/bsmiu8a.tfm
INPUT /usr/share/texmf/fonts/tfm/arphic/bsmiu/bsmiu5e.tfm
INPUT /usr/share/texmf/fonts/tfm/arphic/bsmiu/bsmiu5c.tfm
INPUT /usr/share/texmf/fonts/tfm/arphic/bsmiu/bsmiu57.tfm
INPUT /usr/share/texmf/fonts/tfm/arphic/bsmiu/bsmiu5f.tfm
INPUT /usr/share/texmf/fonts/tfm/arphic/bsmiu/bsmiu58.tfm
INPUT /usr/share/texmf/fonts/tfm/arphic/bsmiu/bsmiu7a.tfm
INPUT /usr/share/texmf/fonts/tfm/arphic/bsmiu/bsmiu6b.tfm
INPUT /usr/share/texmf/fonts/tfm/arphic/bsmiu/bsmiu78.tfm
INPUT /usr/share/texmf/fonts/tfm/arphic/bsmiu/bsmiu60.tfm
INPUT /usr/share/texmf/fonts/tfm/arphic/bsmiu/bsmiu80.tfm
INPUT /usr/share/texmf/fonts/tfm/arphic/bsmiu/bsmiu90.tfm
INPUT /usr/share/texmf/fonts/tfm/arphic/bsmiu/bsmiu51.tfm
INPUT /usr/share/texmf/fonts/tfm/arphic/bsmiu/bsmiu72.tfm
INPUT /usr/share/texmf/fonts/tfm/arphic/bsmiu/bsmiu74.tfm
INPUT /usr/share/texmf/fonts/tfm/arphic/bsmiu/bsmiu61.tfm
INPUT /usr/share/texmf/fonts/tfm/arphic/bsmiu/bsmiu7f.tfm
INPUT /usr/share/texmf/fonts/tfm/arphic/bsmiu/bsmiu62.tfm
INPUT /usr/share/texmf/fonts/tfm/arphic/bsmiu/bsmiu7c.tfm
INPUT /usr/share/texmf/fonts/tfm/arphic/bsmiu/bsmiu6a.tfm
INPUT /usr/share/texmf/fonts/tfm/arphic/bsmiu/bsmiu8c.tfm
INPUT /usr/share/texmf/fonts/tfm/arphic/bsmiu/bsmiu84.tfm
INPUT /usr/share/texmf/fonts/tfm/arphic/bsmiu/bsmiu67.tfm
INPUT /usr/share/texmf/fonts/tfm/arphic/bsmiu/bsmiu7b.tfm
INPUT /usr/share/texmf/fonts/tfm/arphic/bsmiu/bsmiu91.tfm
INPUT /usr/share/texmf/fonts/tfm/arphic/bsmiu/bsmiu8b.tfm
INPUT /usr/share/texmf/fonts/tfm/arphic/bsmiu/bsmiu7d.tfm
INPUT /usr/share/texmf/fonts/tfm/arphic/bsmiu/bsmiu5b.tfm
INPUT /usr/share/texmf/fonts/tfm/arphic/bsmiu/bsmiu96.tfm
INPUT /usr/share/texmf/fonts/tfm/arphic/bsmiu/bsmiu8f.tfm
INPUT /usr/share/texmf/fonts/tfm/arphic/bsmiu/bsmiu95.tfm
OUTPUT acknowlegements.aux
INPUT acknowlegements.tex
INPUT acknowlegements.tex
INPUT ociamthesismain.toc
INPUT ociamthesismain.toc
OUTPUT ociamthesismain.toc
INPUT ociamthesismain.lof
INPUT ociamthesismain.lof
INPUT /usr/share/texlive/texmf-dist/fonts/tfm/public/cm/cmtt12.tfm
OUTPUT ociamthesismain.lof
OUTPUT chapter1.aux
INPUT chapter1.tex
INPUT chapter1.tex
INPUT /usr/share/texlive/texmf-dist/fonts/tfm/public/cm/cmti12.tfm
INPUT /usr/share/texlive/texmf-dist/fonts/tfm/public/cm/cmbx12.tfm
INPUT GW_IMR.png
INPUT ./GW_IMR.png
INPUT ./GW_IMR.png
INPUT Pretorius_2005_01.png
INPUT ./Pretorius_2005_01.png
INPUT ./Pretorius_2005_01.png
INPUT Pretorius_2005_02.png
INPUT ./Pretorius_2005_02.png
INPUT ./Pretorius_2005_02.png
OUTPUT chapter2.aux
INPUT chapter2.tex
INPUT chapter2.tex
INPUT contour.pdf
INPUT ./contour.pdf
INPUT ./contour.pdf
INPUT Effective_Potential.pdf
INPUT ./Effective_Potential.pdf
INPUT ./Effective_Potential.pdf
OUTPUT chapter3.aux
INPUT chapter3.tex
INPUT chapter3.tex
OUTPUT chapter_QNM_mg.aux
INPUT chapter_QNM_mg.tex
INPUT chapter_QNM_mg.tex
INPUT QNM_022_f_M_plane_gradient_hor.pdf
INPUT ./QNM_022_f_M_plane_gradient_hor.pdf
INPUT ./QNM_022_f_M_plane_gradient_hor.pdf
INPUT TD_M_100.pdf
INPUT ./TD_M_100.pdf
INPUT ./TD_M_100.pdf
INPUT /usr/share/texlive/texmf-dist/fonts/tfm/public/cm/cmss12.tfm
INPUT Summary_plot.pdf
INPUT ./Summary_plot.pdf
INPUT ./Summary_plot.pdf
INPUT Inner_product_corrected.pdf
INPUT ./Inner_product_corrected.pdf
INPUT ./Inner_product_corrected.pdf
OUTPUT chapter_BH_Temp.aux
INPUT chapter_BH_Temp.tex
INPUT chapter_BH_Temp.tex
INPUT Summary_PDF.pdf
INPUT ./Summary_PDF.pdf
INPUT ./Summary_PDF.pdf
OUTPUT conclusions.aux
INPUT conclusions.tex
INPUT conclusions.tex
INPUT ociamthesismain.bbl
INPUT ociamthesismain.bbl
INPUT ociamthesismain.aux
INPUT dedication.aux
INPUT dedication.aux
INPUT abstract.aux
INPUT abstract.aux
INPUT acknowlegements.aux
INPUT acknowlegements.aux
INPUT chapter1.aux
INPUT chapter1.aux
INPUT chapter2.aux
INPUT chapter2.aux
INPUT chapter3.aux
INPUT chapter3.aux
INPUT chapter_QNM_mg.aux
INPUT chapter_QNM_mg.aux
INPUT chapter_BH_Temp.aux
INPUT chapter_BH_Temp.aux
INPUT conclusions.aux
INPUT conclusions.aux
INPUT ./ociamthesismain.out
INPUT ./ociamthesismain.out
INPUT /usr/share/texmf/fonts/type1/arphic/bsmiu/bsmiu30.pfb
INPUT /usr/share/texmf/fonts/type1/arphic/bsmiu/bsmiu4e.pfb
INPUT /usr/share/texmf/fonts/type1/arphic/bsmiu/bsmiu4f.pfb
INPUT /usr/share/texmf/fonts/type1/arphic/bsmiu/bsmiu50.pfb
INPUT /usr/share/texmf/fonts/type1/arphic/bsmiu/bsmiu51.pfb
INPUT /usr/share/texmf/fonts/type1/arphic/bsmiu/bsmiu52.pfb
INPUT /usr/share/texmf/fonts/type1/arphic/bsmiu/bsmiu53.pfb
INPUT /usr/share/texmf/fonts/type1/arphic/bsmiu/bsmiu55.pfb
INPUT /usr/share/texmf/fonts/type1/arphic/bsmiu/bsmiu56.pfb
INPUT /usr/share/texmf/fonts/type1/arphic/bsmiu/bsmiu57.pfb
INPUT /usr/share/texmf/fonts/type1/arphic/bsmiu/bsmiu58.pfb
INPUT /usr/share/texmf/fonts/type1/arphic/bsmiu/bsmiu5b.pfb
INPUT /usr/share/texmf/fonts/type1/arphic/bsmiu/bsmiu5c.pfb
INPUT /usr/share/texmf/fonts/type1/arphic/bsmiu/bsmiu5e.pfb
INPUT /usr/share/texmf/fonts/type1/arphic/bsmiu/bsmiu5f.pfb
INPUT /usr/share/texmf/fonts/type1/arphic/bsmiu/bsmiu60.pfb
INPUT /usr/share/texmf/fonts/type1/arphic/bsmiu/bsmiu61.pfb
INPUT /usr/share/texmf/fonts/type1/arphic/bsmiu/bsmiu62.pfb
INPUT /usr/share/texmf/fonts/type1/arphic/bsmiu/bsmiu63.pfb
INPUT /usr/share/texmf/fonts/type1/arphic/bsmiu/bsmiu64.pfb
INPUT /usr/share/texmf/fonts/type1/arphic/bsmiu/bsmiu65.pfb
INPUT /usr/share/texmf/fonts/type1/arphic/bsmiu/bsmiu66.pfb
INPUT /usr/share/texmf/fonts/type1/arphic/bsmiu/bsmiu67.pfb
INPUT /usr/share/texmf/fonts/type1/arphic/bsmiu/bsmiu6a.pfb
INPUT /usr/share/texmf/fonts/type1/arphic/bsmiu/bsmiu6b.pfb
INPUT /usr/share/texmf/fonts/type1/arphic/bsmiu/bsmiu6c.pfb
INPUT /usr/share/texmf/fonts/type1/arphic/bsmiu/bsmiu6d.pfb
INPUT /usr/share/texmf/fonts/type1/arphic/bsmiu/bsmiu6e.pfb
INPUT /usr/share/texmf/fonts/type1/arphic/bsmiu/bsmiu72.pfb
INPUT /usr/share/texmf/fonts/type1/arphic/bsmiu/bsmiu73.pfb
INPUT /usr/share/texmf/fonts/type1/arphic/bsmiu/bsmiu74.pfb
INPUT /usr/share/texmf/fonts/type1/arphic/bsmiu/bsmiu75.pfb
INPUT /usr/share/texmf/fonts/type1/arphic/bsmiu/bsmiu76.pfb
INPUT /usr/share/texmf/fonts/type1/arphic/bsmiu/bsmiu78.pfb
INPUT /usr/share/texmf/fonts/type1/arphic/bsmiu/bsmiu7a.pfb
INPUT /usr/share/texmf/fonts/type1/arphic/bsmiu/bsmiu7b.pfb
INPUT /usr/share/texmf/fonts/type1/arphic/bsmiu/bsmiu7c.pfb
INPUT /usr/share/texmf/fonts/type1/arphic/bsmiu/bsmiu7d.pfb
INPUT /usr/share/texmf/fonts/type1/arphic/bsmiu/bsmiu7f.pfb
INPUT /usr/share/texmf/fonts/type1/arphic/bsmiu/bsmiu80.pfb
INPUT /usr/share/texmf/fonts/type1/arphic/bsmiu/bsmiu84.pfb
INPUT /usr/share/texmf/fonts/type1/arphic/bsmiu/bsmiu89.pfb
INPUT /usr/share/texmf/fonts/type1/arphic/bsmiu/bsmiu8a.pfb
INPUT /usr/share/texmf/fonts/type1/arphic/bsmiu/bsmiu8b.pfb
INPUT /usr/share/texmf/fonts/type1/arphic/bsmiu/bsmiu8c.pfb
INPUT /usr/share/texmf/fonts/type1/arphic/bsmiu/bsmiu8f.pfb
INPUT /usr/share/texmf/fonts/type1/arphic/bsmiu/bsmiu90.pfb
INPUT /usr/share/texmf/fonts/type1/arphic/bsmiu/bsmiu91.pfb
INPUT /usr/share/texmf/fonts/type1/arphic/bsmiu/bsmiu92.pfb
INPUT /usr/share/texmf/fonts/type1/arphic/bsmiu/bsmiu93.pfb
INPUT /usr/share/texmf/fonts/type1/arphic/bsmiu/bsmiu95.pfb
INPUT /usr/share/texmf/fonts/type1/arphic/bsmiu/bsmiu96.pfb
INPUT /usr/share/texmf/fonts/type1/arphic/bsmiu/bsmiu97.pfb
INPUT /usr/share/texmf/fonts/type1/arphic/bsmiu/bsmiu98.pfb
INPUT /usr/share/texmf/fonts/type1/arphic/bsmiu/bsmiu9e.pfb
INPUT /usr/share/texlive/texmf-dist/fonts/type1/public/amsfonts/cm/cmbx12.pfb
INPUT /usr/share/texlive/texmf-dist/fonts/type1/public/amsfonts/cm/cmbx8.pfb
INPUT /usr/share/texlive/texmf-dist/fonts/type1/public/amsfonts/cm/cmex10.pfb
INPUT /usr/share/texlive/texmf-dist/fonts/type1/public/amsfonts/cm/cmmi10.pfb
INPUT /usr/share/texlive/texmf-dist/fonts/type1/public/amsfonts/cm/cmmi12.pfb
INPUT /usr/share/texlive/texmf-dist/fonts/type1/public/amsfonts/cm/cmmi5.pfb
INPUT /usr/share/texlive/texmf-dist/fonts/type1/public/amsfonts/cm/cmmi6.pfb
INPUT /usr/share/texlive/texmf-dist/fonts/type1/public/amsfonts/cm/cmmi7.pfb
INPUT /usr/share/texlive/texmf-dist/fonts/type1/public/amsfonts/cm/cmmi8.pfb
INPUT /usr/share/texlive/texmf-dist/fonts/type1/public/amsfonts/cm/cmr10.pfb
INPUT /usr/share/texlive/texmf-dist/fonts/type1/public/amsfonts/cm/cmr12.pfb
INPUT /usr/share/texlive/texmf-dist/fonts/type1/public/amsfonts/cm/cmr17.pfb
INPUT /usr/share/texlive/texmf-dist/fonts/type1/public/amsfonts/cm/cmr6.pfb
INPUT /usr/share/texlive/texmf-dist/fonts/type1/public/amsfonts/cm/cmr7.pfb
INPUT /usr/share/texlive/texmf-dist/fonts/type1/public/amsfonts/cm/cmr8.pfb
INPUT /usr/share/texlive/texmf-dist/fonts/type1/public/amsfonts/cm/cmss12.pfb
INPUT /usr/share/texlive/texmf-dist/fonts/type1/public/amsfonts/cm/cmsy10.pfb
INPUT /usr/share/texlive/texmf-dist/fonts/type1/public/amsfonts/cm/cmsy6.pfb
INPUT /usr/share/texlive/texmf-dist/fonts/type1/public/amsfonts/cm/cmsy7.pfb
INPUT /usr/share/texlive/texmf-dist/fonts/type1/public/amsfonts/cm/cmsy8.pfb
INPUT /usr/share/texlive/texmf-dist/fonts/type1/public/amsfonts/cm/cmti12.pfb
INPUT /usr/share/texlive/texmf-dist/fonts/type1/public/amsfonts/cm/cmtt12.pfb
INPUT /usr/share/texlive/texmf-dist/fonts/type1/public/amsfonts/latxfont/lasy10.pfb
